hbase-builds mailing list archives

Site index · List index
Message view « Date » · « Thread »
Top « Date » · « Thread »
From Apache Jenkins Server <jenk...@builds.apache.org>
Subject Build failed in Jenkins: HBase-0.94-security #510
Date Fri, 08 Aug 2014 03:08:47 GMT
See <https://builds.apache.org/job/HBase-0.94-security/510/changes>

Changes:

[apurtell] HBASE-11690 Backport HBASE-5934 (Add the ability for Performance Evaluation to
set the table compression) to 0.94

[apurtell] HBASE-11691 Backport HBASE-7156 (Add Data Block Encoding and -D opts to Performance
Evaluation) to 0.94

[apurtell] HBASE-11693 Backport HBASE-11026 (Provide option to filter out all rows in PerformanceEvaluation
tool) to 0.94

------------------------------------------
[...truncated 45806 lines...]
Forking command line: /bin/sh -c cd /x1/jenkins/jenkins-slave/workspace/HBase-0.94-security
&& /x1/jenkins/tools/java/jdk1.6.0_45-32/jre/bin/java -enableassertions -Xmx1900m
-Djava.security.egd=file:/dev/./urandom -jar /x1/jenkins/jenkins-slave/workspace/HBase-0.94-security/target/surefire/surefirebooter1790602661662345133.jar
/x1/jenkins/jenkins-slave/workspace/HBase-0.94-security/target/surefire/surefire6901395190174907749tmp
/x1/jenkins/jenkins-slave/workspace/HBase-0.94-security/target/surefire/surefire_1016196749298191209848tmp
Running org.apache.hadoop.hbase.regionserver.TestSplitLogWorker
Tests run: 5, Failures: 0, Errors: 0, Skipped: 0, Time elapsed: 20.442 sec
Forking command line: /bin/sh -c cd /x1/jenkins/jenkins-slave/workspace/HBase-0.94-security
&& /x1/jenkins/tools/java/jdk1.6.0_45-32/jre/bin/java -enableassertions -Xmx1900m
-Djava.security.egd=file:/dev/./urandom -jar /x1/jenkins/jenkins-slave/workspace/HBase-0.94-security/target/surefire/surefirebooter8727849012231775062.jar
/x1/jenkins/jenkins-slave/workspace/HBase-0.94-security/target/surefire/surefire6295386910496888477tmp
/x1/jenkins/jenkins-slave/workspace/HBase-0.94-security/target/surefire/surefire_1025051879554778445272tmp
Running org.apache.hadoop.hbase.regionserver.TestStoreScanner
Tests run: 16, Failures: 0, Errors: 0, Skipped: 0, Time elapsed: 0.192 sec
Forking command line: /bin/sh -c cd /x1/jenkins/jenkins-slave/workspace/HBase-0.94-security
&& /x1/jenkins/tools/java/jdk1.6.0_45-32/jre/bin/java -enableassertions -Xmx1900m
-Djava.security.egd=file:/dev/./urandom -jar /x1/jenkins/jenkins-slave/workspace/HBase-0.94-security/target/surefire/surefirebooter1659620550308663848.jar
/x1/jenkins/jenkins-slave/workspace/HBase-0.94-security/target/surefire/surefire3018306259726915244tmp
/x1/jenkins/jenkins-slave/workspace/HBase-0.94-security/target/surefire/surefire_1037453305687068983548tmp
Running org.apache.hadoop.hbase.regionserver.metrics.TestSchemaMetrics
Tests run: 6, Failures: 0, Errors: 0, Skipped: 0, Time elapsed: 26.387 sec
Forking command line: /bin/sh -c cd /x1/jenkins/jenkins-slave/workspace/HBase-0.94-security
&& /x1/jenkins/tools/java/jdk1.6.0_45-32/jre/bin/java -enableassertions -Xmx1900m
-Djava.security.egd=file:/dev/./urandom -jar /x1/jenkins/jenkins-slave/workspace/HBase-0.94-security/target/surefire/surefirebooter58387413464286669.jar
/x1/jenkins/jenkins-slave/workspace/HBase-0.94-security/target/surefire/surefire5995402212271198833tmp
/x1/jenkins/jenkins-slave/workspace/HBase-0.94-security/target/surefire/surefire_1045047855952641958581tmp
Running org.apache.hadoop.hbase.regionserver.TestStoreFileBlockCacheSummary
Tests run: 1, Failures: 0, Errors: 0, Skipped: 0, Time elapsed: 35.429 sec
Forking command line: /bin/sh -c cd /x1/jenkins/jenkins-slave/workspace/HBase-0.94-security
&& /x1/jenkins/tools/java/jdk1.6.0_45-32/jre/bin/java -enableassertions -Xmx1900m
-Djava.security.egd=file:/dev/./urandom -jar /x1/jenkins/jenkins-slave/workspace/HBase-0.94-security/target/surefire/surefirebooter5031560545336523066.jar
/x1/jenkins/jenkins-slave/workspace/HBase-0.94-security/target/surefire/surefire7097242379402864480tmp
/x1/jenkins/jenkins-slave/workspace/HBase-0.94-security/target/surefire/surefire_1058529750030747527591tmp
Running org.apache.hadoop.hbase.regionserver.TestMasterAddressManager
Tests run: 1, Failures: 0, Errors: 0, Skipped: 0, Time elapsed: 2.205 sec
Forking command line: /bin/sh -c cd /x1/jenkins/jenkins-slave/workspace/HBase-0.94-security
&& /x1/jenkins/tools/java/jdk1.6.0_45-32/jre/bin/java -enableassertions -Xmx1900m
-Djava.security.egd=file:/dev/./urandom -jar /x1/jenkins/jenkins-slave/workspace/HBase-0.94-security/target/surefire/surefirebooter5786609356349550980.jar
/x1/jenkins/jenkins-slave/workspace/HBase-0.94-security/target/surefire/surefire6271272406850297304tmp
/x1/jenkins/jenkins-slave/workspace/HBase-0.94-security/target/surefire/surefire_1067115889989337417425tmp
Running org.apache.hadoop.hbase.regionserver.TestMultiColumnScanner
Tests run: 12, Failures: 0, Errors: 0, Skipped: 0, Time elapsed: 66.296 sec
Forking command line: /bin/sh -c cd /x1/jenkins/jenkins-slave/workspace/HBase-0.94-security
&& /x1/jenkins/tools/java/jdk1.6.0_45-32/jre/bin/java -enableassertions -Xmx1900m
-Djava.security.egd=file:/dev/./urandom -jar /x1/jenkins/jenkins-slave/workspace/HBase-0.94-security/target/surefire/surefirebooter6057094635731971359.jar
/x1/jenkins/jenkins-slave/workspace/HBase-0.94-security/target/surefire/surefire4264667540997371432tmp
/x1/jenkins/jenkins-slave/workspace/HBase-0.94-security/target/surefire/surefire_1076206345785577280390tmp
Running org.apache.hadoop.hbase.regionserver.TestHRegion
Tests run: 75, Failures: 0, Errors: 0, Skipped: 0, Time elapsed: 126.94 sec
Forking command line: /bin/sh -c cd /x1/jenkins/jenkins-slave/workspace/HBase-0.94-security
&& /x1/jenkins/tools/java/jdk1.6.0_45-32/jre/bin/java -enableassertions -Xmx1900m
-Djava.security.egd=file:/dev/./urandom -jar /x1/jenkins/jenkins-slave/workspace/HBase-0.94-security/target/surefire/surefirebooter4994134334596478027.jar
/x1/jenkins/jenkins-slave/workspace/HBase-0.94-security/target/surefire/surefire3509510477592609967tmp
/x1/jenkins/jenkins-slave/workspace/HBase-0.94-security/target/surefire/surefire_1086375498105497986699tmp
Running org.apache.hadoop.hbase.TestLocalHBaseCluster
Tests run: 1, Failures: 0, Errors: 0, Skipped: 0, Time elapsed: 16.239 sec
Forking command line: /bin/sh -c cd /x1/jenkins/jenkins-slave/workspace/HBase-0.94-security
&& /x1/jenkins/tools/java/jdk1.6.0_45-32/jre/bin/java -enableassertions -Xmx1900m
-Djava.security.egd=file:/dev/./urandom -jar /x1/jenkins/jenkins-slave/workspace/HBase-0.94-security/target/surefire/surefirebooter401977610866416844.jar
/x1/jenkins/jenkins-slave/workspace/HBase-0.94-security/target/surefire/surefire8439972342662856427tmp
/x1/jenkins/jenkins-slave/workspace/HBase-0.94-security/target/surefire/surefire_1092449715731173986507tmp
Running org.apache.hadoop.hbase.ipc.TestDelayedRpc
Tests run: 4, Failures: 0, Errors: 0, Skipped: 0, Time elapsed: 4.642 sec
Forking command line: /bin/sh -c cd /x1/jenkins/jenkins-slave/workspace/HBase-0.94-security
&& /x1/jenkins/tools/java/jdk1.6.0_45-32/jre/bin/java -enableassertions -Xmx1900m
-Djava.security.egd=file:/dev/./urandom -jar /x1/jenkins/jenkins-slave/workspace/HBase-0.94-security/target/surefire/surefirebooter4786540459253164556.jar
/x1/jenkins/jenkins-slave/workspace/HBase-0.94-security/target/surefire/surefire8911920045254956912tmp
/x1/jenkins/jenkins-slave/workspace/HBase-0.94-security/target/surefire/surefire_1108114046821547295190tmp
Running org.apache.hadoop.hbase.ipc.TestPBOnWritableRpc
Tests run: 1, Failures: 0, Errors: 0, Skipped: 0, Time elapsed: 2.039 sec
Forking command line: /bin/sh -c cd /x1/jenkins/jenkins-slave/workspace/HBase-0.94-security
&& /x1/jenkins/tools/java/jdk1.6.0_45-32/jre/bin/java -enableassertions -Xmx1900m
-Djava.security.egd=file:/dev/./urandom -jar /x1/jenkins/jenkins-slave/workspace/HBase-0.94-security/target/surefire/surefirebooter6594089138195384917.jar
/x1/jenkins/jenkins-slave/workspace/HBase-0.94-security/target/surefire/surefire3375195807534837889tmp
/x1/jenkins/jenkins-slave/workspace/HBase-0.94-security/target/surefire/surefire_111611193972012874801tmp
Running org.apache.hadoop.hbase.TestGlobalMemStoreSize
Tests run: 1, Failures: 0, Errors: 0, Skipped: 0, Time elapsed: 47.804 sec
Forking command line: /bin/sh -c cd /x1/jenkins/jenkins-slave/workspace/HBase-0.94-security
&& /x1/jenkins/tools/java/jdk1.6.0_45-32/jre/bin/java -enableassertions -Xmx1900m
-Djava.security.egd=file:/dev/./urandom -jar /x1/jenkins/jenkins-slave/workspace/HBase-0.94-security/target/surefire/surefirebooter2984165738963659036.jar
/x1/jenkins/jenkins-slave/workspace/HBase-0.94-security/target/surefire/surefire7765502480065065689tmp
/x1/jenkins/jenkins-slave/workspace/HBase-0.94-security/target/surefire/surefire_1125486775233786891499tmp
Running org.apache.hadoop.hbase.constraint.TestConstraint
Tests run: 5, Failures: 0, Errors: 0, Skipped: 0, Time elapsed: 53.298 sec
Forking command line: /bin/sh -c cd /x1/jenkins/jenkins-slave/workspace/HBase-0.94-security
&& /x1/jenkins/tools/java/jdk1.6.0_45-32/jre/bin/java -enableassertions -Xmx1900m
-Djava.security.egd=file:/dev/./urandom -jar /x1/jenkins/jenkins-slave/workspace/HBase-0.94-security/target/surefire/surefirebooter5566084466158565047.jar
/x1/jenkins/jenkins-slave/workspace/HBase-0.94-security/target/surefire/surefire2537597771815512526tmp
/x1/jenkins/jenkins-slave/workspace/HBase-0.94-security/target/surefire/surefire_113626492466708905250tmp
Running org.apache.hadoop.hbase.backup.TestHFileArchiving
Tests run: 5, Failures: 0, Errors: 0, Skipped: 0, Time elapsed: 212.639 sec
Forking command line: /bin/sh -c cd /x1/jenkins/jenkins-slave/workspace/HBase-0.94-security
&& /x1/jenkins/tools/java/jdk1.6.0_45-32/jre/bin/java -enableassertions -Xmx1900m
-Djava.security.egd=file:/dev/./urandom -jar /x1/jenkins/jenkins-slave/workspace/HBase-0.94-security/target/surefire/surefirebooter3597126505570592080.jar
/x1/jenkins/jenkins-slave/workspace/HBase-0.94-security/target/surefire/surefire4761365798819774674tmp
/x1/jenkins/jenkins-slave/workspace/HBase-0.94-security/target/surefire/surefire_1148560237235270931188tmp
Running org.apache.hadoop.hbase.rest.TestSchemaResource
Tests run: 2, Failures: 0, Errors: 0, Skipped: 0, Time elapsed: 40.198 sec
Forking command line: /bin/sh -c cd /x1/jenkins/jenkins-slave/workspace/HBase-0.94-security
&& /x1/jenkins/tools/java/jdk1.6.0_45-32/jre/bin/java -enableassertions -Xmx1900m
-Djava.security.egd=file:/dev/./urandom -jar /x1/jenkins/jenkins-slave/workspace/HBase-0.94-security/target/surefire/surefirebooter796408067432474718.jar
/x1/jenkins/jenkins-slave/workspace/HBase-0.94-security/target/surefire/surefire6815558186807255541tmp
/x1/jenkins/jenkins-slave/workspace/HBase-0.94-security/target/surefire/surefire_1154788483998030017369tmp
Running org.apache.hadoop.hbase.rest.client.TestRemoteAdmin
Tests run: 5, Failures: 0, Errors: 0, Skipped: 0, Time elapsed: 37.321 sec
Forking command line: /bin/sh -c cd /x1/jenkins/jenkins-slave/workspace/HBase-0.94-security
&& /x1/jenkins/tools/java/jdk1.6.0_45-32/jre/bin/java -enableassertions -Xmx1900m
-Djava.security.egd=file:/dev/./urandom -jar /x1/jenkins/jenkins-slave/workspace/HBase-0.94-security/target/surefire/surefirebooter115746199246189680.jar
/x1/jenkins/jenkins-slave/workspace/HBase-0.94-security/target/surefire/surefire9165104389802948341tmp
/x1/jenkins/jenkins-slave/workspace/HBase-0.94-security/target/surefire/surefire_1165466577639616898995tmp
Running org.apache.hadoop.hbase.rest.TestTableResource
Tests run: 8, Failures: 0, Errors: 0, Skipped: 0, Time elapsed: 72.073 sec
Running org.apache.hadoop.hbase.rest.client.TestRemoteTable
Tests run: 9, Failures: 0, Errors: 0, Skipped: 0, Time elapsed: 79.76 sec
Forking command line: /bin/sh -c cd /x1/jenkins/jenkins-slave/workspace/HBase-0.94-security
&& /x1/jenkins/tools/java/jdk1.6.0_45-32/jre/bin/java -enableassertions -Xmx1900m
-Djava.security.egd=file:/dev/./urandom -jar /x1/jenkins/jenkins-slave/workspace/HBase-0.94-security/target/surefire/surefirebooter2052739544757019449.jar
/x1/jenkins/jenkins-slave/workspace/HBase-0.94-security/target/surefire/surefire5754398286985382574tmp
/x1/jenkins/jenkins-slave/workspace/HBase-0.94-security/target/surefire/surefire_1179099804542327828826tmp
Forking command line: /bin/sh -c cd /x1/jenkins/jenkins-slave/workspace/HBase-0.94-security
&& /x1/jenkins/tools/java/jdk1.6.0_45-32/jre/bin/java -enableassertions -Xmx1900m
-Djava.security.egd=file:/dev/./urandom -jar /x1/jenkins/jenkins-slave/workspace/HBase-0.94-security/target/surefire/surefirebooter4263577302507017231.jar
/x1/jenkins/jenkins-slave/workspace/HBase-0.94-security/target/surefire/surefire3192246537652516867tmp
/x1/jenkins/jenkins-slave/workspace/HBase-0.94-security/target/surefire/surefire_1183602724764258764896tmp
Running org.apache.hadoop.hbase.rest.TestMultiRowResource
Tests run: 3, Failures: 0, Errors: 0, Skipped: 0, Time elapsed: 33.02 sec
Running org.apache.hadoop.hbase.rest.TestGzipFilter
Forking command line: /bin/sh -c cd /x1/jenkins/jenkins-slave/workspace/HBase-0.94-security
&& /x1/jenkins/tools/java/jdk1.6.0_45-32/jre/bin/java -enableassertions -Xmx1900m
-Djava.security.egd=file:/dev/./urandom -jar /x1/jenkins/jenkins-slave/workspace/HBase-0.94-security/target/surefire/surefirebooter1779240516576954293.jar
/x1/jenkins/jenkins-slave/workspace/HBase-0.94-security/target/surefire/surefire3129483295008829382tmp
/x1/jenkins/jenkins-slave/workspace/HBase-0.94-security/target/surefire/surefire_1194849130385308712538tmp
Tests run: 2, Failures: 0, Errors: 0, Skipped: 0, Time elapsed: 33.23 sec
Forking command line: /bin/sh -c cd /x1/jenkins/jenkins-slave/workspace/HBase-0.94-security
&& /x1/jenkins/tools/java/jdk1.6.0_45-32/jre/bin/java -enableassertions -Xmx1900m
-Djava.security.egd=file:/dev/./urandom -jar /x1/jenkins/jenkins-slave/workspace/HBase-0.94-security/target/surefire/surefirebooter2896954613045581102.jar
/x1/jenkins/jenkins-slave/workspace/HBase-0.94-security/target/surefire/surefire1133557079018513344tmp
/x1/jenkins/jenkins-slave/workspace/HBase-0.94-security/target/surefire/surefire_1204629472349731382411tmp
Running org.apache.hadoop.hbase.rest.TestRowResource
Tests run: 12, Failures: 0, Errors: 0, Skipped: 0, Time elapsed: 43.333 sec
Forking command line: /bin/sh -c cd /x1/jenkins/jenkins-slave/workspace/HBase-0.94-security
&& /x1/jenkins/tools/java/jdk1.6.0_45-32/jre/bin/java -enableassertions -Xmx1900m
-Djava.security.egd=file:/dev/./urandom -jar /x1/jenkins/jenkins-slave/workspace/HBase-0.94-security/target/surefire/surefirebooter2317641623160335467.jar
/x1/jenkins/jenkins-slave/workspace/HBase-0.94-security/target/surefire/surefire4048780528166354666tmp
/x1/jenkins/jenkins-slave/workspace/HBase-0.94-security/target/surefire/surefire_1216603495577700553158tmp
Running org.apache.hadoop.hbase.rest.TestVersionResource
Tests run: 7, Failures: 0, Errors: 0, Skipped: 0, Time elapsed: 26.645 sec
Forking command line: /bin/sh -c cd /x1/jenkins/jenkins-slave/workspace/HBase-0.94-security
&& /x1/jenkins/tools/java/jdk1.6.0_45-32/jre/bin/java -enableassertions -Xmx1900m
-Djava.security.egd=file:/dev/./urandom -jar /x1/jenkins/jenkins-slave/workspace/HBase-0.94-security/target/surefire/surefirebooter3221840925020111744.jar
/x1/jenkins/jenkins-slave/workspace/HBase-0.94-security/target/surefire/surefire3206164018056719373tmp
/x1/jenkins/jenkins-slave/workspace/HBase-0.94-security/target/surefire/surefire_1226193078569295752304tmp
Running org.apache.hadoop.hbase.rest.TestStatusResource
Tests run: 2, Failures: 0, Errors: 0, Skipped: 0, Time elapsed: 26.118 sec
Forking command line: /bin/sh -c cd /x1/jenkins/jenkins-slave/workspace/HBase-0.94-security
&& /x1/jenkins/tools/java/jdk1.6.0_45-32/jre/bin/java -enableassertions -Xmx1900m
-Djava.security.egd=file:/dev/./urandom -jar /x1/jenkins/jenkins-slave/workspace/HBase-0.94-security/target/surefire/surefirebooter6743971855493148149.jar
/x1/jenkins/jenkins-slave/workspace/HBase-0.94-security/target/surefire/surefire8919402417560980281tmp
/x1/jenkins/jenkins-slave/workspace/HBase-0.94-security/target/surefire/surefire_1234213428555004256385tmp
Running org.apache.hadoop.hbase.rest.TestGZIPResponseWrapper
Tests run: 5, Failures: 0, Errors: 0, Skipped: 0, Time elapsed: 0.432 sec
Forking command line: /bin/sh -c cd /x1/jenkins/jenkins-slave/workspace/HBase-0.94-security
&& /x1/jenkins/tools/java/jdk1.6.0_45-32/jre/bin/java -enableassertions -Xmx1900m
-Djava.security.egd=file:/dev/./urandom -jar /x1/jenkins/jenkins-slave/workspace/HBase-0.94-security/target/surefire/surefirebooter6954355130487941280.jar
/x1/jenkins/jenkins-slave/workspace/HBase-0.94-security/target/surefire/surefire485969735606157158tmp
/x1/jenkins/jenkins-slave/workspace/HBase-0.94-security/target/surefire/surefire_1245641993327241257247tmp
Running org.apache.hadoop.hbase.rest.TestScannerResource
Tests run: 5, Failures: 0, Errors: 0, Skipped: 0, Time elapsed: 119.071 sec
Forking command line: /bin/sh -c cd /x1/jenkins/jenkins-slave/workspace/HBase-0.94-security
&& /x1/jenkins/tools/java/jdk1.6.0_45-32/jre/bin/java -enableassertions -Xmx1900m
-Djava.security.egd=file:/dev/./urandom -jar /x1/jenkins/jenkins-slave/workspace/HBase-0.94-security/target/surefire/surefirebooter7156606895674251957.jar
/x1/jenkins/jenkins-slave/workspace/HBase-0.94-security/target/surefire/surefire6872926552965473583tmp
/x1/jenkins/jenkins-slave/workspace/HBase-0.94-security/target/surefire/surefire_125130555491246402129tmp
Running org.apache.hadoop.hbase.rest.TestScannersWithFilters
Tests run: 10, Failures: 0, Errors: 0, Skipped: 0, Time elapsed: 44.165 sec
Forking command line: /bin/sh -c cd /x1/jenkins/jenkins-slave/workspace/HBase-0.94-security
&& /x1/jenkins/tools/java/jdk1.6.0_45-32/jre/bin/java -enableassertions -Xmx1900m
-Djava.security.egd=file:/dev/./urandom -jar /x1/jenkins/jenkins-slave/workspace/HBase-0.94-security/target/surefire/surefirebooter2977923983323232977.jar
/x1/jenkins/jenkins-slave/workspace/HBase-0.94-security/target/surefire/surefire1399737025755919440tmp
/x1/jenkins/jenkins-slave/workspace/HBase-0.94-security/target/surefire/surefire_1269015473680834758453tmp
Running org.apache.hadoop.hbase.metrics.TestMetricsMBeanBase
Tests run: 3, Failures: 0, Errors: 0, Skipped: 0, Time elapsed: 1.535 sec
Forking command line: /bin/sh -c cd /x1/jenkins/jenkins-slave/workspace/HBase-0.94-security
&& /x1/jenkins/tools/java/jdk1.6.0_45-32/jre/bin/java -enableassertions -Xmx1900m
-Djava.security.egd=file:/dev/./urandom -jar /x1/jenkins/jenkins-slave/workspace/HBase-0.94-security/target/surefire/surefirebooter3523625214553342648.jar
/x1/jenkins/jenkins-slave/workspace/HBase-0.94-security/target/surefire/surefire1673542875845237405tmp
/x1/jenkins/jenkins-slave/workspace/HBase-0.94-security/target/surefire/surefire_1278045935895528759074tmp
Running org.apache.hadoop.hbase.TestHBaseFileSystem
Tests run: 2, Failures: 0, Errors: 0, Skipped: 0, Time elapsed: 29.963 sec
Forking command line: /bin/sh -c cd /x1/jenkins/jenkins-slave/workspace/HBase-0.94-security
&& /x1/jenkins/tools/java/jdk1.6.0_45-32/jre/bin/java -enableassertions -Xmx1900m
-Djava.security.egd=file:/dev/./urandom -jar /x1/jenkins/jenkins-slave/workspace/HBase-0.94-security/target/surefire/surefirebooter7189292770683420010.jar
/x1/jenkins/jenkins-slave/workspace/HBase-0.94-security/target/surefire/surefire4882442410626568131tmp
/x1/jenkins/jenkins-slave/workspace/HBase-0.94-security/target/surefire/surefire_1284514077212158062195tmp
Running org.apache.hadoop.hbase.io.hfile.TestHFileSeek
Tests run: 1, Failures: 0, Errors: 0, Skipped: 0, Time elapsed: 8.183 sec
Forking command line: /bin/sh -c cd /x1/jenkins/jenkins-slave/workspace/HBase-0.94-security
&& /x1/jenkins/tools/java/jdk1.6.0_45-32/jre/bin/java -enableassertions -Xmx1900m
-Djava.security.egd=file:/dev/./urandom -jar /x1/jenkins/jenkins-slave/workspace/HBase-0.94-security/target/surefire/surefirebooter5114110848560860765.jar
/x1/jenkins/jenkins-slave/workspace/HBase-0.94-security/target/surefire/surefire1138722747523596712tmp
/x1/jenkins/jenkins-slave/workspace/HBase-0.94-security/target/surefire/surefire_1293357987725769765699tmp
Running org.apache.hadoop.hbase.io.hfile.TestLruBlockCache
Tests run: 16, Failures: 0, Errors: 0, Skipped: 0, Time elapsed: 2.188 sec
Forking command line: /bin/sh -c cd /x1/jenkins/jenkins-slave/workspace/HBase-0.94-security
&& /x1/jenkins/tools/java/jdk1.6.0_45-32/jre/bin/java -enableassertions -Xmx1900m
-Djava.security.egd=file:/dev/./urandom -jar /x1/jenkins/jenkins-slave/workspace/HBase-0.94-security/target/surefire/surefirebooter4608058622401995546.jar
/x1/jenkins/jenkins-slave/workspace/HBase-0.94-security/target/surefire/surefire7932300072310373427tmp
/x1/jenkins/jenkins-slave/workspace/HBase-0.94-security/target/surefire/surefire_1304560646440675942694tmp
Running org.apache.hadoop.hbase.io.hfile.TestHFileBlockIndex
Tests run: 10, Failures: 0, Errors: 0, Skipped: 0, Time elapsed: 20.366 sec
Forking command line: /bin/sh -c cd /x1/jenkins/jenkins-slave/workspace/HBase-0.94-security
&& /x1/jenkins/tools/java/jdk1.6.0_45-32/jre/bin/java -enableassertions -Xmx1900m
-Djava.security.egd=file:/dev/./urandom -jar /x1/jenkins/jenkins-slave/workspace/HBase-0.94-security/target/surefire/surefirebooter1096640610228089179.jar
/x1/jenkins/jenkins-slave/workspace/HBase-0.94-security/target/surefire/surefire7859535398560562480tmp
/x1/jenkins/jenkins-slave/workspace/HBase-0.94-security/target/surefire/surefire_1315752185428714968431tmp
Running org.apache.hadoop.hbase.io.hfile.TestFixedFileTrailer
Tests run: 2, Failures: 0, Errors: 0, Skipped: 0, Time elapsed: 2.044 sec
Forking command line: /bin/sh -c cd /x1/jenkins/jenkins-slave/workspace/HBase-0.94-security
&& /x1/jenkins/tools/java/jdk1.6.0_45-32/jre/bin/java -enableassertions -Xmx1900m
-Djava.security.egd=file:/dev/./urandom -jar /x1/jenkins/jenkins-slave/workspace/HBase-0.94-security/target/surefire/surefirebooter892532556489633791.jar
/x1/jenkins/jenkins-slave/workspace/HBase-0.94-security/target/surefire/surefire5108850271082287808tmp
/x1/jenkins/jenkins-slave/workspace/HBase-0.94-security/target/surefire/surefire_1327306551298468852527tmp
Running org.apache.hadoop.hbase.io.hfile.TestHFilePerformance
Tests run: 1, Failures: 0, Errors: 0, Skipped: 0, Time elapsed: 7.4 sec
Forking command line: /bin/sh -c cd /x1/jenkins/jenkins-slave/workspace/HBase-0.94-security
&& /x1/jenkins/tools/java/jdk1.6.0_45-32/jre/bin/java -enableassertions -Xmx1900m
-Djava.security.egd=file:/dev/./urandom -jar /x1/jenkins/jenkins-slave/workspace/HBase-0.94-security/target/surefire/surefirebooter6625581608425865571.jar
/x1/jenkins/jenkins-slave/workspace/HBase-0.94-security/target/surefire/surefire6505128558538378862tmp
/x1/jenkins/jenkins-slave/workspace/HBase-0.94-security/target/surefire/surefire_1335489281757931341257tmp
Running org.apache.hadoop.hbase.io.hfile.TestHFileBlockCompatibility
Tests run: 10, Failures: 0, Errors: 0, Skipped: 0, Time elapsed: 2.89 sec
Forking command line: /bin/sh -c cd /x1/jenkins/jenkins-slave/workspace/HBase-0.94-security
&& /x1/jenkins/tools/java/jdk1.6.0_45-32/jre/bin/java -enableassertions -Xmx1900m
-Djava.security.egd=file:/dev/./urandom -jar /x1/jenkins/jenkins-slave/workspace/HBase-0.94-security/target/surefire/surefirebooter2980446383169766291.jar
/x1/jenkins/jenkins-slave/workspace/HBase-0.94-security/target/surefire/surefire4684508224135148691tmp
/x1/jenkins/jenkins-slave/workspace/HBase-0.94-security/target/surefire/surefire_1342874542177307306979tmp
Running org.apache.hadoop.hbase.io.hfile.TestCacheOnWrite
Tests run: 36, Failures: 0, Errors: 0, Skipped: 0, Time elapsed: 54.012 sec
Forking command line: /bin/sh -c cd /x1/jenkins/jenkins-slave/workspace/HBase-0.94-security
&& /x1/jenkins/tools/java/jdk1.6.0_45-32/jre/bin/java -enableassertions -Xmx1900m
-Djava.security.egd=file:/dev/./urandom -jar /x1/jenkins/jenkins-slave/workspace/HBase-0.94-security/target/surefire/surefirebooter2193480209978485965.jar
/x1/jenkins/jenkins-slave/workspace/HBase-0.94-security/target/surefire/surefire8148063452770269996tmp
/x1/jenkins/jenkins-slave/workspace/HBase-0.94-security/target/surefire/surefire_1356275342060460845809tmp
Running org.apache.hadoop.hbase.io.hfile.TestChecksum
Tests run: 3, Failures: 0, Errors: 0, Skipped: 0, Time elapsed: 2.388 sec
Forking command line: /bin/sh -c cd /x1/jenkins/jenkins-slave/workspace/HBase-0.94-security
&& /x1/jenkins/tools/java/jdk1.6.0_45-32/jre/bin/java -enableassertions -Xmx1900m
-Djava.security.egd=file:/dev/./urandom -jar /x1/jenkins/jenkins-slave/workspace/HBase-0.94-security/target/surefire/surefirebooter3145914329274581817.jar
/x1/jenkins/jenkins-slave/workspace/HBase-0.94-security/target/surefire/surefire6219896586330498360tmp
/x1/jenkins/jenkins-slave/workspace/HBase-0.94-security/target/surefire/surefire_1365350209210478472577tmp
Running org.apache.hadoop.hbase.io.hfile.TestForceCacheImportantBlocks
Tests run: 6, Failures: 0, Errors: 0, Skipped: 0, Time elapsed: 133.77 sec
Forking command line: /bin/sh -c cd /x1/jenkins/jenkins-slave/workspace/HBase-0.94-security
&& /x1/jenkins/tools/java/jdk1.6.0_45-32/jre/bin/java -enableassertions -Xmx1900m
-Djava.security.egd=file:/dev/./urandom -jar /x1/jenkins/jenkins-slave/workspace/HBase-0.94-security/target/surefire/surefirebooter2480615875529862521.jar
/x1/jenkins/jenkins-slave/workspace/HBase-0.94-security/target/surefire/surefire6193879864849435707tmp
/x1/jenkins/jenkins-slave/workspace/HBase-0.94-security/target/surefire/surefire_1371580003155156543602tmp
Running org.apache.hadoop.hbase.io.hfile.TestHFileBlock
Tests run: 16, Failures: 0, Errors: 0, Skipped: 0, Time elapsed: 63.06 sec
Forking command line: /bin/sh -c cd /x1/jenkins/jenkins-slave/workspace/HBase-0.94-security
&& /x1/jenkins/tools/java/jdk1.6.0_45-32/jre/bin/java -enableassertions -Xmx1900m
-Djava.security.egd=file:/dev/./urandom -jar /x1/jenkins/jenkins-slave/workspace/HBase-0.94-security/target/surefire/surefirebooter8308964500807844542.jar
/x1/jenkins/jenkins-slave/workspace/HBase-0.94-security/target/surefire/surefire6734433966555688518tmp
/x1/jenkins/jenkins-slave/workspace/HBase-0.94-security/target/surefire/surefire_138612485269718867109tmp
Running org.apache.hadoop.hbase.io.hfile.slab.TestSlabCache
Tests run: 7, Failures: 0, Errors: 0, Skipped: 0, Time elapsed: 58.185 sec
Forking command line: /bin/sh -c cd /x1/jenkins/jenkins-slave/workspace/HBase-0.94-security
&& /x1/jenkins/tools/java/jdk1.6.0_45-32/jre/bin/java -enableassertions -Xmx1900m
-Djava.security.egd=file:/dev/./urandom -jar /x1/jenkins/jenkins-slave/workspace/HBase-0.94-security/target/surefire/surefirebooter7154374951614456810.jar
/x1/jenkins/jenkins-slave/workspace/HBase-0.94-security/target/surefire/surefire4354625808076762548tmp
/x1/jenkins/jenkins-slave/workspace/HBase-0.94-security/target/surefire/surefire_1397409501037414234887tmp
Running org.apache.hadoop.hbase.io.TestFileLink
Tests run: 3, Failures: 0, Errors: 0, Skipped: 0, Time elapsed: 33.601 sec
Forking command line: /bin/sh -c cd /x1/jenkins/jenkins-slave/workspace/HBase-0.94-security
&& /x1/jenkins/tools/java/jdk1.6.0_45-32/jre/bin/java -enableassertions -Xmx1900m
-Djava.security.egd=file:/dev/./urandom -jar /x1/jenkins/jenkins-slave/workspace/HBase-0.94-security/target/surefire/surefirebooter625096776937969331.jar
/x1/jenkins/jenkins-slave/workspace/HBase-0.94-security/target/surefire/surefire2168634062204358573tmp
/x1/jenkins/jenkins-slave/workspace/HBase-0.94-security/target/surefire/surefire_1405824869888986293094tmp
Running org.apache.hadoop.hbase.io.hfile.slab.TestSingleSizeCache
Tests run: 5, Failures: 0, Errors: 0, Skipped: 0, Time elapsed: 106.446 sec
Forking command line: /bin/sh -c cd /x1/jenkins/jenkins-slave/workspace/HBase-0.94-security
&& /x1/jenkins/tools/java/jdk1.6.0_45-32/jre/bin/java -enableassertions -Xmx1900m
-Djava.security.egd=file:/dev/./urandom -jar /x1/jenkins/jenkins-slave/workspace/HBase-0.94-security/target/surefire/surefirebooter8075571592601371737.jar
/x1/jenkins/jenkins-slave/workspace/HBase-0.94-security/target/surefire/surefire9185739341993028593tmp
/x1/jenkins/jenkins-slave/workspace/HBase-0.94-security/target/surefire/surefire_1417540865590746591800tmp
Running org.apache.hadoop.hbase.replication.TestReplicationZookeeper
Tests run: 1, Failures: 0, Errors: 0, Skipped: 0, Time elapsed: 2.18 sec
Forking command line: /bin/sh -c cd /x1/jenkins/jenkins-slave/workspace/HBase-0.94-security
&& /x1/jenkins/tools/java/jdk1.6.0_45-32/jre/bin/java -enableassertions -Xmx1900m
-Djava.security.egd=file:/dev/./urandom -jar /x1/jenkins/jenkins-slave/workspace/HBase-0.94-security/target/surefire/surefirebooter7411662548500932911.jar
/x1/jenkins/jenkins-slave/workspace/HBase-0.94-security/target/surefire/surefire7000714709340947113tmp
/x1/jenkins/jenkins-slave/workspace/HBase-0.94-security/target/surefire/surefire_1425830808708948226470tmp
Running org.apache.hadoop.hbase.io.encoding.TestLoadAndSwitchEncodeOnDisk
Tests run: 1, Failures: 0, Errors: 0, Skipped: 0, Time elapsed: 63.289 sec
Forking command line: /bin/sh -c cd /x1/jenkins/jenkins-slave/workspace/HBase-0.94-security
&& /x1/jenkins/tools/java/jdk1.6.0_45-32/jre/bin/java -enableassertions -Xmx1900m
-Djava.security.egd=file:/dev/./urandom -jar /x1/jenkins/jenkins-slave/workspace/HBase-0.94-security/target/surefire/surefirebooter170726678571638555.jar
/x1/jenkins/jenkins-slave/workspace/HBase-0.94-security/target/surefire/surefire5537461178502866801tmp
/x1/jenkins/jenkins-slave/workspace/HBase-0.94-security/target/surefire/surefire_143462564927233218366tmp
Running org.apache.hadoop.hbase.replication.regionserver.TestReplicationSink
Tests run: 5, Failures: 0, Errors: 0, Skipped: 0, Time elapsed: 42.482 sec
Forking command line: /bin/sh -c cd /x1/jenkins/jenkins-slave/workspace/HBase-0.94-security
&& /x1/jenkins/tools/java/jdk1.6.0_45-32/jre/bin/java -enableassertions -Xmx1900m
-Djava.security.egd=file:/dev/./urandom -jar /x1/jenkins/jenkins-slave/workspace/HBase-0.94-security/target/surefire/surefirebooter6990921423572194092.jar
/x1/jenkins/jenkins-slave/workspace/HBase-0.94-security/target/surefire/surefire2259747157147556641tmp
/x1/jenkins/jenkins-slave/workspace/HBase-0.94-security/target/surefire/surefire_1444049960504848081185tmp
Running org.apache.hadoop.hbase.replication.regionserver.TestReplicationSourceManager
Tests run: 3, Failures: 0, Errors: 0, Skipped: 0, Time elapsed: 6.334 sec
Forking command line: /bin/sh -c cd /x1/jenkins/jenkins-slave/workspace/HBase-0.94-security
&& /x1/jenkins/tools/java/jdk1.6.0_45-32/jre/bin/java -enableassertions -Xmx1900m
-Djava.security.egd=file:/dev/./urandom -jar /x1/jenkins/jenkins-slave/workspace/HBase-0.94-security/target/surefire/surefirebooter7401525165113742331.jar
/x1/jenkins/jenkins-slave/workspace/HBase-0.94-security/target/surefire/surefire6605375945317153032tmp
/x1/jenkins/jenkins-slave/workspace/HBase-0.94-security/target/surefire/surefire_1453414403293184995262tmp
Running org.apache.hadoop.hbase.util.TestFSTableDescriptors
Tests run: 11, Failures: 0, Errors: 0, Skipped: 0, Time elapsed: 2.334 sec
Forking command line: /bin/sh -c cd /x1/jenkins/jenkins-slave/workspace/HBase-0.94-security
&& /x1/jenkins/tools/java/jdk1.6.0_45-32/jre/bin/java -enableassertions -Xmx1900m
-Djava.security.egd=file:/dev/./urandom -jar /x1/jenkins/jenkins-slave/workspace/HBase-0.94-security/target/surefire/surefirebooter3945520709667605963.jar
/x1/jenkins/jenkins-slave/workspace/HBase-0.94-security/target/surefire/surefire8915007838747042283tmp
/x1/jenkins/jenkins-slave/workspace/HBase-0.94-security/target/surefire/surefire_1463120131749537021961tmp
Running org.apache.hadoop.hbase.replication.TestReplicationSource
Tests run: 1, Failures: 0, Errors: 0, Skipped: 0, Time elapsed: 10.153 sec
Forking command line: /bin/sh -c cd /x1/jenkins/jenkins-slave/workspace/HBase-0.94-security
&& /x1/jenkins/tools/java/jdk1.6.0_45-32/jre/bin/java -enableassertions -Xmx1900m
-Djava.security.egd=file:/dev/./urandom -jar /x1/jenkins/jenkins-slave/workspace/HBase-0.94-security/target/surefire/surefirebooter181568040765023782.jar
/x1/jenkins/jenkins-slave/workspace/HBase-0.94-security/target/surefire/surefire8415008482851586616tmp
/x1/jenkins/jenkins-slave/workspace/HBase-0.94-security/target/surefire/surefire_1472426395016999348397tmp
Running org.apache.hadoop.hbase.util.TestEnvironmentEdgeManager
Tests run: 2, Failures: 0, Errors: 0, Skipped: 0, Time elapsed: 1.065 sec
Forking command line: /bin/sh -c cd /x1/jenkins/jenkins-slave/workspace/HBase-0.94-security
&& /x1/jenkins/tools/java/jdk1.6.0_45-32/jre/bin/java -enableassertions -Xmx1900m
-Djava.security.egd=file:/dev/./urandom -jar /x1/jenkins/jenkins-slave/workspace/HBase-0.94-security/target/surefire/surefirebooter1770275518586507500.jar
/x1/jenkins/jenkins-slave/workspace/HBase-0.94-security/target/surefire/surefire9047168588684554234tmp
/x1/jenkins/jenkins-slave/workspace/HBase-0.94-security/target/surefire/surefire_1482798158693580339786tmp
Running org.apache.hadoop.hbase.util.TestIdLock
Tests run: 1, Failures: 0, Errors: 0, Skipped: 0, Time elapsed: 16.429 sec
Forking command line: /bin/sh -c cd /x1/jenkins/jenkins-slave/workspace/HBase-0.94-security
&& /x1/jenkins/tools/java/jdk1.6.0_45-32/jre/bin/java -enableassertions -Xmx1900m
-Djava.security.egd=file:/dev/./urandom -jar /x1/jenkins/jenkins-slave/workspace/HBase-0.94-security/target/surefire/surefirebooter4477644246515542570.jar
/x1/jenkins/jenkins-slave/workspace/HBase-0.94-security/target/surefire/surefire5252777751213937537tmp
/x1/jenkins/jenkins-slave/workspace/HBase-0.94-security/target/surefire/surefire_1492510834582974901091tmp
Running org.apache.hadoop.hbase.util.TestMergeTable
Tests run: 1, Failures: 0, Errors: 0, Skipped: 0, Time elapsed: 54.725 sec
Forking command line: /bin/sh -c cd /x1/jenkins/jenkins-slave/workspace/HBase-0.94-security
&& /x1/jenkins/tools/java/jdk1.6.0_45-32/jre/bin/java -enableassertions -Xmx1900m
-Djava.security.egd=file:/dev/./urandom -jar /x1/jenkins/jenkins-slave/workspace/HBase-0.94-security/target/surefire/surefirebooter4670430995450962984.jar
/x1/jenkins/jenkins-slave/workspace/HBase-0.94-security/target/surefire/surefire2792150861995631855tmp
/x1/jenkins/jenkins-slave/workspace/HBase-0.94-security/target/surefire/surefire_150971908448140928060tmp
Running org.apache.hadoop.hbase.util.TestFSUtils
Tests run: 4, Failures: 0, Errors: 0, Skipped: 0, Time elapsed: 48.604 sec
Running org.apache.hadoop.hbase.util.TestPoolMap$TestRoundRobinPoolType
Tests run: 3, Failures: 0, Errors: 0, Skipped: 0, Time elapsed: 0.183 sec
Running org.apache.hadoop.hbase.util.TestPoolMap$TestThreadLocalPoolType
Tests run: 3, Failures: 0, Errors: 0, Skipped: 0, Time elapsed: 0.174 sec
Running org.apache.hadoop.hbase.util.TestPoolMap$TestReusablePoolType
Tests run: 3, Failures: 0, Errors: 0, Skipped: 0, Time elapsed: 0.481 sec
Forking command line: /bin/sh -c cd /x1/jenkins/jenkins-slave/workspace/HBase-0.94-security
&& /x1/jenkins/tools/java/jdk1.6.0_45-32/jre/bin/java -enableassertions -Xmx1900m
-Djava.security.egd=file:/dev/./urandom -jar /x1/jenkins/jenkins-slave/workspace/HBase-0.94-security/target/surefire/surefirebooter7647175670789592536.jar
/x1/jenkins/jenkins-slave/workspace/HBase-0.94-security/target/surefire/surefire2144231244796813634tmp
/x1/jenkins/jenkins-slave/workspace/HBase-0.94-security/target/surefire/surefire_1512226630575808401715tmp
Forking command line: /bin/sh -c cd /x1/jenkins/jenkins-slave/workspace/HBase-0.94-security
&& /x1/jenkins/tools/java/jdk1.6.0_45-32/jre/bin/java -enableassertions -Xmx1900m
-Djava.security.egd=file:/dev/./urandom -jar /x1/jenkins/jenkins-slave/workspace/HBase-0.94-security/target/surefire/surefirebooter5898391834385990432.jar
/x1/jenkins/jenkins-slave/workspace/HBase-0.94-security/target/surefire/surefire4834453855853077961tmp
/x1/jenkins/jenkins-slave/workspace/HBase-0.94-security/target/surefire/surefire_1524736754706855472332tmp
Running org.apache.hadoop.hbase.util.TestCoprocessorScanPolicy
Tests run: 2, Failures: 0, Errors: 0, Skipped: 0, Time elapsed: 33.518 sec
Forking command line: /bin/sh -c cd /x1/jenkins/jenkins-slave/workspace/HBase-0.94-security
&& /x1/jenkins/tools/java/jdk1.6.0_45-32/jre/bin/java -enableassertions -Xmx1900m
-Djava.security.egd=file:/dev/./urandom -jar /x1/jenkins/jenkins-slave/workspace/HBase-0.94-security/target/surefire/surefirebooter4101460519195655819.jar
/x1/jenkins/jenkins-slave/workspace/HBase-0.94-security/target/surefire/surefire8807393996291773099tmp
/x1/jenkins/jenkins-slave/workspace/HBase-0.94-security/target/surefire/surefire_1533307597262493023316tmp
Running org.apache.hadoop.hbase.util.TestRegionSplitter
Tests run: 5, Failures: 0, Errors: 0, Skipped: 0, Time elapsed: 37.089 sec
Forking command line: /bin/sh -c cd /x1/jenkins/jenkins-slave/workspace/HBase-0.94-security
&& /x1/jenkins/tools/java/jdk1.6.0_45-32/jre/bin/java -enableassertions -Xmx1900m
-Djava.security.egd=file:/dev/./urandom -jar /x1/jenkins/jenkins-slave/workspace/HBase-0.94-security/target/surefire/surefirebooter6219226005169271846.jar
/x1/jenkins/jenkins-slave/workspace/HBase-0.94-security/target/surefire/surefire5811210540803650453tmp
/x1/jenkins/jenkins-slave/workspace/HBase-0.94-security/target/surefire/surefire_1541366028793710379876tmp
Running org.apache.hadoop.hbase.util.TestFSVisitor
Tests run: 3, Failures: 0, Errors: 0, Skipped: 0, Time elapsed: 3.202 sec
Forking command line: /bin/sh -c cd /x1/jenkins/jenkins-slave/workspace/HBase-0.94-security
&& /x1/jenkins/tools/java/jdk1.6.0_45-32/jre/bin/java -enableassertions -Xmx1900m
-Djava.security.egd=file:/dev/./urandom -jar /x1/jenkins/jenkins-slave/workspace/HBase-0.94-security/target/surefire/surefirebooter7900405243381802207.jar
/x1/jenkins/jenkins-slave/workspace/HBase-0.94-security/target/surefire/surefire9091192339878155700tmp
/x1/jenkins/jenkins-slave/workspace/HBase-0.94-security/target/surefire/surefire_155616453611224076573tmp
Running org.apache.hadoop.hbase.util.hbck.TestOfflineMetaRebuildOverlap
Tests run: 1, Failures: 0, Errors: 0, Skipped: 0, Time elapsed: 70.928 sec
Forking command line: /bin/sh -c cd /x1/jenkins/jenkins-slave/workspace/HBase-0.94-security
&& /x1/jenkins/tools/java/jdk1.6.0_45-32/jre/bin/java -enableassertions -Xmx1900m
-Djava.security.egd=file:/dev/./urandom -jar /x1/jenkins/jenkins-slave/workspace/HBase-0.94-security/target/surefire/surefirebooter6106709573565839329.jar
/x1/jenkins/jenkins-slave/workspace/HBase-0.94-security/target/surefire/surefire7514551038927611232tmp
/x1/jenkins/jenkins-slave/workspace/HBase-0.94-security/target/surefire/surefire_156299989412099927508tmp
Running org.apache.hadoop.hbase.util.hbck.TestOfflineMetaRebuildBase
Tests run: 1, Failures: 0, Errors: 0, Skipped: 0, Time elapsed: 73.285 sec
Forking command line: /bin/sh -c cd /x1/jenkins/jenkins-slave/workspace/HBase-0.94-security
&& /x1/jenkins/tools/java/jdk1.6.0_45-32/jre/bin/java -enableassertions -Xmx1900m
-Djava.security.egd=file:/dev/./urandom -jar /x1/jenkins/jenkins-slave/workspace/HBase-0.94-security/target/surefire/surefirebooter167156480084191133.jar
/x1/jenkins/jenkins-slave/workspace/HBase-0.94-security/target/surefire/surefire6438546554455670785tmp
/x1/jenkins/jenkins-slave/workspace/HBase-0.94-security/target/surefire/surefire_1572648898947005728099tmp
Running org.apache.hadoop.hbase.util.TestDefaultEnvironmentEdge
Tests run: 1, Failures: 0, Errors: 0, Skipped: 0, Time elapsed: 0.472 sec
Forking command line: /bin/sh -c cd /x1/jenkins/jenkins-slave/workspace/HBase-0.94-security
&& /x1/jenkins/tools/java/jdk1.6.0_45-32/jre/bin/java -enableassertions -Xmx1900m
-Djava.security.egd=file:/dev/./urandom -jar /x1/jenkins/jenkins-slave/workspace/HBase-0.94-security/target/surefire/surefirebooter4235660282380309107.jar
/x1/jenkins/jenkins-slave/workspace/HBase-0.94-security/target/surefire/surefire1470488271817131793tmp
/x1/jenkins/jenkins-slave/workspace/HBase-0.94-security/target/surefire/surefire_1585454703261964482849tmp
Running org.apache.hadoop.hbase.util.TestFSHDFSUtils
Tests run: 3, Failures: 0, Errors: 0, Skipped: 0, Time elapsed: 4.82 sec
Forking command line: /bin/sh -c cd /x1/jenkins/jenkins-slave/workspace/HBase-0.94-security
&& /x1/jenkins/tools/java/jdk1.6.0_45-32/jre/bin/java -enableassertions -Xmx1900m
-Djava.security.egd=file:/dev/./urandom -jar /x1/jenkins/jenkins-slave/workspace/HBase-0.94-security/target/surefire/surefirebooter7482399920370539195.jar
/x1/jenkins/jenkins-slave/workspace/HBase-0.94-security/target/surefire/surefire7723757633665558429tmp
/x1/jenkins/jenkins-slave/workspace/HBase-0.94-security/target/surefire/surefire_1592571772939600683208tmp
Running org.apache.hadoop.hbase.util.hbck.TestOfflineMetaRebuildHole
Tests run: 1, Failures: 0, Errors: 0, Skipped: 0, Time elapsed: 68.471 sec
Forking command line: /bin/sh -c cd /x1/jenkins/jenkins-slave/workspace/HBase-0.94-security
&& /x1/jenkins/tools/java/jdk1.6.0_45-32/jre/bin/java -enableassertions -Xmx1900m
-Djava.security.egd=file:/dev/./urandom -jar /x1/jenkins/jenkins-slave/workspace/HBase-0.94-security/target/surefire/surefirebooter316416354809193055.jar
/x1/jenkins/jenkins-slave/workspace/HBase-0.94-security/target/surefire/surefire436846749030825399tmp
/x1/jenkins/jenkins-slave/workspace/HBase-0.94-security/target/surefire/surefire_1601599959179538452386tmp
Running org.apache.hadoop.hbase.TestInfoServers
Tests run: 3, Failures: 0, Errors: 0, Skipped: 0, Time elapsed: 32.879 sec

Results :

Tests run: 922, Failures: 0, Errors: 0, Skipped: 2

[INFO] ------------------------------------------------------------------------
[INFO] BUILD FAILURE
[INFO] ------------------------------------------------------------------------
[INFO] Total time: 1:31:57.398s
[INFO] Finished at: Fri Aug 08 03:06:46 UTC 2014
[INFO] Final Memory: 66M/1085M
[INFO] ------------------------------------------------------------------------
[ERROR] Failed to execute goal org.apache.maven.plugins:maven-surefire-plugin:2.12-TRUNK-HBASE-2:test
(secondPartTestsExecution) on project hbase: Failure or timeout -> [Help 1]
org.apache.maven.lifecycle.LifecycleExecutionException: Failed to execute goal org.apache.maven.plugins:maven-surefire-plugin:2.12-TRUNK-HBASE-2:test
(secondPartTestsExecution) on project hbase: Failure or timeout
	at org.apache.maven.lifecycle.internal.MojoExecutor.execute(MojoExecutor.java:217)
	at org.apache.maven.lifecycle.internal.MojoExecutor.execute(MojoExecutor.java:153)
	at org.apache.maven.lifecycle.internal.MojoExecutor.execute(MojoExecutor.java:145)
	at org.apache.maven.lifecycle.internal.MojoExecutor.executeForkedExecutions(MojoExecutor.java:365)
	at org.apache.maven.lifecycle.internal.MojoExecutor.execute(MojoExecutor.java:199)
	at org.apache.maven.lifecycle.internal.MojoExecutor.execute(MojoExecutor.java:153)
	at org.apache.maven.lifecycle.internal.MojoExecutor.execute(MojoExecutor.java:145)
	at org.apache.maven.lifecycle.internal.LifecycleModuleBuilder.buildProject(LifecycleModuleBuilder.java:84)
	at org.apache.maven.lifecycle.internal.LifecycleModuleBuilder.buildProject(LifecycleModuleBuilder.java:59)
	at org.apache.maven.lifecycle.internal.LifecycleStarter.singleThreadedBuild(LifecycleStarter.java:183)
	at org.apache.maven.lifecycle.internal.LifecycleStarter.execute(LifecycleStarter.java:161)
	at org.apache.maven.DefaultMaven.doExecute(DefaultMaven.java:320)
	at org.apache.maven.DefaultMaven.execute(DefaultMaven.java:156)
	at org.apache.maven.cli.MavenCli.execute(MavenCli.java:537)
	at org.apache.maven.cli.MavenCli.doMain(MavenCli.java:196)
	at org.apache.maven.cli.MavenCli.main(MavenCli.java:141)
	at sun.reflect.NativeMethodAccessorImpl.invoke0(Native Method)
	at sun.reflect.NativeMethodAccessorImpl.invoke(NativeMethodAccessorImpl.java:39)
	at sun.reflect.DelegatingMethodAccessorImpl.invoke(DelegatingMethodAccessorImpl.java:25)
	at java.lang.reflect.Method.invoke(Method.java:597)
	at org.codehaus.plexus.classworlds.launcher.Launcher.launchEnhanced(Launcher.java:290)
	at org.codehaus.plexus.classworlds.launcher.Launcher.launch(Launcher.java:230)
	at org.codehaus.plexus.classworlds.launcher.Launcher.mainWithExitCode(Launcher.java:409)
	at org.codehaus.plexus.classworlds.launcher.Launcher.main(Launcher.java:352)
Caused by: org.apache.maven.plugin.MojoExecutionException: Failure or timeout
	at org.apache.maven.plugin.surefire.SurefirePlugin.assertNoFailureOrTimeout(SurefirePlugin.java:643)
	at org.apache.maven.plugin.surefire.SurefirePlugin.handleSummary(SurefirePlugin.java:624)
	at org.apache.maven.plugin.surefire.AbstractSurefireMojo.executeAfterPreconditionsChecked(AbstractSurefireMojo.java:137)
	at org.apache.maven.plugin.surefire.AbstractSurefireMojo.execute(AbstractSurefireMojo.java:98)
	at org.apache.maven.plugin.DefaultBuildPluginManager.executeMojo(DefaultBuildPluginManager.java:101)
	at org.apache.maven.lifecycle.internal.MojoExecutor.execute(MojoExecutor.java:209)
	... 23 more
[ERROR] 
[ERROR] 
[ERROR] For more information about the errors and possible solutions, please read the following
articles:
[ERROR] [Help 1] http://cwiki.apache.org/confluence/display/MAVEN/MojoExecutionException
Build step 'Invoke top-level Maven targets' marked build as failure
Archiving artifacts
Sending artifact delta relative to HBase-0.94-security #509
Archived 950 artifacts
Archive block size is 32768
Received 10 blocks and 111181458 bytes
Compression is 0.3%
Took 1 min 23 sec
Updating HBASE-11026
Updating HBASE-11693
Updating HBASE-5934
Updating HBASE-11690
Updating HBASE-11691
Updating HBASE-7156
Recording test results

Mime
View raw message