hbase-builds mailing list archives

Site index · List index
Message view « Date » · « Thread »
Top « Date » · « Thread »
From Apache Jenkins Server <jenk...@builds.apache.org>
Subject Build failed in Jenkins: HBase-0.94-security #507
Date Sat, 02 Aug 2014 22:14:14 GMT
See <https://builds.apache.org/job/HBase-0.94-security/507/>

------------------------------------------
[...truncated 30622 lines...]
Tests run: 4, Failures: 0, Errors: 0, Skipped: 0, Time elapsed: 3.61 sec
Forking command line: /bin/sh -c cd /x1/jenkins/jenkins-slave/workspace/HBase-0.94-security
&& /x1/jenkins/tools/java/jdk1.6.0_45-32/jre/bin/java -enableassertions -Xmx1900m
-Djava.security.egd=file:/dev/./urandom -jar /x1/jenkins/jenkins-slave/workspace/HBase-0.94-security/target/surefire/surefirebooter6662030751182951965.jar
/x1/jenkins/jenkins-slave/workspace/HBase-0.94-security/target/surefire/surefire4024235277715852555tmp
/x1/jenkins/jenkins-slave/workspace/HBase-0.94-security/target/surefire/surefire_1007687008653432842772tmp
Running org.apache.hadoop.hbase.regionserver.TestSplitLogWorker
Tests run: 5, Failures: 0, Errors: 0, Skipped: 0, Time elapsed: 6.529 sec
Forking command line: /bin/sh -c cd /x1/jenkins/jenkins-slave/workspace/HBase-0.94-security
&& /x1/jenkins/tools/java/jdk1.6.0_45-32/jre/bin/java -enableassertions -Xmx1900m
-Djava.security.egd=file:/dev/./urandom -jar /x1/jenkins/jenkins-slave/workspace/HBase-0.94-security/target/surefire/surefirebooter9172928860366193199.jar
/x1/jenkins/jenkins-slave/workspace/HBase-0.94-security/target/surefire/surefire623538966959153437tmp
/x1/jenkins/jenkins-slave/workspace/HBase-0.94-security/target/surefire/surefire_1014228446318185245546tmp
Running org.apache.hadoop.hbase.regionserver.TestStoreScanner
Tests run: 16, Failures: 0, Errors: 0, Skipped: 0, Time elapsed: 0.149 sec
Forking command line: /bin/sh -c cd /x1/jenkins/jenkins-slave/workspace/HBase-0.94-security
&& /x1/jenkins/tools/java/jdk1.6.0_45-32/jre/bin/java -enableassertions -Xmx1900m
-Djava.security.egd=file:/dev/./urandom -jar /x1/jenkins/jenkins-slave/workspace/HBase-0.94-security/target/surefire/surefirebooter2288135646753647812.jar
/x1/jenkins/jenkins-slave/workspace/HBase-0.94-security/target/surefire/surefire1676751221247020824tmp
/x1/jenkins/jenkins-slave/workspace/HBase-0.94-security/target/surefire/surefire_1028327314819209721008tmp
Running org.apache.hadoop.hbase.regionserver.handler.TestOpenRegionHandler
Tests run: 4, Failures: 0, Errors: 0, Skipped: 0, Time elapsed: 30.676 sec
Forking command line: /bin/sh -c cd /x1/jenkins/jenkins-slave/workspace/HBase-0.94-security
&& /x1/jenkins/tools/java/jdk1.6.0_45-32/jre/bin/java -enableassertions -Xmx1900m
-Djava.security.egd=file:/dev/./urandom -jar /x1/jenkins/jenkins-slave/workspace/HBase-0.94-security/target/surefire/surefirebooter7519477778551736790.jar
/x1/jenkins/jenkins-slave/workspace/HBase-0.94-security/target/surefire/surefire4987004164500321422tmp
/x1/jenkins/jenkins-slave/workspace/HBase-0.94-security/target/surefire/surefire_1032223231327253517940tmp
Running org.apache.hadoop.hbase.regionserver.metrics.TestSchemaMetrics
Tests run: 6, Failures: 0, Errors: 0, Skipped: 0, Time elapsed: 45.312 sec
Forking command line: /bin/sh -c cd /x1/jenkins/jenkins-slave/workspace/HBase-0.94-security
&& /x1/jenkins/tools/java/jdk1.6.0_45-32/jre/bin/java -enableassertions -Xmx1900m
-Djava.security.egd=file:/dev/./urandom -jar /x1/jenkins/jenkins-slave/workspace/HBase-0.94-security/target/surefire/surefirebooter2335287258687085593.jar
/x1/jenkins/jenkins-slave/workspace/HBase-0.94-security/target/surefire/surefire3040981666636514281tmp
/x1/jenkins/jenkins-slave/workspace/HBase-0.94-security/target/surefire/surefire_1041202748432068857504tmp
Running org.apache.hadoop.hbase.regionserver.TestStoreFileBlockCacheSummary
Tests run: 1, Failures: 0, Errors: 0, Skipped: 0, Time elapsed: 38.801 sec
Forking command line: /bin/sh -c cd /x1/jenkins/jenkins-slave/workspace/HBase-0.94-security
&& /x1/jenkins/tools/java/jdk1.6.0_45-32/jre/bin/java -enableassertions -Xmx1900m
-Djava.security.egd=file:/dev/./urandom -jar /x1/jenkins/jenkins-slave/workspace/HBase-0.94-security/target/surefire/surefirebooter2867907602281546970.jar
/x1/jenkins/jenkins-slave/workspace/HBase-0.94-security/target/surefire/surefire6212134525858497031tmp
/x1/jenkins/jenkins-slave/workspace/HBase-0.94-security/target/surefire/surefire_1052842414664812575393tmp
Running org.apache.hadoop.hbase.regionserver.TestMasterAddressManager
Tests run: 1, Failures: 0, Errors: 0, Skipped: 0, Time elapsed: 2.973 sec
Forking command line: /bin/sh -c cd /x1/jenkins/jenkins-slave/workspace/HBase-0.94-security
&& /x1/jenkins/tools/java/jdk1.6.0_45-32/jre/bin/java -enableassertions -Xmx1900m
-Djava.security.egd=file:/dev/./urandom -jar /x1/jenkins/jenkins-slave/workspace/HBase-0.94-security/target/surefire/surefirebooter6678659322317982889.jar
/x1/jenkins/jenkins-slave/workspace/HBase-0.94-security/target/surefire/surefire5935841878787883234tmp
/x1/jenkins/jenkins-slave/workspace/HBase-0.94-security/target/surefire/surefire_1067491531973207505455tmp
Running org.apache.hadoop.hbase.regionserver.TestMultiColumnScanner
Tests run: 12, Failures: 0, Errors: 0, Skipped: 0, Time elapsed: 121.715 sec
Forking command line: /bin/sh -c cd /x1/jenkins/jenkins-slave/workspace/HBase-0.94-security
&& /x1/jenkins/tools/java/jdk1.6.0_45-32/jre/bin/java -enableassertions -Xmx1900m
-Djava.security.egd=file:/dev/./urandom -jar /x1/jenkins/jenkins-slave/workspace/HBase-0.94-security/target/surefire/surefirebooter859072111503622856.jar
/x1/jenkins/jenkins-slave/workspace/HBase-0.94-security/target/surefire/surefire3563815987553636350tmp
/x1/jenkins/jenkins-slave/workspace/HBase-0.94-security/target/surefire/surefire_1074388934715034458131tmp
Running org.apache.hadoop.hbase.regionserver.TestHRegion
Tests run: 75, Failures: 0, Errors: 0, Skipped: 0, Time elapsed: 137.311 sec
Forking command line: /bin/sh -c cd /x1/jenkins/jenkins-slave/workspace/HBase-0.94-security
&& /x1/jenkins/tools/java/jdk1.6.0_45-32/jre/bin/java -enableassertions -Xmx1900m
-Djava.security.egd=file:/dev/./urandom -jar /x1/jenkins/jenkins-slave/workspace/HBase-0.94-security/target/surefire/surefirebooter666007044194698674.jar
/x1/jenkins/jenkins-slave/workspace/HBase-0.94-security/target/surefire/surefire8851895741008268725tmp
/x1/jenkins/jenkins-slave/workspace/HBase-0.94-security/target/surefire/surefire_1081982442325381917033tmp
Running org.apache.hadoop.hbase.TestLocalHBaseCluster
Tests run: 1, Failures: 0, Errors: 0, Skipped: 0, Time elapsed: 17.273 sec
Forking command line: /bin/sh -c cd /x1/jenkins/jenkins-slave/workspace/HBase-0.94-security
&& /x1/jenkins/tools/java/jdk1.6.0_45-32/jre/bin/java -enableassertions -Xmx1900m
-Djava.security.egd=file:/dev/./urandom -jar /x1/jenkins/jenkins-slave/workspace/HBase-0.94-security/target/surefire/surefirebooter3334468259240793062.jar
/x1/jenkins/jenkins-slave/workspace/HBase-0.94-security/target/surefire/surefire3689756411419159324tmp
/x1/jenkins/jenkins-slave/workspace/HBase-0.94-security/target/surefire/surefire_1095028563184737484574tmp
Running org.apache.hadoop.hbase.ipc.TestDelayedRpc
Tests run: 4, Failures: 0, Errors: 0, Skipped: 0, Time elapsed: 6.022 sec
Forking command line: /bin/sh -c cd /x1/jenkins/jenkins-slave/workspace/HBase-0.94-security
&& /x1/jenkins/tools/java/jdk1.6.0_45-32/jre/bin/java -enableassertions -Xmx1900m
-Djava.security.egd=file:/dev/./urandom -jar /x1/jenkins/jenkins-slave/workspace/HBase-0.94-security/target/surefire/surefirebooter4272716385046568919.jar
/x1/jenkins/jenkins-slave/workspace/HBase-0.94-security/target/surefire/surefire7052875544115434928tmp
/x1/jenkins/jenkins-slave/workspace/HBase-0.94-security/target/surefire/surefire_1108840097687561434942tmp
Running org.apache.hadoop.hbase.ipc.TestPBOnWritableRpc
Tests run: 1, Failures: 0, Errors: 0, Skipped: 0, Time elapsed: 3.079 sec
Forking command line: /bin/sh -c cd /x1/jenkins/jenkins-slave/workspace/HBase-0.94-security
&& /x1/jenkins/tools/java/jdk1.6.0_45-32/jre/bin/java -enableassertions -Xmx1900m
-Djava.security.egd=file:/dev/./urandom -jar /x1/jenkins/jenkins-slave/workspace/HBase-0.94-security/target/surefire/surefirebooter8656414464076181864.jar
/x1/jenkins/jenkins-slave/workspace/HBase-0.94-security/target/surefire/surefire6577484871726676877tmp
/x1/jenkins/jenkins-slave/workspace/HBase-0.94-security/target/surefire/surefire_1111988345831222141662tmp
Running org.apache.hadoop.hbase.TestGlobalMemStoreSize
Tests run: 1, Failures: 0, Errors: 0, Skipped: 0, Time elapsed: 54.663 sec
Forking command line: /bin/sh -c cd /x1/jenkins/jenkins-slave/workspace/HBase-0.94-security
&& /x1/jenkins/tools/java/jdk1.6.0_45-32/jre/bin/java -enableassertions -Xmx1900m
-Djava.security.egd=file:/dev/./urandom -jar /x1/jenkins/jenkins-slave/workspace/HBase-0.94-security/target/surefire/surefirebooter6554937630587287669.jar
/x1/jenkins/jenkins-slave/workspace/HBase-0.94-security/target/surefire/surefire3164732093105372651tmp
/x1/jenkins/jenkins-slave/workspace/HBase-0.94-security/target/surefire/surefire_1127288513290386947650tmp
Running org.apache.hadoop.hbase.constraint.TestConstraint
Tests run: 5, Failures: 0, Errors: 0, Skipped: 0, Time elapsed: 51.588 sec
Forking command line: /bin/sh -c cd /x1/jenkins/jenkins-slave/workspace/HBase-0.94-security
&& /x1/jenkins/tools/java/jdk1.6.0_45-32/jre/bin/java -enableassertions -Xmx1900m
-Djava.security.egd=file:/dev/./urandom -jar /x1/jenkins/jenkins-slave/workspace/HBase-0.94-security/target/surefire/surefirebooter5026463133172980723.jar
/x1/jenkins/jenkins-slave/workspace/HBase-0.94-security/target/surefire/surefire1904547969069431278tmp
/x1/jenkins/jenkins-slave/workspace/HBase-0.94-security/target/surefire/surefire_1137755516214494270336tmp
Running org.apache.hadoop.hbase.rest.TestSchemaResource
Tests run: 2, Failures: 0, Errors: 0, Skipped: 0, Time elapsed: 43.511 sec
Forking command line: /bin/sh -c cd /x1/jenkins/jenkins-slave/workspace/HBase-0.94-security
&& /x1/jenkins/tools/java/jdk1.6.0_45-32/jre/bin/java -enableassertions -Xmx1900m
-Djava.security.egd=file:/dev/./urandom -jar /x1/jenkins/jenkins-slave/workspace/HBase-0.94-security/target/surefire/surefirebooter5410573009436053733.jar
/x1/jenkins/jenkins-slave/workspace/HBase-0.94-security/target/surefire/surefire7689343266533042248tmp
/x1/jenkins/jenkins-slave/workspace/HBase-0.94-security/target/surefire/surefire_114261037222065575509tmp
Running org.apache.hadoop.hbase.backup.TestHFileArchiving
Tests run: 5, Failures: 0, Errors: 0, Skipped: 0, Time elapsed: 228.018 sec
Forking command line: /bin/sh -c cd /x1/jenkins/jenkins-slave/workspace/HBase-0.94-security
&& /x1/jenkins/tools/java/jdk1.6.0_45-32/jre/bin/java -enableassertions -Xmx1900m
-Djava.security.egd=file:/dev/./urandom -jar /x1/jenkins/jenkins-slave/workspace/HBase-0.94-security/target/surefire/surefirebooter1946897597586302821.jar
/x1/jenkins/jenkins-slave/workspace/HBase-0.94-security/target/surefire/surefire5292637464134607078tmp
/x1/jenkins/jenkins-slave/workspace/HBase-0.94-security/target/surefire/surefire_1156928847673894016148tmp
Running org.apache.hadoop.hbase.rest.client.TestRemoteAdmin
Tests run: 5, Failures: 0, Errors: 0, Skipped: 0, Time elapsed: 41.818 sec
Forking command line: /bin/sh -c cd /x1/jenkins/jenkins-slave/workspace/HBase-0.94-security
&& /x1/jenkins/tools/java/jdk1.6.0_45-32/jre/bin/java -enableassertions -Xmx1900m
-Djava.security.egd=file:/dev/./urandom -jar /x1/jenkins/jenkins-slave/workspace/HBase-0.94-security/target/surefire/surefirebooter2440194098615408726.jar
/x1/jenkins/jenkins-slave/workspace/HBase-0.94-security/target/surefire/surefire7468731913186862570tmp
/x1/jenkins/jenkins-slave/workspace/HBase-0.94-security/target/surefire/surefire_1165761687191277818777tmp
Running org.apache.hadoop.hbase.rest.client.TestRemoteTable
Tests run: 9, Failures: 0, Errors: 0, Skipped: 0, Time elapsed: 88.27 sec
Forking command line: /bin/sh -c cd /x1/jenkins/jenkins-slave/workspace/HBase-0.94-security
&& /x1/jenkins/tools/java/jdk1.6.0_45-32/jre/bin/java -enableassertions -Xmx1900m
-Djava.security.egd=file:/dev/./urandom -jar /x1/jenkins/jenkins-slave/workspace/HBase-0.94-security/target/surefire/surefirebooter4505889840564837480.jar
/x1/jenkins/jenkins-slave/workspace/HBase-0.94-security/target/surefire/surefire1346863969058828656tmp
/x1/jenkins/jenkins-slave/workspace/HBase-0.94-security/target/surefire/surefire_1173020955137060318577tmp
Running org.apache.hadoop.hbase.rest.TestTableResource
Tests run: 8, Failures: 0, Errors: 0, Skipped: 0, Time elapsed: 71.147 sec
Forking command line: /bin/sh -c cd /x1/jenkins/jenkins-slave/workspace/HBase-0.94-security
&& /x1/jenkins/tools/java/jdk1.6.0_45-32/jre/bin/java -enableassertions -Xmx1900m
-Djava.security.egd=file:/dev/./urandom -jar /x1/jenkins/jenkins-slave/workspace/HBase-0.94-security/target/surefire/surefirebooter5848143276951178538.jar
/x1/jenkins/jenkins-slave/workspace/HBase-0.94-security/target/surefire/surefire6783027587948140166tmp
/x1/jenkins/jenkins-slave/workspace/HBase-0.94-security/target/surefire/surefire_1185219353256339710335tmp
Running org.apache.hadoop.hbase.rest.TestMultiRowResource
Tests run: 3, Failures: 0, Errors: 0, Skipped: 0, Time elapsed: 40.052 sec
Forking command line: /bin/sh -c cd /x1/jenkins/jenkins-slave/workspace/HBase-0.94-security
&& /x1/jenkins/tools/java/jdk1.6.0_45-32/jre/bin/java -enableassertions -Xmx1900m
-Djava.security.egd=file:/dev/./urandom -jar /x1/jenkins/jenkins-slave/workspace/HBase-0.94-security/target/surefire/surefirebooter4974749249675221182.jar
/x1/jenkins/jenkins-slave/workspace/HBase-0.94-security/target/surefire/surefire3543465917025539550tmp
/x1/jenkins/jenkins-slave/workspace/HBase-0.94-security/target/surefire/surefire_1192054746657627475859tmp
Running org.apache.hadoop.hbase.rest.TestGzipFilter
Tests run: 2, Failures: 0, Errors: 0, Skipped: 0, Time elapsed: 37.005 sec
Forking command line: /bin/sh -c cd /x1/jenkins/jenkins-slave/workspace/HBase-0.94-security
&& /x1/jenkins/tools/java/jdk1.6.0_45-32/jre/bin/java -enableassertions -Xmx1900m
-Djava.security.egd=file:/dev/./urandom -jar /x1/jenkins/jenkins-slave/workspace/HBase-0.94-security/target/surefire/surefirebooter1844885069116406765.jar
/x1/jenkins/jenkins-slave/workspace/HBase-0.94-security/target/surefire/surefire2714385943670856618tmp
/x1/jenkins/jenkins-slave/workspace/HBase-0.94-security/target/surefire/surefire_12031584896110699299tmp
Running org.apache.hadoop.hbase.rest.TestRowResource
Tests run: 12, Failures: 0, Errors: 0, Skipped: 0, Time elapsed: 46.031 sec
Forking command line: /bin/sh -c cd /x1/jenkins/jenkins-slave/workspace/HBase-0.94-security
&& /x1/jenkins/tools/java/jdk1.6.0_45-32/jre/bin/java -enableassertions -Xmx1900m
-Djava.security.egd=file:/dev/./urandom -jar /x1/jenkins/jenkins-slave/workspace/HBase-0.94-security/target/surefire/surefirebooter2527344671544125736.jar
/x1/jenkins/jenkins-slave/workspace/HBase-0.94-security/target/surefire/surefire3763951999718999710tmp
/x1/jenkins/jenkins-slave/workspace/HBase-0.94-security/target/surefire/surefire_121821319346351317805tmp
Running org.apache.hadoop.hbase.rest.TestVersionResource
Tests run: 7, Failures: 0, Errors: 0, Skipped: 0, Time elapsed: 32.298 sec
Forking command line: /bin/sh -c cd /x1/jenkins/jenkins-slave/workspace/HBase-0.94-security
&& /x1/jenkins/tools/java/jdk1.6.0_45-32/jre/bin/java -enableassertions -Xmx1900m
-Djava.security.egd=file:/dev/./urandom -jar /x1/jenkins/jenkins-slave/workspace/HBase-0.94-security/target/surefire/surefirebooter9178411793789983679.jar
/x1/jenkins/jenkins-slave/workspace/HBase-0.94-security/target/surefire/surefire1979338289909327437tmp
/x1/jenkins/jenkins-slave/workspace/HBase-0.94-security/target/surefire/surefire_1221971696315296142150tmp
Running org.apache.hadoop.hbase.rest.TestScannerResource
Tests run: 5, Failures: 0, Errors: 0, Skipped: 0, Time elapsed: 89.036 sec
Forking command line: /bin/sh -c cd /x1/jenkins/jenkins-slave/workspace/HBase-0.94-security
&& /x1/jenkins/tools/java/jdk1.6.0_45-32/jre/bin/java -enableassertions -Xmx1900m
-Djava.security.egd=file:/dev/./urandom -jar /x1/jenkins/jenkins-slave/workspace/HBase-0.94-security/target/surefire/surefirebooter3231798235764476410.jar
/x1/jenkins/jenkins-slave/workspace/HBase-0.94-security/target/surefire/surefire5810745331944098578tmp
/x1/jenkins/jenkins-slave/workspace/HBase-0.94-security/target/surefire/surefire_123533258123097171637tmp
Running org.apache.hadoop.hbase.rest.TestGZIPResponseWrapper
Tests run: 5, Failures: 0, Errors: 0, Skipped: 0, Time elapsed: 0.893 sec
Forking command line: /bin/sh -c cd /x1/jenkins/jenkins-slave/workspace/HBase-0.94-security
&& /x1/jenkins/tools/java/jdk1.6.0_45-32/jre/bin/java -enableassertions -Xmx1900m
-Djava.security.egd=file:/dev/./urandom -jar /x1/jenkins/jenkins-slave/workspace/HBase-0.94-security/target/surefire/surefirebooter8930506361101080261.jar
/x1/jenkins/jenkins-slave/workspace/HBase-0.94-security/target/surefire/surefire7119095878543987089tmp
/x1/jenkins/jenkins-slave/workspace/HBase-0.94-security/target/surefire/surefire_124669883660443510232tmp
Running org.apache.hadoop.hbase.rest.TestStatusResource
Tests run: 2, Failures: 0, Errors: 0, Skipped: 0, Time elapsed: 32.621 sec
Forking command line: /bin/sh -c cd /x1/jenkins/jenkins-slave/workspace/HBase-0.94-security
&& /x1/jenkins/tools/java/jdk1.6.0_45-32/jre/bin/java -enableassertions -Xmx1900m
-Djava.security.egd=file:/dev/./urandom -jar /x1/jenkins/jenkins-slave/workspace/HBase-0.94-security/target/surefire/surefirebooter3674781828166210445.jar
/x1/jenkins/jenkins-slave/workspace/HBase-0.94-security/target/surefire/surefire5734832101281827620tmp
/x1/jenkins/jenkins-slave/workspace/HBase-0.94-security/target/surefire/surefire_1255135662116076411026tmp
Running org.apache.hadoop.hbase.TestHBaseFileSystem
Tests run: 2, Failures: 0, Errors: 0, Skipped: 0, Time elapsed: 32.916 sec
Forking command line: /bin/sh -c cd /x1/jenkins/jenkins-slave/workspace/HBase-0.94-security
&& /x1/jenkins/tools/java/jdk1.6.0_45-32/jre/bin/java -enableassertions -Xmx1900m
-Djava.security.egd=file:/dev/./urandom -jar /x1/jenkins/jenkins-slave/workspace/HBase-0.94-security/target/surefire/surefirebooter6524850167707035712.jar
/x1/jenkins/jenkins-slave/workspace/HBase-0.94-security/target/surefire/surefire3395443151406357624tmp
/x1/jenkins/jenkins-slave/workspace/HBase-0.94-security/target/surefire/surefire_1265118582326120198752tmp
Running org.apache.hadoop.hbase.rest.TestScannersWithFilters
Tests run: 10, Failures: 0, Errors: 0, Skipped: 0, Time elapsed: 52.78 sec
Running org.apache.hadoop.hbase.metrics.TestMetricsMBeanBase
Tests run: 3, Failures: 0, Errors: 0, Skipped: 0, Time elapsed: 1.925 sec
Forking command line: /bin/sh -c cd /x1/jenkins/jenkins-slave/workspace/HBase-0.94-security
&& /x1/jenkins/tools/java/jdk1.6.0_45-32/jre/bin/java -enableassertions -Xmx1900m
-Djava.security.egd=file:/dev/./urandom -jar /x1/jenkins/jenkins-slave/workspace/HBase-0.94-security/target/surefire/surefirebooter458095320072229824.jar
/x1/jenkins/jenkins-slave/workspace/HBase-0.94-security/target/surefire/surefire5293125673858528850tmp
/x1/jenkins/jenkins-slave/workspace/HBase-0.94-security/target/surefire/surefire_1277690165466397972314tmp
Forking command line: /bin/sh -c cd /x1/jenkins/jenkins-slave/workspace/HBase-0.94-security
&& /x1/jenkins/tools/java/jdk1.6.0_45-32/jre/bin/java -enableassertions -Xmx1900m
-Djava.security.egd=file:/dev/./urandom -jar /x1/jenkins/jenkins-slave/workspace/HBase-0.94-security/target/surefire/surefirebooter2109702642860866647.jar
/x1/jenkins/jenkins-slave/workspace/HBase-0.94-security/target/surefire/surefire5984090356598294718tmp
/x1/jenkins/jenkins-slave/workspace/HBase-0.94-security/target/surefire/surefire_1288587418929002626186tmp
Running org.apache.hadoop.hbase.io.hfile.TestHFileSeek
Tests run: 1, Failures: 0, Errors: 0, Skipped: 0, Time elapsed: 15.003 sec
Forking command line: /bin/sh -c cd /x1/jenkins/jenkins-slave/workspace/HBase-0.94-security
&& /x1/jenkins/tools/java/jdk1.6.0_45-32/jre/bin/java -enableassertions -Xmx1900m
-Djava.security.egd=file:/dev/./urandom -jar /x1/jenkins/jenkins-slave/workspace/HBase-0.94-security/target/surefire/surefirebooter2845175687584521344.jar
/x1/jenkins/jenkins-slave/workspace/HBase-0.94-security/target/surefire/surefire5796226297824175980tmp
/x1/jenkins/jenkins-slave/workspace/HBase-0.94-security/target/surefire/surefire_1297434802159269579581tmp
Running org.apache.hadoop.hbase.io.hfile.TestLruBlockCache
Tests run: 16, Failures: 0, Errors: 0, Skipped: 0, Time elapsed: 2.796 sec
Forking command line: /bin/sh -c cd /x1/jenkins/jenkins-slave/workspace/HBase-0.94-security
&& /x1/jenkins/tools/java/jdk1.6.0_45-32/jre/bin/java -enableassertions -Xmx1900m
-Djava.security.egd=file:/dev/./urandom -jar /x1/jenkins/jenkins-slave/workspace/HBase-0.94-security/target/surefire/surefirebooter3663898243923370946.jar
/x1/jenkins/jenkins-slave/workspace/HBase-0.94-security/target/surefire/surefire6041273978887710572tmp
/x1/jenkins/jenkins-slave/workspace/HBase-0.94-security/target/surefire/surefire_130928473916474780840tmp
Running org.apache.hadoop.hbase.io.hfile.TestHFileBlockIndex
Tests run: 10, Failures: 0, Errors: 0, Skipped: 0, Time elapsed: 27.305 sec
Forking command line: /bin/sh -c cd /x1/jenkins/jenkins-slave/workspace/HBase-0.94-security
&& /x1/jenkins/tools/java/jdk1.6.0_45-32/jre/bin/java -enableassertions -Xmx1900m
-Djava.security.egd=file:/dev/./urandom -jar /x1/jenkins/jenkins-slave/workspace/HBase-0.94-security/target/surefire/surefirebooter3408997106876128906.jar
/x1/jenkins/jenkins-slave/workspace/HBase-0.94-security/target/surefire/surefire9098153517066092746tmp
/x1/jenkins/jenkins-slave/workspace/HBase-0.94-security/target/surefire/surefire_1315930281205018915711tmp
Running org.apache.hadoop.hbase.io.hfile.TestFixedFileTrailer
Tests run: 2, Failures: 0, Errors: 0, Skipped: 0, Time elapsed: 2.696 sec
Forking command line: /bin/sh -c cd /x1/jenkins/jenkins-slave/workspace/HBase-0.94-security
&& /x1/jenkins/tools/java/jdk1.6.0_45-32/jre/bin/java -enableassertions -Xmx1900m
-Djava.security.egd=file:/dev/./urandom -jar /x1/jenkins/jenkins-slave/workspace/HBase-0.94-security/target/surefire/surefirebooter1137604152193286289.jar
/x1/jenkins/jenkins-slave/workspace/HBase-0.94-security/target/surefire/surefire6902445380720172740tmp
/x1/jenkins/jenkins-slave/workspace/HBase-0.94-security/target/surefire/surefire_1325644229093513329343tmp
Running org.apache.hadoop.hbase.io.hfile.TestHFilePerformance
Tests run: 1, Failures: 0, Errors: 0, Skipped: 0, Time elapsed: 13.878 sec
Forking command line: /bin/sh -c cd /x1/jenkins/jenkins-slave/workspace/HBase-0.94-security
&& /x1/jenkins/tools/java/jdk1.6.0_45-32/jre/bin/java -enableassertions -Xmx1900m
-Djava.security.egd=file:/dev/./urandom -jar /x1/jenkins/jenkins-slave/workspace/HBase-0.94-security/target/surefire/surefirebooter855710488580206212.jar
/x1/jenkins/jenkins-slave/workspace/HBase-0.94-security/target/surefire/surefire4948296190252279508tmp
/x1/jenkins/jenkins-slave/workspace/HBase-0.94-security/target/surefire/surefire_1331658539111832213458tmp
Running org.apache.hadoop.hbase.io.hfile.TestHFileBlockCompatibility
Tests run: 10, Failures: 0, Errors: 0, Skipped: 0, Time elapsed: 5.438 sec
Forking command line: /bin/sh -c cd /x1/jenkins/jenkins-slave/workspace/HBase-0.94-security
&& /x1/jenkins/tools/java/jdk1.6.0_45-32/jre/bin/java -enableassertions -Xmx1900m
-Djava.security.egd=file:/dev/./urandom -jar /x1/jenkins/jenkins-slave/workspace/HBase-0.94-security/target/surefire/surefirebooter31947509303995645.jar
/x1/jenkins/jenkins-slave/workspace/HBase-0.94-security/target/surefire/surefire3750652212032141919tmp
/x1/jenkins/jenkins-slave/workspace/HBase-0.94-security/target/surefire/surefire_1347534044582665552464tmp
Running org.apache.hadoop.hbase.io.hfile.TestCacheOnWrite
Tests run: 36, Failures: 0, Errors: 0, Skipped: 0, Time elapsed: 102.136 sec
Forking command line: /bin/sh -c cd /x1/jenkins/jenkins-slave/workspace/HBase-0.94-security
&& /x1/jenkins/tools/java/jdk1.6.0_45-32/jre/bin/java -enableassertions -Xmx1900m
-Djava.security.egd=file:/dev/./urandom -jar /x1/jenkins/jenkins-slave/workspace/HBase-0.94-security/target/surefire/surefirebooter4673831394333089111.jar
/x1/jenkins/jenkins-slave/workspace/HBase-0.94-security/target/surefire/surefire1140021680323881123tmp
/x1/jenkins/jenkins-slave/workspace/HBase-0.94-security/target/surefire/surefire_1353501694238586676107tmp
Running org.apache.hadoop.hbase.io.hfile.TestChecksum
Tests run: 3, Failures: 0, Errors: 0, Skipped: 0, Time elapsed: 3.766 sec
Forking command line: /bin/sh -c cd /x1/jenkins/jenkins-slave/workspace/HBase-0.94-security
&& /x1/jenkins/tools/java/jdk1.6.0_45-32/jre/bin/java -enableassertions -Xmx1900m
-Djava.security.egd=file:/dev/./urandom -jar /x1/jenkins/jenkins-slave/workspace/HBase-0.94-security/target/surefire/surefirebooter4738122129373530039.jar
/x1/jenkins/jenkins-slave/workspace/HBase-0.94-security/target/surefire/surefire8165916985414095693tmp
/x1/jenkins/jenkins-slave/workspace/HBase-0.94-security/target/surefire/surefire_1366564982940212720404tmp
Running org.apache.hadoop.hbase.io.hfile.TestHFileBlock
Tests run: 16, Failures: 0, Errors: 0, Skipped: 0, Time elapsed: 74.537 sec
Forking command line: /bin/sh -c cd /x1/jenkins/jenkins-slave/workspace/HBase-0.94-security
&& /x1/jenkins/tools/java/jdk1.6.0_45-32/jre/bin/java -enableassertions -Xmx1900m
-Djava.security.egd=file:/dev/./urandom -jar /x1/jenkins/jenkins-slave/workspace/HBase-0.94-security/target/surefire/surefirebooter120321209015284951.jar
/x1/jenkins/jenkins-slave/workspace/HBase-0.94-security/target/surefire/surefire9097538106257535601tmp
/x1/jenkins/jenkins-slave/workspace/HBase-0.94-security/target/surefire/surefire_1371246727069013744810tmp
Running org.apache.hadoop.hbase.io.hfile.TestForceCacheImportantBlocks
Tests run: 6, Failures: 0, Errors: 0, Skipped: 0, Time elapsed: 224.854 sec
Forking command line: /bin/sh -c cd /x1/jenkins/jenkins-slave/workspace/HBase-0.94-security
&& /x1/jenkins/tools/java/jdk1.6.0_45-32/jre/bin/java -enableassertions -Xmx1900m
-Djava.security.egd=file:/dev/./urandom -jar /x1/jenkins/jenkins-slave/workspace/HBase-0.94-security/target/surefire/surefirebooter2706170009183737315.jar
/x1/jenkins/jenkins-slave/workspace/HBase-0.94-security/target/surefire/surefire1048694322779411967tmp
/x1/jenkins/jenkins-slave/workspace/HBase-0.94-security/target/surefire/surefire_1385204979319011281795tmp
Running org.apache.hadoop.hbase.io.hfile.slab.TestSlabCache
Tests run: 7, Failures: 0, Errors: 0, Skipped: 0, Time elapsed: 77.847 sec
Forking command line: /bin/sh -c cd /x1/jenkins/jenkins-slave/workspace/HBase-0.94-security
&& /x1/jenkins/tools/java/jdk1.6.0_45-32/jre/bin/java -enableassertions -Xmx1900m
-Djava.security.egd=file:/dev/./urandom -jar /x1/jenkins/jenkins-slave/workspace/HBase-0.94-security/target/surefire/surefirebooter7471946455503585564.jar
/x1/jenkins/jenkins-slave/workspace/HBase-0.94-security/target/surefire/surefire3347983289791463649tmp
/x1/jenkins/jenkins-slave/workspace/HBase-0.94-security/target/surefire/surefire_1396470150895307461299tmp
Running org.apache.hadoop.hbase.io.TestFileLink
Tests run: 3, Failures: 0, Errors: 0, Skipped: 0, Time elapsed: 45.606 sec
Forking command line: /bin/sh -c cd /x1/jenkins/jenkins-slave/workspace/HBase-0.94-security
&& /x1/jenkins/tools/java/jdk1.6.0_45-32/jre/bin/java -enableassertions -Xmx1900m
-Djava.security.egd=file:/dev/./urandom -jar /x1/jenkins/jenkins-slave/workspace/HBase-0.94-security/target/surefire/surefirebooter4345098388940953436.jar
/x1/jenkins/jenkins-slave/workspace/HBase-0.94-security/target/surefire/surefire9132808287748436759tmp
/x1/jenkins/jenkins-slave/workspace/HBase-0.94-security/target/surefire/surefire_140628306332768953567tmp
Running org.apache.hadoop.hbase.io.hfile.slab.TestSingleSizeCache
Tests run: 5, Failures: 0, Errors: 0, Skipped: 0, Time elapsed: 146.48 sec
Forking command line: /bin/sh -c cd /x1/jenkins/jenkins-slave/workspace/HBase-0.94-security
&& /x1/jenkins/tools/java/jdk1.6.0_45-32/jre/bin/java -enableassertions -Xmx1900m
-Djava.security.egd=file:/dev/./urandom -jar /x1/jenkins/jenkins-slave/workspace/HBase-0.94-security/target/surefire/surefirebooter5567774667091497425.jar
/x1/jenkins/jenkins-slave/workspace/HBase-0.94-security/target/surefire/surefire8041340261660456647tmp
/x1/jenkins/jenkins-slave/workspace/HBase-0.94-security/target/surefire/surefire_1413149090464010826713tmp
Running org.apache.hadoop.hbase.replication.TestReplicationZookeeper
Tests run: 1, Failures: 0, Errors: 0, Skipped: 0, Time elapsed: 2.856 sec
Forking command line: /bin/sh -c cd /x1/jenkins/jenkins-slave/workspace/HBase-0.94-security
&& /x1/jenkins/tools/java/jdk1.6.0_45-32/jre/bin/java -enableassertions -Xmx1900m
-Djava.security.egd=file:/dev/./urandom -jar /x1/jenkins/jenkins-slave/workspace/HBase-0.94-security/target/surefire/surefirebooter1468888959091146150.jar
/x1/jenkins/jenkins-slave/workspace/HBase-0.94-security/target/surefire/surefire3018809929671201891tmp
/x1/jenkins/jenkins-slave/workspace/HBase-0.94-security/target/surefire/surefire_1426175811249155094675tmp
Running org.apache.hadoop.hbase.io.encoding.TestLoadAndSwitchEncodeOnDisk
Tests run: 1, Failures: 0, Errors: 0, Skipped: 0, Time elapsed: 63.104 sec
Forking command line: /bin/sh -c cd /x1/jenkins/jenkins-slave/workspace/HBase-0.94-security
&& /x1/jenkins/tools/java/jdk1.6.0_45-32/jre/bin/java -enableassertions -Xmx1900m
-Djava.security.egd=file:/dev/./urandom -jar /x1/jenkins/jenkins-slave/workspace/HBase-0.94-security/target/surefire/surefirebooter4606662386439482852.jar
/x1/jenkins/jenkins-slave/workspace/HBase-0.94-security/target/surefire/surefire2088969443456811511tmp
/x1/jenkins/jenkins-slave/workspace/HBase-0.94-security/target/surefire/surefire_1438973394093568459389tmp
Running org.apache.hadoop.hbase.replication.regionserver.TestReplicationSourceManager
Tests run: 3, Failures: 0, Errors: 0, Skipped: 0, Time elapsed: 6.219 sec
Forking command line: /bin/sh -c cd /x1/jenkins/jenkins-slave/workspace/HBase-0.94-security
&& /x1/jenkins/tools/java/jdk1.6.0_45-32/jre/bin/java -enableassertions -Xmx1900m
-Djava.security.egd=file:/dev/./urandom -jar /x1/jenkins/jenkins-slave/workspace/HBase-0.94-security/target/surefire/surefirebooter834915010624140028.jar
/x1/jenkins/jenkins-slave/workspace/HBase-0.94-security/target/surefire/surefire5947484376418044714tmp
/x1/jenkins/jenkins-slave/workspace/HBase-0.94-security/target/surefire/surefire_1443495522211546893640tmp
Running org.apache.hadoop.hbase.replication.regionserver.TestReplicationSink
Tests run: 5, Failures: 0, Errors: 0, Skipped: 0, Time elapsed: 46.893 sec
Forking command line: /bin/sh -c cd /x1/jenkins/jenkins-slave/workspace/HBase-0.94-security
&& /x1/jenkins/tools/java/jdk1.6.0_45-32/jre/bin/java -enableassertions -Xmx1900m
-Djava.security.egd=file:/dev/./urandom -jar /x1/jenkins/jenkins-slave/workspace/HBase-0.94-security/target/surefire/surefirebooter2633693106017205398.jar
/x1/jenkins/jenkins-slave/workspace/HBase-0.94-security/target/surefire/surefire5391900416023602286tmp
/x1/jenkins/jenkins-slave/workspace/HBase-0.94-security/target/surefire/surefire_1456707347655016906503tmp
Running org.apache.hadoop.hbase.util.TestFSTableDescriptors
Tests run: 11, Failures: 0, Errors: 0, Skipped: 0, Time elapsed: 3.668 sec
Forking command line: /bin/sh -c cd /x1/jenkins/jenkins-slave/workspace/HBase-0.94-security
&& /x1/jenkins/tools/java/jdk1.6.0_45-32/jre/bin/java -enableassertions -Xmx1900m
-Djava.security.egd=file:/dev/./urandom -jar /x1/jenkins/jenkins-slave/workspace/HBase-0.94-security/target/surefire/surefirebooter495351281510156956.jar
/x1/jenkins/jenkins-slave/workspace/HBase-0.94-security/target/surefire/surefire8581610527440861720tmp
/x1/jenkins/jenkins-slave/workspace/HBase-0.94-security/target/surefire/surefire_1468937854074253085116tmp
Running org.apache.hadoop.hbase.replication.TestReplicationSource
Tests run: 1, Failures: 0, Errors: 0, Skipped: 0, Time elapsed: 12.165 sec
Forking command line: /bin/sh -c cd /x1/jenkins/jenkins-slave/workspace/HBase-0.94-security
&& /x1/jenkins/tools/java/jdk1.6.0_45-32/jre/bin/java -enableassertions -Xmx1900m
-Djava.security.egd=file:/dev/./urandom -jar /x1/jenkins/jenkins-slave/workspace/HBase-0.94-security/target/surefire/surefirebooter7026574266723915448.jar
/x1/jenkins/jenkins-slave/workspace/HBase-0.94-security/target/surefire/surefire6364668459554738784tmp
/x1/jenkins/jenkins-slave/workspace/HBase-0.94-security/target/surefire/surefire_147612188088243478297tmp
Running org.apache.hadoop.hbase.util.TestEnvironmentEdgeManager
Tests run: 2, Failures: 0, Errors: 0, Skipped: 0, Time elapsed: 1.536 sec
Forking command line: /bin/sh -c cd /x1/jenkins/jenkins-slave/workspace/HBase-0.94-security
&& /x1/jenkins/tools/java/jdk1.6.0_45-32/jre/bin/java -enableassertions -Xmx1900m
-Djava.security.egd=file:/dev/./urandom -jar /x1/jenkins/jenkins-slave/workspace/HBase-0.94-security/target/surefire/surefirebooter3417007809960853981.jar
/x1/jenkins/jenkins-slave/workspace/HBase-0.94-security/target/surefire/surefire2818602824889901168tmp
/x1/jenkins/jenkins-slave/workspace/HBase-0.94-security/target/surefire/surefire_1481978365346806644137tmp
Running org.apache.hadoop.hbase.util.TestIdLock
Tests run: 1, Failures: 0, Errors: 0, Skipped: 0, Time elapsed: 17.281 sec
Forking command line: /bin/sh -c cd /x1/jenkins/jenkins-slave/workspace/HBase-0.94-security
&& /x1/jenkins/tools/java/jdk1.6.0_45-32/jre/bin/java -enableassertions -Xmx1900m
-Djava.security.egd=file:/dev/./urandom -jar /x1/jenkins/jenkins-slave/workspace/HBase-0.94-security/target/surefire/surefirebooter2506306267377735680.jar
/x1/jenkins/jenkins-slave/workspace/HBase-0.94-security/target/surefire/surefire3354516317627088426tmp
/x1/jenkins/jenkins-slave/workspace/HBase-0.94-security/target/surefire/surefire_1496717065590067224742tmp
Running org.apache.hadoop.hbase.util.TestMergeTable
Tests run: 1, Failures: 0, Errors: 0, Skipped: 0, Time elapsed: 61.945 sec
Forking command line: /bin/sh -c cd /x1/jenkins/jenkins-slave/workspace/HBase-0.94-security
&& /x1/jenkins/tools/java/jdk1.6.0_45-32/jre/bin/java -enableassertions -Xmx1900m
-Djava.security.egd=file:/dev/./urandom -jar /x1/jenkins/jenkins-slave/workspace/HBase-0.94-security/target/surefire/surefirebooter1879458685075129891.jar
/x1/jenkins/jenkins-slave/workspace/HBase-0.94-security/target/surefire/surefire9215780212021764826tmp
/x1/jenkins/jenkins-slave/workspace/HBase-0.94-security/target/surefire/surefire_1501381590215735859707tmp
Running org.apache.hadoop.hbase.util.TestPoolMap$TestRoundRobinPoolType
Tests run: 3, Failures: 0, Errors: 0, Skipped: 0, Time elapsed: 0.166 sec
Running org.apache.hadoop.hbase.util.TestPoolMap$TestThreadLocalPoolType
Tests run: 3, Failures: 0, Errors: 0, Skipped: 0, Time elapsed: 0.159 sec
Running org.apache.hadoop.hbase.util.TestPoolMap$TestReusablePoolType
Tests run: 3, Failures: 0, Errors: 0, Skipped: 0, Time elapsed: 0.449 sec
Forking command line: /bin/sh -c cd /x1/jenkins/jenkins-slave/workspace/HBase-0.94-security
&& /x1/jenkins/tools/java/jdk1.6.0_45-32/jre/bin/java -enableassertions -Xmx1900m
-Djava.security.egd=file:/dev/./urandom -jar /x1/jenkins/jenkins-slave/workspace/HBase-0.94-security/target/surefire/surefirebooter3888119793665288081.jar
/x1/jenkins/jenkins-slave/workspace/HBase-0.94-security/target/surefire/surefire4450764693401936076tmp
/x1/jenkins/jenkins-slave/workspace/HBase-0.94-security/target/surefire/surefire_1515756474842383184497tmp
Running org.apache.hadoop.hbase.util.TestFSUtils
Tests run: 4, Failures: 0, Errors: 0, Skipped: 0, Time elapsed: 56.042 sec
Forking command line: /bin/sh -c cd /x1/jenkins/jenkins-slave/workspace/HBase-0.94-security
&& /x1/jenkins/tools/java/jdk1.6.0_45-32/jre/bin/java -enableassertions -Xmx1900m
-Djava.security.egd=file:/dev/./urandom -jar /x1/jenkins/jenkins-slave/workspace/HBase-0.94-security/target/surefire/surefirebooter8056554244787729576.jar
/x1/jenkins/jenkins-slave/workspace/HBase-0.94-security/target/surefire/surefire165871612871096271tmp
/x1/jenkins/jenkins-slave/workspace/HBase-0.94-security/target/surefire/surefire_1522556122871411430546tmp
Running org.apache.hadoop.hbase.util.TestCoprocessorScanPolicy
Tests run: 2, Failures: 0, Errors: 0, Skipped: 0, Time elapsed: 37.52 sec
Forking command line: /bin/sh -c cd /x1/jenkins/jenkins-slave/workspace/HBase-0.94-security
&& /x1/jenkins/tools/java/jdk1.6.0_45-32/jre/bin/java -enableassertions -Xmx1900m
-Djava.security.egd=file:/dev/./urandom -jar /x1/jenkins/jenkins-slave/workspace/HBase-0.94-security/target/surefire/surefirebooter7914761862302761108.jar
/x1/jenkins/jenkins-slave/workspace/HBase-0.94-security/target/surefire/surefire5138413539022979161tmp
/x1/jenkins/jenkins-slave/workspace/HBase-0.94-security/target/surefire/surefire_1536494926096155037763tmp
Running org.apache.hadoop.hbase.util.TestFSVisitor
Tests run: 3, Failures: 0, Errors: 0, Skipped: 0, Time elapsed: 5.181 sec
Forking command line: /bin/sh -c cd /x1/jenkins/jenkins-slave/workspace/HBase-0.94-security
&& /x1/jenkins/tools/java/jdk1.6.0_45-32/jre/bin/java -enableassertions -Xmx1900m
-Djava.security.egd=file:/dev/./urandom -jar /x1/jenkins/jenkins-slave/workspace/HBase-0.94-security/target/surefire/surefirebooter1799993094527951722.jar
/x1/jenkins/jenkins-slave/workspace/HBase-0.94-security/target/surefire/surefire7313528172127080374tmp
/x1/jenkins/jenkins-slave/workspace/HBase-0.94-security/target/surefire/surefire_1547581091685693598267tmp
Running org.apache.hadoop.hbase.util.TestRegionSplitter
Tests run: 5, Failures: 0, Errors: 0, Skipped: 0, Time elapsed: 46.821 sec
Forking command line: /bin/sh -c cd /x1/jenkins/jenkins-slave/workspace/HBase-0.94-security
&& /x1/jenkins/tools/java/jdk1.6.0_45-32/jre/bin/java -enableassertions -Xmx1900m
-Djava.security.egd=file:/dev/./urandom -jar /x1/jenkins/jenkins-slave/workspace/HBase-0.94-security/target/surefire/surefirebooter3615789400528914825.jar
/x1/jenkins/jenkins-slave/workspace/HBase-0.94-security/target/surefire/surefire5548112812855295642tmp
/x1/jenkins/jenkins-slave/workspace/HBase-0.94-security/target/surefire/surefire_1555902028114127961370tmp
Running org.apache.hadoop.hbase.util.hbck.TestOfflineMetaRebuildOverlap
Tests run: 1, Failures: 0, Errors: 0, Skipped: 0, Time elapsed: 64.039 sec
Forking command line: /bin/sh -c cd /x1/jenkins/jenkins-slave/workspace/HBase-0.94-security
&& /x1/jenkins/tools/java/jdk1.6.0_45-32/jre/bin/java -enableassertions -Xmx1900m
-Djava.security.egd=file:/dev/./urandom -jar /x1/jenkins/jenkins-slave/workspace/HBase-0.94-security/target/surefire/surefirebooter7565989164661563284.jar
/x1/jenkins/jenkins-slave/workspace/HBase-0.94-security/target/surefire/surefire5110284879402823500tmp
/x1/jenkins/jenkins-slave/workspace/HBase-0.94-security/target/surefire/surefire_1566528070625444408779tmp
Running org.apache.hadoop.hbase.util.hbck.TestOfflineMetaRebuildBase
Tests run: 1, Failures: 0, Errors: 0, Skipped: 0, Time elapsed: 70.618 sec
Forking command line: /bin/sh -c cd /x1/jenkins/jenkins-slave/workspace/HBase-0.94-security
&& /x1/jenkins/tools/java/jdk1.6.0_45-32/jre/bin/java -enableassertions -Xmx1900m
-Djava.security.egd=file:/dev/./urandom -jar /x1/jenkins/jenkins-slave/workspace/HBase-0.94-security/target/surefire/surefirebooter5048511984934791379.jar
/x1/jenkins/jenkins-slave/workspace/HBase-0.94-security/target/surefire/surefire1763414418889531622tmp
/x1/jenkins/jenkins-slave/workspace/HBase-0.94-security/target/surefire/surefire_157662242685414174514tmp
Running org.apache.hadoop.hbase.util.TestDefaultEnvironmentEdge
Tests run: 1, Failures: 0, Errors: 0, Skipped: 0, Time elapsed: 0.802 sec
Forking command line: /bin/sh -c cd /x1/jenkins/jenkins-slave/workspace/HBase-0.94-security
&& /x1/jenkins/tools/java/jdk1.6.0_45-32/jre/bin/java -enableassertions -Xmx1900m
-Djava.security.egd=file:/dev/./urandom -jar /x1/jenkins/jenkins-slave/workspace/HBase-0.94-security/target/surefire/surefirebooter7503711116913007297.jar
/x1/jenkins/jenkins-slave/workspace/HBase-0.94-security/target/surefire/surefire8930680642772184402tmp
/x1/jenkins/jenkins-slave/workspace/HBase-0.94-security/target/surefire/surefire_1585884295105459772898tmp
Running org.apache.hadoop.hbase.util.TestFSHDFSUtils
Tests run: 3, Failures: 0, Errors: 0, Skipped: 0, Time elapsed: 6.082 sec
Forking command line: /bin/sh -c cd /x1/jenkins/jenkins-slave/workspace/HBase-0.94-security
&& /x1/jenkins/tools/java/jdk1.6.0_45-32/jre/bin/java -enableassertions -Xmx1900m
-Djava.security.egd=file:/dev/./urandom -jar /x1/jenkins/jenkins-slave/workspace/HBase-0.94-security/target/surefire/surefirebooter3965067660605248051.jar
/x1/jenkins/jenkins-slave/workspace/HBase-0.94-security/target/surefire/surefire2158680364274896332tmp
/x1/jenkins/jenkins-slave/workspace/HBase-0.94-security/target/surefire/surefire_159887352491085839163tmp
Running org.apache.hadoop.hbase.util.hbck.TestOfflineMetaRebuildHole
Tests run: 1, Failures: 0, Errors: 0, Skipped: 0, Time elapsed: 68.187 sec
Forking command line: /bin/sh -c cd /x1/jenkins/jenkins-slave/workspace/HBase-0.94-security
&& /x1/jenkins/tools/java/jdk1.6.0_45-32/jre/bin/java -enableassertions -Xmx1900m
-Djava.security.egd=file:/dev/./urandom -jar /x1/jenkins/jenkins-slave/workspace/HBase-0.94-security/target/surefire/surefirebooter1678759097984136551.jar
/x1/jenkins/jenkins-slave/workspace/HBase-0.94-security/target/surefire/surefire8411486270197856121tmp
/x1/jenkins/jenkins-slave/workspace/HBase-0.94-security/target/surefire/surefire_1605806099661250387500tmp
Running org.apache.hadoop.hbase.TestInfoServers
Tests run: 3, Failures: 0, Errors: 0, Skipped: 0, Time elapsed: 31.21 sec

Results :

Failed tests:   testExceptionFromCoprocessorDuringPut(org.apache.hadoop.hbase.coprocessor.TestRegionServerCoprocessorExceptionWithAbort):
The put should have failed, as the coprocessor is buggy

Tests run: 923, Failures: 1, Errors: 0, Skipped: 2

[INFO] ------------------------------------------------------------------------
[INFO] BUILD FAILURE
[INFO] ------------------------------------------------------------------------
[INFO] Total time: 1:40:23.019s
[INFO] Finished at: Sat Aug 02 22:12:25 UTC 2014
[INFO] Final Memory: 63M/1040M
[INFO] ------------------------------------------------------------------------
[ERROR] Failed to execute goal org.apache.maven.plugins:maven-surefire-plugin:2.12-TRUNK-HBASE-2:test
(secondPartTestsExecution) on project hbase: Failure or timeout -> [Help 1]
org.apache.maven.lifecycle.LifecycleExecutionException: Failed to execute goal org.apache.maven.plugins:maven-surefire-plugin:2.12-TRUNK-HBASE-2:test
(secondPartTestsExecution) on project hbase: Failure or timeout
	at org.apache.maven.lifecycle.internal.MojoExecutor.execute(MojoExecutor.java:217)
	at org.apache.maven.lifecycle.internal.MojoExecutor.execute(MojoExecutor.java:153)
	at org.apache.maven.lifecycle.internal.MojoExecutor.execute(MojoExecutor.java:145)
	at org.apache.maven.lifecycle.internal.MojoExecutor.executeForkedExecutions(MojoExecutor.java:365)
	at org.apache.maven.lifecycle.internal.MojoExecutor.execute(MojoExecutor.java:199)
	at org.apache.maven.lifecycle.internal.MojoExecutor.execute(MojoExecutor.java:153)
	at org.apache.maven.lifecycle.internal.MojoExecutor.execute(MojoExecutor.java:145)
	at org.apache.maven.lifecycle.internal.LifecycleModuleBuilder.buildProject(LifecycleModuleBuilder.java:84)
	at org.apache.maven.lifecycle.internal.LifecycleModuleBuilder.buildProject(LifecycleModuleBuilder.java:59)
	at org.apache.maven.lifecycle.internal.LifecycleStarter.singleThreadedBuild(LifecycleStarter.java:183)
	at org.apache.maven.lifecycle.internal.LifecycleStarter.execute(LifecycleStarter.java:161)
	at org.apache.maven.DefaultMaven.doExecute(DefaultMaven.java:320)
	at org.apache.maven.DefaultMaven.execute(DefaultMaven.java:156)
	at org.apache.maven.cli.MavenCli.execute(MavenCli.java:537)
	at org.apache.maven.cli.MavenCli.doMain(MavenCli.java:196)
	at org.apache.maven.cli.MavenCli.main(MavenCli.java:141)
	at sun.reflect.NativeMethodAccessorImpl.invoke0(Native Method)
	at sun.reflect.NativeMethodAccessorImpl.invoke(NativeMethodAccessorImpl.java:39)
	at sun.reflect.DelegatingMethodAccessorImpl.invoke(DelegatingMethodAccessorImpl.java:25)
	at java.lang.reflect.Method.invoke(Method.java:597)
	at org.codehaus.plexus.classworlds.launcher.Launcher.launchEnhanced(Launcher.java:290)
	at org.codehaus.plexus.classworlds.launcher.Launcher.launch(Launcher.java:230)
	at org.codehaus.plexus.classworlds.launcher.Launcher.mainWithExitCode(Launcher.java:409)
	at org.codehaus.plexus.classworlds.launcher.Launcher.main(Launcher.java:352)
Caused by: org.apache.maven.plugin.MojoExecutionException: Failure or timeout
	at org.apache.maven.plugin.surefire.SurefirePlugin.assertNoFailureOrTimeout(SurefirePlugin.java:643)
	at org.apache.maven.plugin.surefire.SurefirePlugin.handleSummary(SurefirePlugin.java:624)
	at org.apache.maven.plugin.surefire.AbstractSurefireMojo.executeAfterPreconditionsChecked(AbstractSurefireMojo.java:137)
	at org.apache.maven.plugin.surefire.AbstractSurefireMojo.execute(AbstractSurefireMojo.java:98)
	at org.apache.maven.plugin.DefaultBuildPluginManager.executeMojo(DefaultBuildPluginManager.java:101)
	at org.apache.maven.lifecycle.internal.MojoExecutor.execute(MojoExecutor.java:209)
	... 23 more
[ERROR] 
[ERROR] 
[ERROR] For more information about the errors and possible solutions, please read the following
articles:
[ERROR] [Help 1] http://cwiki.apache.org/confluence/display/MAVEN/MojoExecutionException
Build step 'Invoke top-level Maven targets' marked build as failure
Archiving artifacts
Sending artifact delta relative to HBase-0.94-security #503
Archived 953 artifacts
Archive block size is 32768
Received 10 blocks and 106007896 bytes
Compression is 0.3%
Took 1 min 35 sec
Recording test results

Mime
View raw message