hbase-builds mailing list archives

Site index · List index
Message view « Date » · « Thread »
Top « Date » · « Thread »
From Apache Jenkins Server <jenk...@builds.apache.org>
Subject Build failed in Jenkins: HBase-0.94-security #508
Date Tue, 05 Aug 2014 21:32:08 GMT
See <https://builds.apache.org/job/HBase-0.94-security/508/changes>

Changes:

[larsh] HBASE-11641 TestDistributedLogSplitting.testMasterStartsUpWithLogSplittingWork fails
frequently.

------------------------------------------
[...truncated 43726 lines...]
Running org.apache.hadoop.hbase.regionserver.TestBlocksRead
Tests run: 4, Failures: 0, Errors: 0, Skipped: 0, Time elapsed: 2.709 sec
Forking command line: /bin/sh -c cd /x1/jenkins/jenkins-slave/workspace/HBase-0.94-security
&& /x1/jenkins/tools/java/jdk1.6.0_45-32/jre/bin/java -enableassertions -Xmx1900m
-Djava.security.egd=file:/dev/./urandom -jar /x1/jenkins/jenkins-slave/workspace/HBase-0.94-security/target/surefire/surefirebooter7783941595935038632.jar
/x1/jenkins/jenkins-slave/workspace/HBase-0.94-security/target/surefire/surefire619728563751663692tmp
/x1/jenkins/jenkins-slave/workspace/HBase-0.94-security/target/surefire/surefire_1004676738557884464698tmp
Running org.apache.hadoop.hbase.regionserver.TestSplitLogWorker
Tests run: 5, Failures: 0, Errors: 0, Skipped: 0, Time elapsed: 5.082 sec
Forking command line: /bin/sh -c cd /x1/jenkins/jenkins-slave/workspace/HBase-0.94-security
&& /x1/jenkins/tools/java/jdk1.6.0_45-32/jre/bin/java -enableassertions -Xmx1900m
-Djava.security.egd=file:/dev/./urandom -jar /x1/jenkins/jenkins-slave/workspace/HBase-0.94-security/target/surefire/surefirebooter7736870619948681049.jar
/x1/jenkins/jenkins-slave/workspace/HBase-0.94-security/target/surefire/surefire941653611647562578tmp
/x1/jenkins/jenkins-slave/workspace/HBase-0.94-security/target/surefire/surefire_1011687761369999925323tmp
Running org.apache.hadoop.hbase.regionserver.TestStoreScanner
Tests run: 16, Failures: 0, Errors: 0, Skipped: 0, Time elapsed: 0.102 sec
Forking command line: /bin/sh -c cd /x1/jenkins/jenkins-slave/workspace/HBase-0.94-security
&& /x1/jenkins/tools/java/jdk1.6.0_45-32/jre/bin/java -enableassertions -Xmx1900m
-Djava.security.egd=file:/dev/./urandom -jar /x1/jenkins/jenkins-slave/workspace/HBase-0.94-security/target/surefire/surefirebooter2158905706501163497.jar
/x1/jenkins/jenkins-slave/workspace/HBase-0.94-security/target/surefire/surefire7626411087087108792tmp
/x1/jenkins/jenkins-slave/workspace/HBase-0.94-security/target/surefire/surefire_1023664050067261912876tmp
Running org.apache.hadoop.hbase.regionserver.handler.TestOpenRegionHandler
Tests run: 4, Failures: 0, Errors: 0, Skipped: 0, Time elapsed: 27.086 sec
Forking command line: /bin/sh -c cd /x1/jenkins/jenkins-slave/workspace/HBase-0.94-security
&& /x1/jenkins/tools/java/jdk1.6.0_45-32/jre/bin/java -enableassertions -Xmx1900m
-Djava.security.egd=file:/dev/./urandom -jar /x1/jenkins/jenkins-slave/workspace/HBase-0.94-security/target/surefire/surefirebooter1362862970068306083.jar
/x1/jenkins/jenkins-slave/workspace/HBase-0.94-security/target/surefire/surefire8059940952498766077tmp
/x1/jenkins/jenkins-slave/workspace/HBase-0.94-security/target/surefire/surefire_1031860831106311886820tmp
Running org.apache.hadoop.hbase.regionserver.metrics.TestSchemaMetrics
Tests run: 6, Failures: 0, Errors: 0, Skipped: 0, Time elapsed: 26.387 sec
Forking command line: /bin/sh -c cd /x1/jenkins/jenkins-slave/workspace/HBase-0.94-security
&& /x1/jenkins/tools/java/jdk1.6.0_45-32/jre/bin/java -enableassertions -Xmx1900m
-Djava.security.egd=file:/dev/./urandom -jar /x1/jenkins/jenkins-slave/workspace/HBase-0.94-security/target/surefire/surefirebooter7921916164886325407.jar
/x1/jenkins/jenkins-slave/workspace/HBase-0.94-security/target/surefire/surefire17680195185457991tmp
/x1/jenkins/jenkins-slave/workspace/HBase-0.94-security/target/surefire/surefire_1048613707291166015197tmp
Running org.apache.hadoop.hbase.regionserver.TestStoreFileBlockCacheSummary
Tests run: 1, Failures: 0, Errors: 0, Skipped: 0, Time elapsed: 32.216 sec
Forking command line: /bin/sh -c cd /x1/jenkins/jenkins-slave/workspace/HBase-0.94-security
&& /x1/jenkins/tools/java/jdk1.6.0_45-32/jre/bin/java -enableassertions -Xmx1900m
-Djava.security.egd=file:/dev/./urandom -jar /x1/jenkins/jenkins-slave/workspace/HBase-0.94-security/target/surefire/surefirebooter5635072016943320937.jar
/x1/jenkins/jenkins-slave/workspace/HBase-0.94-security/target/surefire/surefire2593717764890967519tmp
/x1/jenkins/jenkins-slave/workspace/HBase-0.94-security/target/surefire/surefire_1051470756541805447419tmp
Running org.apache.hadoop.hbase.regionserver.TestMasterAddressManager
Tests run: 1, Failures: 0, Errors: 0, Skipped: 0, Time elapsed: 2.237 sec
Forking command line: /bin/sh -c cd /x1/jenkins/jenkins-slave/workspace/HBase-0.94-security
&& /x1/jenkins/tools/java/jdk1.6.0_45-32/jre/bin/java -enableassertions -Xmx1900m
-Djava.security.egd=file:/dev/./urandom -jar /x1/jenkins/jenkins-slave/workspace/HBase-0.94-security/target/surefire/surefirebooter437515645889698820.jar
/x1/jenkins/jenkins-slave/workspace/HBase-0.94-security/target/surefire/surefire4070826248916244758tmp
/x1/jenkins/jenkins-slave/workspace/HBase-0.94-security/target/surefire/surefire_1068963442221671293856tmp
Running org.apache.hadoop.hbase.regionserver.TestMultiColumnScanner
Tests run: 12, Failures: 0, Errors: 0, Skipped: 0, Time elapsed: 78.243 sec
Forking command line: /bin/sh -c cd /x1/jenkins/jenkins-slave/workspace/HBase-0.94-security
&& /x1/jenkins/tools/java/jdk1.6.0_45-32/jre/bin/java -enableassertions -Xmx1900m
-Djava.security.egd=file:/dev/./urandom -jar /x1/jenkins/jenkins-slave/workspace/HBase-0.94-security/target/surefire/surefirebooter5892952614980661217.jar
/x1/jenkins/jenkins-slave/workspace/HBase-0.94-security/target/surefire/surefire60855276240134544tmp
/x1/jenkins/jenkins-slave/workspace/HBase-0.94-security/target/surefire/surefire_1073406028358396683785tmp
Running org.apache.hadoop.hbase.regionserver.TestHRegion
Tests run: 75, Failures: 0, Errors: 0, Skipped: 0, Time elapsed: 106.656 sec
Forking command line: /bin/sh -c cd /x1/jenkins/jenkins-slave/workspace/HBase-0.94-security
&& /x1/jenkins/tools/java/jdk1.6.0_45-32/jre/bin/java -enableassertions -Xmx1900m
-Djava.security.egd=file:/dev/./urandom -jar /x1/jenkins/jenkins-slave/workspace/HBase-0.94-security/target/surefire/surefirebooter8436134226699868705.jar
/x1/jenkins/jenkins-slave/workspace/HBase-0.94-security/target/surefire/surefire6704328704551339503tmp
/x1/jenkins/jenkins-slave/workspace/HBase-0.94-security/target/surefire/surefire_1081772736631516664336tmp
Running org.apache.hadoop.hbase.TestLocalHBaseCluster
Tests run: 1, Failures: 0, Errors: 0, Skipped: 0, Time elapsed: 16.048 sec
Forking command line: /bin/sh -c cd /x1/jenkins/jenkins-slave/workspace/HBase-0.94-security
&& /x1/jenkins/tools/java/jdk1.6.0_45-32/jre/bin/java -enableassertions -Xmx1900m
-Djava.security.egd=file:/dev/./urandom -jar /x1/jenkins/jenkins-slave/workspace/HBase-0.94-security/target/surefire/surefirebooter3657301588881267365.jar
/x1/jenkins/jenkins-slave/workspace/HBase-0.94-security/target/surefire/surefire9219385358288753297tmp
/x1/jenkins/jenkins-slave/workspace/HBase-0.94-security/target/surefire/surefire_109260427254329918015tmp
Running org.apache.hadoop.hbase.ipc.TestDelayedRpc
Tests run: 4, Failures: 0, Errors: 0, Skipped: 0, Time elapsed: 4.668 sec
Forking command line: /bin/sh -c cd /x1/jenkins/jenkins-slave/workspace/HBase-0.94-security
&& /x1/jenkins/tools/java/jdk1.6.0_45-32/jre/bin/java -enableassertions -Xmx1900m
-Djava.security.egd=file:/dev/./urandom -jar /x1/jenkins/jenkins-slave/workspace/HBase-0.94-security/target/surefire/surefirebooter643416127071806634.jar
/x1/jenkins/jenkins-slave/workspace/HBase-0.94-security/target/surefire/surefire8675297033716648030tmp
/x1/jenkins/jenkins-slave/workspace/HBase-0.94-security/target/surefire/surefire_1103911428798831673151tmp
Running org.apache.hadoop.hbase.ipc.TestPBOnWritableRpc
Tests run: 1, Failures: 0, Errors: 0, Skipped: 0, Time elapsed: 2.019 sec
Forking command line: /bin/sh -c cd /x1/jenkins/jenkins-slave/workspace/HBase-0.94-security
&& /x1/jenkins/tools/java/jdk1.6.0_45-32/jre/bin/java -enableassertions -Xmx1900m
-Djava.security.egd=file:/dev/./urandom -jar /x1/jenkins/jenkins-slave/workspace/HBase-0.94-security/target/surefire/surefirebooter3279094061926603289.jar
/x1/jenkins/jenkins-slave/workspace/HBase-0.94-security/target/surefire/surefire6219881772153863409tmp
/x1/jenkins/jenkins-slave/workspace/HBase-0.94-security/target/surefire/surefire_1111564966035616783404tmp
Running org.apache.hadoop.hbase.TestGlobalMemStoreSize
Tests run: 1, Failures: 0, Errors: 0, Skipped: 0, Time elapsed: 47.978 sec
Forking command line: /bin/sh -c cd /x1/jenkins/jenkins-slave/workspace/HBase-0.94-security
&& /x1/jenkins/tools/java/jdk1.6.0_45-32/jre/bin/java -enableassertions -Xmx1900m
-Djava.security.egd=file:/dev/./urandom -jar /x1/jenkins/jenkins-slave/workspace/HBase-0.94-security/target/surefire/surefirebooter2759359276034595367.jar
/x1/jenkins/jenkins-slave/workspace/HBase-0.94-security/target/surefire/surefire4873053000145337154tmp
/x1/jenkins/jenkins-slave/workspace/HBase-0.94-security/target/surefire/surefire_112746947466971045496tmp
Running org.apache.hadoop.hbase.constraint.TestConstraint
Tests run: 5, Failures: 0, Errors: 0, Skipped: 0, Time elapsed: 54.876 sec
Forking command line: /bin/sh -c cd /x1/jenkins/jenkins-slave/workspace/HBase-0.94-security
&& /x1/jenkins/tools/java/jdk1.6.0_45-32/jre/bin/java -enableassertions -Xmx1900m
-Djava.security.egd=file:/dev/./urandom -jar /x1/jenkins/jenkins-slave/workspace/HBase-0.94-security/target/surefire/surefirebooter9043630138583526283.jar
/x1/jenkins/jenkins-slave/workspace/HBase-0.94-security/target/surefire/surefire7420273645800315983tmp
/x1/jenkins/jenkins-slave/workspace/HBase-0.94-security/target/surefire/surefire_1132979155205965612557tmp
Running org.apache.hadoop.hbase.backup.TestHFileArchiving
Tests run: 5, Failures: 0, Errors: 0, Skipped: 0, Time elapsed: 217.71 sec
Forking command line: /bin/sh -c cd /x1/jenkins/jenkins-slave/workspace/HBase-0.94-security
&& /x1/jenkins/tools/java/jdk1.6.0_45-32/jre/bin/java -enableassertions -Xmx1900m
-Djava.security.egd=file:/dev/./urandom -jar /x1/jenkins/jenkins-slave/workspace/HBase-0.94-security/target/surefire/surefirebooter4267491323260438109.jar
/x1/jenkins/jenkins-slave/workspace/HBase-0.94-security/target/surefire/surefire3124943349816137477tmp
/x1/jenkins/jenkins-slave/workspace/HBase-0.94-security/target/surefire/surefire_1147875130608785408736tmp
Running org.apache.hadoop.hbase.rest.TestSchemaResource
Tests run: 2, Failures: 0, Errors: 0, Skipped: 0, Time elapsed: 40.919 sec
Forking command line: /bin/sh -c cd /x1/jenkins/jenkins-slave/workspace/HBase-0.94-security
&& /x1/jenkins/tools/java/jdk1.6.0_45-32/jre/bin/java -enableassertions -Xmx1900m
-Djava.security.egd=file:/dev/./urandom -jar /x1/jenkins/jenkins-slave/workspace/HBase-0.94-security/target/surefire/surefirebooter8857251934270016836.jar
/x1/jenkins/jenkins-slave/workspace/HBase-0.94-security/target/surefire/surefire7623788141904422991tmp
/x1/jenkins/jenkins-slave/workspace/HBase-0.94-security/target/surefire/surefire_1157368403896907304032tmp
Running org.apache.hadoop.hbase.rest.client.TestRemoteAdmin
Tests run: 5, Failures: 0, Errors: 0, Skipped: 0, Time elapsed: 37.349 sec
Forking command line: /bin/sh -c cd /x1/jenkins/jenkins-slave/workspace/HBase-0.94-security
&& /x1/jenkins/tools/java/jdk1.6.0_45-32/jre/bin/java -enableassertions -Xmx1900m
-Djava.security.egd=file:/dev/./urandom -jar /x1/jenkins/jenkins-slave/workspace/HBase-0.94-security/target/surefire/surefirebooter786720596607605545.jar
/x1/jenkins/jenkins-slave/workspace/HBase-0.94-security/target/surefire/surefire1181691783535726661tmp
/x1/jenkins/jenkins-slave/workspace/HBase-0.94-security/target/surefire/surefire_1168565412830123737894tmp
Running org.apache.hadoop.hbase.rest.client.TestRemoteTable
Tests run: 9, Failures: 0, Errors: 0, Skipped: 0, Time elapsed: 83.869 sec
Forking command line: /bin/sh -c cd /x1/jenkins/jenkins-slave/workspace/HBase-0.94-security
&& /x1/jenkins/tools/java/jdk1.6.0_45-32/jre/bin/java -enableassertions -Xmx1900m
-Djava.security.egd=file:/dev/./urandom -jar /x1/jenkins/jenkins-slave/workspace/HBase-0.94-security/target/surefire/surefirebooter386941438380506903.jar
/x1/jenkins/jenkins-slave/workspace/HBase-0.94-security/target/surefire/surefire1747319229517765228tmp
/x1/jenkins/jenkins-slave/workspace/HBase-0.94-security/target/surefire/surefire_1173070322495750355855tmp
Running org.apache.hadoop.hbase.rest.TestTableResource
Tests run: 8, Failures: 0, Errors: 0, Skipped: 0, Time elapsed: 60.509 sec
Forking command line: /bin/sh -c cd /x1/jenkins/jenkins-slave/workspace/HBase-0.94-security
&& /x1/jenkins/tools/java/jdk1.6.0_45-32/jre/bin/java -enableassertions -Xmx1900m
-Djava.security.egd=file:/dev/./urandom -jar /x1/jenkins/jenkins-slave/workspace/HBase-0.94-security/target/surefire/surefirebooter5306811744171271220.jar
/x1/jenkins/jenkins-slave/workspace/HBase-0.94-security/target/surefire/surefire5467433399930139714tmp
/x1/jenkins/jenkins-slave/workspace/HBase-0.94-security/target/surefire/surefire_1184164028241353148458tmp
Running org.apache.hadoop.hbase.rest.TestMultiRowResource
Tests run: 3, Failures: 0, Errors: 0, Skipped: 0, Time elapsed: 31.356 sec
Forking command line: /bin/sh -c cd /x1/jenkins/jenkins-slave/workspace/HBase-0.94-security
&& /x1/jenkins/tools/java/jdk1.6.0_45-32/jre/bin/java -enableassertions -Xmx1900m
-Djava.security.egd=file:/dev/./urandom -jar /x1/jenkins/jenkins-slave/workspace/HBase-0.94-security/target/surefire/surefirebooter2516421709320271539.jar
/x1/jenkins/jenkins-slave/workspace/HBase-0.94-security/target/surefire/surefire1842044148951496808tmp
/x1/jenkins/jenkins-slave/workspace/HBase-0.94-security/target/surefire/surefire_1194333706202210866306tmp
Running org.apache.hadoop.hbase.rest.TestGzipFilter
Tests run: 2, Failures: 0, Errors: 0, Skipped: 0, Time elapsed: 32.511 sec
Forking command line: /bin/sh -c cd /x1/jenkins/jenkins-slave/workspace/HBase-0.94-security
&& /x1/jenkins/tools/java/jdk1.6.0_45-32/jre/bin/java -enableassertions -Xmx1900m
-Djava.security.egd=file:/dev/./urandom -jar /x1/jenkins/jenkins-slave/workspace/HBase-0.94-security/target/surefire/surefirebooter1954670905920187904.jar
/x1/jenkins/jenkins-slave/workspace/HBase-0.94-security/target/surefire/surefire6784448238807644479tmp
/x1/jenkins/jenkins-slave/workspace/HBase-0.94-security/target/surefire/surefire_1201601876011964582405tmp
Running org.apache.hadoop.hbase.rest.TestRowResource
Tests run: 12, Failures: 0, Errors: 0, Skipped: 0, Time elapsed: 44.954 sec
Forking command line: /bin/sh -c cd /x1/jenkins/jenkins-slave/workspace/HBase-0.94-security
&& /x1/jenkins/tools/java/jdk1.6.0_45-32/jre/bin/java -enableassertions -Xmx1900m
-Djava.security.egd=file:/dev/./urandom -jar /x1/jenkins/jenkins-slave/workspace/HBase-0.94-security/target/surefire/surefirebooter4640033201095449484.jar
/x1/jenkins/jenkins-slave/workspace/HBase-0.94-security/target/surefire/surefire660113945766314571tmp
/x1/jenkins/jenkins-slave/workspace/HBase-0.94-security/target/surefire/surefire_1217639316035148250950tmp
Running org.apache.hadoop.hbase.rest.TestVersionResource
Tests run: 7, Failures: 0, Errors: 0, Skipped: 0, Time elapsed: 26.655 sec
Forking command line: /bin/sh -c cd /x1/jenkins/jenkins-slave/workspace/HBase-0.94-security
&& /x1/jenkins/tools/java/jdk1.6.0_45-32/jre/bin/java -enableassertions -Xmx1900m
-Djava.security.egd=file:/dev/./urandom -jar /x1/jenkins/jenkins-slave/workspace/HBase-0.94-security/target/surefire/surefirebooter2061817644162741783.jar
/x1/jenkins/jenkins-slave/workspace/HBase-0.94-security/target/surefire/surefire3720067365542338898tmp
/x1/jenkins/jenkins-slave/workspace/HBase-0.94-security/target/surefire/surefire_1222970572177101276077tmp
Running org.apache.hadoop.hbase.rest.TestScannerResource
Tests run: 5, Failures: 0, Errors: 0, Skipped: 0, Time elapsed: 82.085 sec
Forking command line: /bin/sh -c cd /x1/jenkins/jenkins-slave/workspace/HBase-0.94-security
&& /x1/jenkins/tools/java/jdk1.6.0_45-32/jre/bin/java -enableassertions -Xmx1900m
-Djava.security.egd=file:/dev/./urandom -jar /x1/jenkins/jenkins-slave/workspace/HBase-0.94-security/target/surefire/surefirebooter1621743132141918963.jar
/x1/jenkins/jenkins-slave/workspace/HBase-0.94-security/target/surefire/surefire6421152778814328566tmp
/x1/jenkins/jenkins-slave/workspace/HBase-0.94-security/target/surefire/surefire_1231444863449405693866tmp
Running org.apache.hadoop.hbase.rest.TestGZIPResponseWrapper
Tests run: 5, Failures: 0, Errors: 0, Skipped: 0, Time elapsed: 0.667 sec
Forking command line: /bin/sh -c cd /x1/jenkins/jenkins-slave/workspace/HBase-0.94-security
&& /x1/jenkins/tools/java/jdk1.6.0_45-32/jre/bin/java -enableassertions -Xmx1900m
-Djava.security.egd=file:/dev/./urandom -jar /x1/jenkins/jenkins-slave/workspace/HBase-0.94-security/target/surefire/surefirebooter1146778957555193397.jar
/x1/jenkins/jenkins-slave/workspace/HBase-0.94-security/target/surefire/surefire7889707154789660837tmp
/x1/jenkins/jenkins-slave/workspace/HBase-0.94-security/target/surefire/surefire_1242626593188112263200tmp
Running org.apache.hadoop.hbase.rest.TestStatusResource
Tests run: 2, Failures: 0, Errors: 0, Skipped: 0, Time elapsed: 26.216 sec
Forking command line: /bin/sh -c cd /x1/jenkins/jenkins-slave/workspace/HBase-0.94-security
&& /x1/jenkins/tools/java/jdk1.6.0_45-32/jre/bin/java -enableassertions -Xmx1900m
-Djava.security.egd=file:/dev/./urandom -jar /x1/jenkins/jenkins-slave/workspace/HBase-0.94-security/target/surefire/surefirebooter4498754356480653883.jar
/x1/jenkins/jenkins-slave/workspace/HBase-0.94-security/target/surefire/surefire1157088867317537354tmp
/x1/jenkins/jenkins-slave/workspace/HBase-0.94-security/target/surefire/surefire_1257796794116611143482tmp
Running org.apache.hadoop.hbase.TestHBaseFileSystem
Tests run: 2, Failures: 0, Errors: 0, Skipped: 0, Time elapsed: 29.34 sec
Forking command line: /bin/sh -c cd /x1/jenkins/jenkins-slave/workspace/HBase-0.94-security
&& /x1/jenkins/tools/java/jdk1.6.0_45-32/jre/bin/java -enableassertions -Xmx1900m
-Djava.security.egd=file:/dev/./urandom -jar /x1/jenkins/jenkins-slave/workspace/HBase-0.94-security/target/surefire/surefirebooter9069841068457113287.jar
/x1/jenkins/jenkins-slave/workspace/HBase-0.94-security/target/surefire/surefire7236192087797674082tmp
/x1/jenkins/jenkins-slave/workspace/HBase-0.94-security/target/surefire/surefire_1261141975920694722406tmp
Running org.apache.hadoop.hbase.metrics.TestMetricsMBeanBase
Tests run: 3, Failures: 0, Errors: 0, Skipped: 0, Time elapsed: 1.537 sec
Forking command line: /bin/sh -c cd /x1/jenkins/jenkins-slave/workspace/HBase-0.94-security
&& /x1/jenkins/tools/java/jdk1.6.0_45-32/jre/bin/java -enableassertions -Xmx1900m
-Djava.security.egd=file:/dev/./urandom -jar /x1/jenkins/jenkins-slave/workspace/HBase-0.94-security/target/surefire/surefirebooter1703836761757824150.jar
/x1/jenkins/jenkins-slave/workspace/HBase-0.94-security/target/surefire/surefire1075976220663208466tmp
/x1/jenkins/jenkins-slave/workspace/HBase-0.94-security/target/surefire/surefire_1276962490895772148320tmp
Running org.apache.hadoop.hbase.rest.TestScannersWithFilters
Tests run: 10, Failures: 0, Errors: 0, Skipped: 0, Time elapsed: 47.662 sec
Forking command line: /bin/sh -c cd /x1/jenkins/jenkins-slave/workspace/HBase-0.94-security
&& /x1/jenkins/tools/java/jdk1.6.0_45-32/jre/bin/java -enableassertions -Xmx1900m
-Djava.security.egd=file:/dev/./urandom -jar /x1/jenkins/jenkins-slave/workspace/HBase-0.94-security/target/surefire/surefirebooter6827102543118133715.jar
/x1/jenkins/jenkins-slave/workspace/HBase-0.94-security/target/surefire/surefire7520085753513260855tmp
/x1/jenkins/jenkins-slave/workspace/HBase-0.94-security/target/surefire/surefire_1284810607147637015528tmp
Running org.apache.hadoop.hbase.io.hfile.TestHFileSeek
Tests run: 1, Failures: 0, Errors: 0, Skipped: 0, Time elapsed: 9.812 sec
Forking command line: /bin/sh -c cd /x1/jenkins/jenkins-slave/workspace/HBase-0.94-security
&& /x1/jenkins/tools/java/jdk1.6.0_45-32/jre/bin/java -enableassertions -Xmx1900m
-Djava.security.egd=file:/dev/./urandom -jar /x1/jenkins/jenkins-slave/workspace/HBase-0.94-security/target/surefire/surefirebooter5310656368664348600.jar
/x1/jenkins/jenkins-slave/workspace/HBase-0.94-security/target/surefire/surefire2748342853511633958tmp
/x1/jenkins/jenkins-slave/workspace/HBase-0.94-security/target/surefire/surefire_1298747021758152892812tmp
Running org.apache.hadoop.hbase.io.hfile.TestLruBlockCache
Tests run: 16, Failures: 0, Errors: 0, Skipped: 0, Time elapsed: 2.526 sec
Forking command line: /bin/sh -c cd /x1/jenkins/jenkins-slave/workspace/HBase-0.94-security
&& /x1/jenkins/tools/java/jdk1.6.0_45-32/jre/bin/java -enableassertions -Xmx1900m
-Djava.security.egd=file:/dev/./urandom -jar /x1/jenkins/jenkins-slave/workspace/HBase-0.94-security/target/surefire/surefirebooter2907154630858752396.jar
/x1/jenkins/jenkins-slave/workspace/HBase-0.94-security/target/surefire/surefire7240094940713311742tmp
/x1/jenkins/jenkins-slave/workspace/HBase-0.94-security/target/surefire/surefire_130879899299844409124tmp
Running org.apache.hadoop.hbase.io.hfile.TestHFileBlockIndex
Tests run: 10, Failures: 0, Errors: 0, Skipped: 0, Time elapsed: 22.235 sec
Forking command line: /bin/sh -c cd /x1/jenkins/jenkins-slave/workspace/HBase-0.94-security
&& /x1/jenkins/tools/java/jdk1.6.0_45-32/jre/bin/java -enableassertions -Xmx1900m
-Djava.security.egd=file:/dev/./urandom -jar /x1/jenkins/jenkins-slave/workspace/HBase-0.94-security/target/surefire/surefirebooter1860598101067066950.jar
/x1/jenkins/jenkins-slave/workspace/HBase-0.94-security/target/surefire/surefire6770996243298525803tmp
/x1/jenkins/jenkins-slave/workspace/HBase-0.94-security/target/surefire/surefire_1312409041742305872576tmp
Running org.apache.hadoop.hbase.io.hfile.TestFixedFileTrailer
Tests run: 2, Failures: 0, Errors: 0, Skipped: 0, Time elapsed: 2.113 sec
Forking command line: /bin/sh -c cd /x1/jenkins/jenkins-slave/workspace/HBase-0.94-security
&& /x1/jenkins/tools/java/jdk1.6.0_45-32/jre/bin/java -enableassertions -Xmx1900m
-Djava.security.egd=file:/dev/./urandom -jar /x1/jenkins/jenkins-slave/workspace/HBase-0.94-security/target/surefire/surefirebooter855549406385924013.jar
/x1/jenkins/jenkins-slave/workspace/HBase-0.94-security/target/surefire/surefire6877364365408909740tmp
/x1/jenkins/jenkins-slave/workspace/HBase-0.94-security/target/surefire/surefire_1326670083120655442348tmp
Running org.apache.hadoop.hbase.io.hfile.TestHFilePerformance
Tests run: 1, Failures: 0, Errors: 0, Skipped: 0, Time elapsed: 9.612 sec
Forking command line: /bin/sh -c cd /x1/jenkins/jenkins-slave/workspace/HBase-0.94-security
&& /x1/jenkins/tools/java/jdk1.6.0_45-32/jre/bin/java -enableassertions -Xmx1900m
-Djava.security.egd=file:/dev/./urandom -jar /x1/jenkins/jenkins-slave/workspace/HBase-0.94-security/target/surefire/surefirebooter2607196064102888020.jar
/x1/jenkins/jenkins-slave/workspace/HBase-0.94-security/target/surefire/surefire4920245335201876818tmp
/x1/jenkins/jenkins-slave/workspace/HBase-0.94-security/target/surefire/surefire_1337653339236148203149tmp
Running org.apache.hadoop.hbase.io.hfile.TestHFileBlockCompatibility
Tests run: 10, Failures: 0, Errors: 0, Skipped: 0, Time elapsed: 3.422 sec
Forking command line: /bin/sh -c cd /x1/jenkins/jenkins-slave/workspace/HBase-0.94-security
&& /x1/jenkins/tools/java/jdk1.6.0_45-32/jre/bin/java -enableassertions -Xmx1900m
-Djava.security.egd=file:/dev/./urandom -jar /x1/jenkins/jenkins-slave/workspace/HBase-0.94-security/target/surefire/surefirebooter1729020945466526461.jar
/x1/jenkins/jenkins-slave/workspace/HBase-0.94-security/target/surefire/surefire769153763676281049tmp
/x1/jenkins/jenkins-slave/workspace/HBase-0.94-security/target/surefire/surefire_1344597594627967885862tmp
Running org.apache.hadoop.hbase.io.hfile.TestCacheOnWrite
Tests run: 36, Failures: 0, Errors: 0, Skipped: 0, Time elapsed: 65.595 sec
Forking command line: /bin/sh -c cd /x1/jenkins/jenkins-slave/workspace/HBase-0.94-security
&& /x1/jenkins/tools/java/jdk1.6.0_45-32/jre/bin/java -enableassertions -Xmx1900m
-Djava.security.egd=file:/dev/./urandom -jar /x1/jenkins/jenkins-slave/workspace/HBase-0.94-security/target/surefire/surefirebooter8972068912796363040.jar
/x1/jenkins/jenkins-slave/workspace/HBase-0.94-security/target/surefire/surefire7581132545330442173tmp
/x1/jenkins/jenkins-slave/workspace/HBase-0.94-security/target/surefire/surefire_135305820682834615114tmp
Running org.apache.hadoop.hbase.io.hfile.TestChecksum
Tests run: 3, Failures: 0, Errors: 0, Skipped: 0, Time elapsed: 2.162 sec
Forking command line: /bin/sh -c cd /x1/jenkins/jenkins-slave/workspace/HBase-0.94-security
&& /x1/jenkins/tools/java/jdk1.6.0_45-32/jre/bin/java -enableassertions -Xmx1900m
-Djava.security.egd=file:/dev/./urandom -jar /x1/jenkins/jenkins-slave/workspace/HBase-0.94-security/target/surefire/surefirebooter9184174770332370716.jar
/x1/jenkins/jenkins-slave/workspace/HBase-0.94-security/target/surefire/surefire3616042736737837432tmp
/x1/jenkins/jenkins-slave/workspace/HBase-0.94-security/target/surefire/surefire_1364331440983568723206tmp
Running org.apache.hadoop.hbase.io.hfile.TestForceCacheImportantBlocks
Tests run: 6, Failures: 0, Errors: 0, Skipped: 0, Time elapsed: 147 sec
Forking command line: /bin/sh -c cd /x1/jenkins/jenkins-slave/workspace/HBase-0.94-security
&& /x1/jenkins/tools/java/jdk1.6.0_45-32/jre/bin/java -enableassertions -Xmx1900m
-Djava.security.egd=file:/dev/./urandom -jar /x1/jenkins/jenkins-slave/workspace/HBase-0.94-security/target/surefire/surefirebooter7061128662019148558.jar
/x1/jenkins/jenkins-slave/workspace/HBase-0.94-security/target/surefire/surefire4666508402001490855tmp
/x1/jenkins/jenkins-slave/workspace/HBase-0.94-security/target/surefire/surefire_1377994230047547792878tmp
Running org.apache.hadoop.hbase.io.hfile.TestHFileBlock
Tests run: 16, Failures: 0, Errors: 0, Skipped: 0, Time elapsed: 63.675 sec
Forking command line: /bin/sh -c cd /x1/jenkins/jenkins-slave/workspace/HBase-0.94-security
&& /x1/jenkins/tools/java/jdk1.6.0_45-32/jre/bin/java -enableassertions -Xmx1900m
-Djava.security.egd=file:/dev/./urandom -jar /x1/jenkins/jenkins-slave/workspace/HBase-0.94-security/target/surefire/surefirebooter5746028676484999020.jar
/x1/jenkins/jenkins-slave/workspace/HBase-0.94-security/target/surefire/surefire2383172407939112177tmp
/x1/jenkins/jenkins-slave/workspace/HBase-0.94-security/target/surefire/surefire_1386909763850769777914tmp
Running org.apache.hadoop.hbase.io.hfile.slab.TestSlabCache
Tests run: 7, Failures: 0, Errors: 0, Skipped: 0, Time elapsed: 75.359 sec
Forking command line: /bin/sh -c cd /x1/jenkins/jenkins-slave/workspace/HBase-0.94-security
&& /x1/jenkins/tools/java/jdk1.6.0_45-32/jre/bin/java -enableassertions -Xmx1900m
-Djava.security.egd=file:/dev/./urandom -jar /x1/jenkins/jenkins-slave/workspace/HBase-0.94-security/target/surefire/surefirebooter1026537310185042955.jar
/x1/jenkins/jenkins-slave/workspace/HBase-0.94-security/target/surefire/surefire2105762644203447655tmp
/x1/jenkins/jenkins-slave/workspace/HBase-0.94-security/target/surefire/surefire_1393073343405799813346tmp
Running org.apache.hadoop.hbase.io.TestFileLink
Tests run: 3, Failures: 0, Errors: 0, Skipped: 0, Time elapsed: 37.912 sec
Forking command line: /bin/sh -c cd /x1/jenkins/jenkins-slave/workspace/HBase-0.94-security
&& /x1/jenkins/tools/java/jdk1.6.0_45-32/jre/bin/java -enableassertions -Xmx1900m
-Djava.security.egd=file:/dev/./urandom -jar /x1/jenkins/jenkins-slave/workspace/HBase-0.94-security/target/surefire/surefirebooter383380905070375568.jar
/x1/jenkins/jenkins-slave/workspace/HBase-0.94-security/target/surefire/surefire5564124691082748186tmp
/x1/jenkins/jenkins-slave/workspace/HBase-0.94-security/target/surefire/surefire_1409129020390627980446tmp
Running org.apache.hadoop.hbase.io.hfile.slab.TestSingleSizeCache
Tests run: 5, Failures: 0, Errors: 0, Skipped: 0, Time elapsed: 128.908 sec
Forking command line: /bin/sh -c cd /x1/jenkins/jenkins-slave/workspace/HBase-0.94-security
&& /x1/jenkins/tools/java/jdk1.6.0_45-32/jre/bin/java -enableassertions -Xmx1900m
-Djava.security.egd=file:/dev/./urandom -jar /x1/jenkins/jenkins-slave/workspace/HBase-0.94-security/target/surefire/surefirebooter3570174336479969502.jar
/x1/jenkins/jenkins-slave/workspace/HBase-0.94-security/target/surefire/surefire3802883330615672895tmp
/x1/jenkins/jenkins-slave/workspace/HBase-0.94-security/target/surefire/surefire_1414050421068599379539tmp
Running org.apache.hadoop.hbase.replication.TestReplicationZookeeper
Tests run: 1, Failures: 0, Errors: 0, Skipped: 0, Time elapsed: 2.471 sec
Forking command line: /bin/sh -c cd /x1/jenkins/jenkins-slave/workspace/HBase-0.94-security
&& /x1/jenkins/tools/java/jdk1.6.0_45-32/jre/bin/java -enableassertions -Xmx1900m
-Djava.security.egd=file:/dev/./urandom -jar /x1/jenkins/jenkins-slave/workspace/HBase-0.94-security/target/surefire/surefirebooter83428411600409345.jar
/x1/jenkins/jenkins-slave/workspace/HBase-0.94-security/target/surefire/surefire6466051863049036320tmp
/x1/jenkins/jenkins-slave/workspace/HBase-0.94-security/target/surefire/surefire_1428573826875289705131tmp
Running org.apache.hadoop.hbase.io.encoding.TestLoadAndSwitchEncodeOnDisk
Tests run: 1, Failures: 0, Errors: 0, Skipped: 0, Time elapsed: 66.159 sec
Forking command line: /bin/sh -c cd /x1/jenkins/jenkins-slave/workspace/HBase-0.94-security
&& /x1/jenkins/tools/java/jdk1.6.0_45-32/jre/bin/java -enableassertions -Xmx1900m
-Djava.security.egd=file:/dev/./urandom -jar /x1/jenkins/jenkins-slave/workspace/HBase-0.94-security/target/surefire/surefirebooter1330624273834251070.jar
/x1/jenkins/jenkins-slave/workspace/HBase-0.94-security/target/surefire/surefire1647389078382926372tmp
/x1/jenkins/jenkins-slave/workspace/HBase-0.94-security/target/surefire/surefire_1434877247027035062449tmp
Running org.apache.hadoop.hbase.replication.regionserver.TestReplicationSink
Tests run: 5, Failures: 0, Errors: 0, Skipped: 0, Time elapsed: 42.537 sec
Forking command line: /bin/sh -c cd /x1/jenkins/jenkins-slave/workspace/HBase-0.94-security
&& /x1/jenkins/tools/java/jdk1.6.0_45-32/jre/bin/java -enableassertions -Xmx1900m
-Djava.security.egd=file:/dev/./urandom -jar /x1/jenkins/jenkins-slave/workspace/HBase-0.94-security/target/surefire/surefirebooter1662436789656227332.jar
/x1/jenkins/jenkins-slave/workspace/HBase-0.94-security/target/surefire/surefire8593841719531424887tmp
/x1/jenkins/jenkins-slave/workspace/HBase-0.94-security/target/surefire/surefire_1444089752774556568078tmp
Running org.apache.hadoop.hbase.replication.regionserver.TestReplicationSourceManager
Tests run: 3, Failures: 0, Errors: 0, Skipped: 0, Time elapsed: 5.388 sec
Forking command line: /bin/sh -c cd /x1/jenkins/jenkins-slave/workspace/HBase-0.94-security
&& /x1/jenkins/tools/java/jdk1.6.0_45-32/jre/bin/java -enableassertions -Xmx1900m
-Djava.security.egd=file:/dev/./urandom -jar /x1/jenkins/jenkins-slave/workspace/HBase-0.94-security/target/surefire/surefirebooter8830565208076308464.jar
/x1/jenkins/jenkins-slave/workspace/HBase-0.94-security/target/surefire/surefire3791754595710009379tmp
/x1/jenkins/jenkins-slave/workspace/HBase-0.94-security/target/surefire/surefire_1454169975942912341905tmp
Running org.apache.hadoop.hbase.util.TestFSTableDescriptors
Tests run: 11, Failures: 0, Errors: 0, Skipped: 0, Time elapsed: 2.455 sec
Forking command line: /bin/sh -c cd /x1/jenkins/jenkins-slave/workspace/HBase-0.94-security
&& /x1/jenkins/tools/java/jdk1.6.0_45-32/jre/bin/java -enableassertions -Xmx1900m
-Djava.security.egd=file:/dev/./urandom -jar /x1/jenkins/jenkins-slave/workspace/HBase-0.94-security/target/surefire/surefirebooter478361500953687889.jar
/x1/jenkins/jenkins-slave/workspace/HBase-0.94-security/target/surefire/surefire419647429064666763tmp
/x1/jenkins/jenkins-slave/workspace/HBase-0.94-security/target/surefire/surefire_1463843028366773482660tmp
Running org.apache.hadoop.hbase.replication.TestReplicationSource
Tests run: 1, Failures: 0, Errors: 0, Skipped: 0, Time elapsed: 9.543 sec
Forking command line: /bin/sh -c cd /x1/jenkins/jenkins-slave/workspace/HBase-0.94-security
&& /x1/jenkins/tools/java/jdk1.6.0_45-32/jre/bin/java -enableassertions -Xmx1900m
-Djava.security.egd=file:/dev/./urandom -jar /x1/jenkins/jenkins-slave/workspace/HBase-0.94-security/target/surefire/surefirebooter1225139901237178785.jar
/x1/jenkins/jenkins-slave/workspace/HBase-0.94-security/target/surefire/surefire4483645820139316782tmp
/x1/jenkins/jenkins-slave/workspace/HBase-0.94-security/target/surefire/surefire_1474853405321600805492tmp
Running org.apache.hadoop.hbase.util.TestEnvironmentEdgeManager
Tests run: 2, Failures: 0, Errors: 0, Skipped: 0, Time elapsed: 1.645 sec
Forking command line: /bin/sh -c cd /x1/jenkins/jenkins-slave/workspace/HBase-0.94-security
&& /x1/jenkins/tools/java/jdk1.6.0_45-32/jre/bin/java -enableassertions -Xmx1900m
-Djava.security.egd=file:/dev/./urandom -jar /x1/jenkins/jenkins-slave/workspace/HBase-0.94-security/target/surefire/surefirebooter6041366198439207343.jar
/x1/jenkins/jenkins-slave/workspace/HBase-0.94-security/target/surefire/surefire3631459822362447268tmp
/x1/jenkins/jenkins-slave/workspace/HBase-0.94-security/target/surefire/surefire_1482381656766683640743tmp
Running org.apache.hadoop.hbase.util.TestIdLock
Tests run: 1, Failures: 0, Errors: 0, Skipped: 0, Time elapsed: 16.947 sec
Forking command line: /bin/sh -c cd /x1/jenkins/jenkins-slave/workspace/HBase-0.94-security
&& /x1/jenkins/tools/java/jdk1.6.0_45-32/jre/bin/java -enableassertions -Xmx1900m
-Djava.security.egd=file:/dev/./urandom -jar /x1/jenkins/jenkins-slave/workspace/HBase-0.94-security/target/surefire/surefirebooter7895691152756047377.jar
/x1/jenkins/jenkins-slave/workspace/HBase-0.94-security/target/surefire/surefire8603567216346659660tmp
/x1/jenkins/jenkins-slave/workspace/HBase-0.94-security/target/surefire/surefire_1497451434425503314575tmp
Running org.apache.hadoop.hbase.util.TestMergeTable
Tests run: 1, Failures: 0, Errors: 0, Skipped: 0, Time elapsed: 56.893 sec
Forking command line: /bin/sh -c cd /x1/jenkins/jenkins-slave/workspace/HBase-0.94-security
&& /x1/jenkins/tools/java/jdk1.6.0_45-32/jre/bin/java -enableassertions -Xmx1900m
-Djava.security.egd=file:/dev/./urandom -jar /x1/jenkins/jenkins-slave/workspace/HBase-0.94-security/target/surefire/surefirebooter4388897116660556205.jar
/x1/jenkins/jenkins-slave/workspace/HBase-0.94-security/target/surefire/surefire5831004999507051543tmp
/x1/jenkins/jenkins-slave/workspace/HBase-0.94-security/target/surefire/surefire_150367966408083764670tmp
Running org.apache.hadoop.hbase.util.TestPoolMap$TestRoundRobinPoolType
Tests run: 3, Failures: 0, Errors: 0, Skipped: 0, Time elapsed: 0.142 sec
Running org.apache.hadoop.hbase.util.TestPoolMap$TestThreadLocalPoolType
Tests run: 3, Failures: 0, Errors: 0, Skipped: 0, Time elapsed: 0.145 sec
Running org.apache.hadoop.hbase.util.TestPoolMap$TestReusablePoolType
Tests run: 3, Failures: 0, Errors: 0, Skipped: 0, Time elapsed: 0.391 sec
Forking command line: /bin/sh -c cd /x1/jenkins/jenkins-slave/workspace/HBase-0.94-security
&& /x1/jenkins/tools/java/jdk1.6.0_45-32/jre/bin/java -enableassertions -Xmx1900m
-Djava.security.egd=file:/dev/./urandom -jar /x1/jenkins/jenkins-slave/workspace/HBase-0.94-security/target/surefire/surefirebooter6613232022027662891.jar
/x1/jenkins/jenkins-slave/workspace/HBase-0.94-security/target/surefire/surefire4055393318181500195tmp
/x1/jenkins/jenkins-slave/workspace/HBase-0.94-security/target/surefire/surefire_1514116299743743768739tmp
Running org.apache.hadoop.hbase.util.TestFSUtils
Tests run: 4, Failures: 0, Errors: 0, Skipped: 0, Time elapsed: 49.548 sec
Forking command line: /bin/sh -c cd /x1/jenkins/jenkins-slave/workspace/HBase-0.94-security
&& /x1/jenkins/tools/java/jdk1.6.0_45-32/jre/bin/java -enableassertions -Xmx1900m
-Djava.security.egd=file:/dev/./urandom -jar /x1/jenkins/jenkins-slave/workspace/HBase-0.94-security/target/surefire/surefirebooter8706051204703805604.jar
/x1/jenkins/jenkins-slave/workspace/HBase-0.94-security/target/surefire/surefire1000989875092238897tmp
/x1/jenkins/jenkins-slave/workspace/HBase-0.94-security/target/surefire/surefire_1525569487284448499930tmp
Running org.apache.hadoop.hbase.util.TestCoprocessorScanPolicy
Tests run: 2, Failures: 0, Errors: 0, Skipped: 0, Time elapsed: 32.981 sec
Forking command line: /bin/sh -c cd /x1/jenkins/jenkins-slave/workspace/HBase-0.94-security
&& /x1/jenkins/tools/java/jdk1.6.0_45-32/jre/bin/java -enableassertions -Xmx1900m
-Djava.security.egd=file:/dev/./urandom -jar /x1/jenkins/jenkins-slave/workspace/HBase-0.94-security/target/surefire/surefirebooter1236124314135642410.jar
/x1/jenkins/jenkins-slave/workspace/HBase-0.94-security/target/surefire/surefire6454806632025607081tmp
/x1/jenkins/jenkins-slave/workspace/HBase-0.94-security/target/surefire/surefire_1535346895893385939562tmp
Running org.apache.hadoop.hbase.util.TestFSVisitor
Tests run: 3, Failures: 0, Errors: 0, Skipped: 0, Time elapsed: 4.241 sec
Running org.apache.hadoop.hbase.util.TestRegionSplitter
Forking command line: /bin/sh -c cd /x1/jenkins/jenkins-slave/workspace/HBase-0.94-security
&& /x1/jenkins/tools/java/jdk1.6.0_45-32/jre/bin/java -enableassertions -Xmx1900m
-Djava.security.egd=file:/dev/./urandom -jar /x1/jenkins/jenkins-slave/workspace/HBase-0.94-security/target/surefire/surefirebooter8018665518242276408.jar
/x1/jenkins/jenkins-slave/workspace/HBase-0.94-security/target/surefire/surefire5157762505385816282tmp
/x1/jenkins/jenkins-slave/workspace/HBase-0.94-security/target/surefire/surefire_1542531685257465928406tmp
Tests run: 5, Failures: 0, Errors: 0, Skipped: 0, Time elapsed: 40.655 sec
Forking command line: /bin/sh -c cd /x1/jenkins/jenkins-slave/workspace/HBase-0.94-security
&& /x1/jenkins/tools/java/jdk1.6.0_45-32/jre/bin/java -enableassertions -Xmx1900m
-Djava.security.egd=file:/dev/./urandom -jar /x1/jenkins/jenkins-slave/workspace/HBase-0.94-security/target/surefire/surefirebooter2529261016975712691.jar
/x1/jenkins/jenkins-slave/workspace/HBase-0.94-security/target/surefire/surefire4682042270124300242tmp
/x1/jenkins/jenkins-slave/workspace/HBase-0.94-security/target/surefire/surefire_155915939355433138656tmp
Running org.apache.hadoop.hbase.util.hbck.TestOfflineMetaRebuildOverlap
Tests run: 1, Failures: 0, Errors: 0, Skipped: 0, Time elapsed: 61.898 sec
Forking command line: /bin/sh -c cd /x1/jenkins/jenkins-slave/workspace/HBase-0.94-security
&& /x1/jenkins/tools/java/jdk1.6.0_45-32/jre/bin/java -enableassertions -Xmx1900m
-Djava.security.egd=file:/dev/./urandom -jar /x1/jenkins/jenkins-slave/workspace/HBase-0.94-security/target/surefire/surefirebooter5516233145422478526.jar
/x1/jenkins/jenkins-slave/workspace/HBase-0.94-security/target/surefire/surefire3254419098763060726tmp
/x1/jenkins/jenkins-slave/workspace/HBase-0.94-security/target/surefire/surefire_1567475197794349309661tmp
Running org.apache.hadoop.hbase.util.hbck.TestOfflineMetaRebuildBase
Tests run: 1, Failures: 0, Errors: 0, Skipped: 0, Time elapsed: 69.266 sec
Forking command line: /bin/sh -c cd /x1/jenkins/jenkins-slave/workspace/HBase-0.94-security
&& /x1/jenkins/tools/java/jdk1.6.0_45-32/jre/bin/java -enableassertions -Xmx1900m
-Djava.security.egd=file:/dev/./urandom -jar /x1/jenkins/jenkins-slave/workspace/HBase-0.94-security/target/surefire/surefirebooter4271764309513666598.jar
/x1/jenkins/jenkins-slave/workspace/HBase-0.94-security/target/surefire/surefire6299385614529448697tmp
/x1/jenkins/jenkins-slave/workspace/HBase-0.94-security/target/surefire/surefire_1577272482359457128795tmp
Running org.apache.hadoop.hbase.util.TestDefaultEnvironmentEdge
Tests run: 1, Failures: 0, Errors: 0, Skipped: 0, Time elapsed: 0.576 sec
Forking command line: /bin/sh -c cd /x1/jenkins/jenkins-slave/workspace/HBase-0.94-security
&& /x1/jenkins/tools/java/jdk1.6.0_45-32/jre/bin/java -enableassertions -Xmx1900m
-Djava.security.egd=file:/dev/./urandom -jar /x1/jenkins/jenkins-slave/workspace/HBase-0.94-security/target/surefire/surefirebooter6618153955015514154.jar
/x1/jenkins/jenkins-slave/workspace/HBase-0.94-security/target/surefire/surefire4415239678858641737tmp
/x1/jenkins/jenkins-slave/workspace/HBase-0.94-security/target/surefire/surefire_1584008295890354171415tmp
Running org.apache.hadoop.hbase.util.TestFSHDFSUtils
Tests run: 3, Failures: 0, Errors: 0, Skipped: 0, Time elapsed: 4.899 sec
Forking command line: /bin/sh -c cd /x1/jenkins/jenkins-slave/workspace/HBase-0.94-security
&& /x1/jenkins/tools/java/jdk1.6.0_45-32/jre/bin/java -enableassertions -Xmx1900m
-Djava.security.egd=file:/dev/./urandom -jar /x1/jenkins/jenkins-slave/workspace/HBase-0.94-security/target/surefire/surefirebooter6504157444825828344.jar
/x1/jenkins/jenkins-slave/workspace/HBase-0.94-security/target/surefire/surefire4387346125473941925tmp
/x1/jenkins/jenkins-slave/workspace/HBase-0.94-security/target/surefire/surefire_1591436397273013072971tmp
Running org.apache.hadoop.hbase.util.hbck.TestOfflineMetaRebuildHole
Tests run: 1, Failures: 0, Errors: 0, Skipped: 0, Time elapsed: 58.622 sec
Forking command line: /bin/sh -c cd /x1/jenkins/jenkins-slave/workspace/HBase-0.94-security
&& /x1/jenkins/tools/java/jdk1.6.0_45-32/jre/bin/java -enableassertions -Xmx1900m
-Djava.security.egd=file:/dev/./urandom -jar /x1/jenkins/jenkins-slave/workspace/HBase-0.94-security/target/surefire/surefirebooter3541440996765373243.jar
/x1/jenkins/jenkins-slave/workspace/HBase-0.94-security/target/surefire/surefire618176631802691008tmp
/x1/jenkins/jenkins-slave/workspace/HBase-0.94-security/target/surefire/surefire_1608539913370670048748tmp
Running org.apache.hadoop.hbase.TestInfoServers
Tests run: 3, Failures: 0, Errors: 0, Skipped: 0, Time elapsed: 30.002 sec

Results :

Tests run: 923, Failures: 0, Errors: 0, Skipped: 2

[INFO] ------------------------------------------------------------------------
[INFO] BUILD FAILURE
[INFO] ------------------------------------------------------------------------
[INFO] Total time: 1:26:13.939s
[INFO] Finished at: Tue Aug 05 21:30:18 UTC 2014
[INFO] Final Memory: 66M/1064M
[INFO] ------------------------------------------------------------------------
[ERROR] Failed to execute goal org.apache.maven.plugins:maven-surefire-plugin:2.12-TRUNK-HBASE-2:test
(secondPartTestsExecution) on project hbase: Failure or timeout -> [Help 1]
org.apache.maven.lifecycle.LifecycleExecutionException: Failed to execute goal org.apache.maven.plugins:maven-surefire-plugin:2.12-TRUNK-HBASE-2:test
(secondPartTestsExecution) on project hbase: Failure or timeout
	at org.apache.maven.lifecycle.internal.MojoExecutor.execute(MojoExecutor.java:217)
	at org.apache.maven.lifecycle.internal.MojoExecutor.execute(MojoExecutor.java:153)
	at org.apache.maven.lifecycle.internal.MojoExecutor.execute(MojoExecutor.java:145)
	at org.apache.maven.lifecycle.internal.MojoExecutor.executeForkedExecutions(MojoExecutor.java:365)
	at org.apache.maven.lifecycle.internal.MojoExecutor.execute(MojoExecutor.java:199)
	at org.apache.maven.lifecycle.internal.MojoExecutor.execute(MojoExecutor.java:153)
	at org.apache.maven.lifecycle.internal.MojoExecutor.execute(MojoExecutor.java:145)
	at org.apache.maven.lifecycle.internal.LifecycleModuleBuilder.buildProject(LifecycleModuleBuilder.java:84)
	at org.apache.maven.lifecycle.internal.LifecycleModuleBuilder.buildProject(LifecycleModuleBuilder.java:59)
	at org.apache.maven.lifecycle.internal.LifecycleStarter.singleThreadedBuild(LifecycleStarter.java:183)
	at org.apache.maven.lifecycle.internal.LifecycleStarter.execute(LifecycleStarter.java:161)
	at org.apache.maven.DefaultMaven.doExecute(DefaultMaven.java:320)
	at org.apache.maven.DefaultMaven.execute(DefaultMaven.java:156)
	at org.apache.maven.cli.MavenCli.execute(MavenCli.java:537)
	at org.apache.maven.cli.MavenCli.doMain(MavenCli.java:196)
	at org.apache.maven.cli.MavenCli.main(MavenCli.java:141)
	at sun.reflect.NativeMethodAccessorImpl.invoke0(Native Method)
	at sun.reflect.NativeMethodAccessorImpl.invoke(NativeMethodAccessorImpl.java:39)
	at sun.reflect.DelegatingMethodAccessorImpl.invoke(DelegatingMethodAccessorImpl.java:25)
	at java.lang.reflect.Method.invoke(Method.java:597)
	at org.codehaus.plexus.classworlds.launcher.Launcher.launchEnhanced(Launcher.java:290)
	at org.codehaus.plexus.classworlds.launcher.Launcher.launch(Launcher.java:230)
	at org.codehaus.plexus.classworlds.launcher.Launcher.mainWithExitCode(Launcher.java:409)
	at org.codehaus.plexus.classworlds.launcher.Launcher.main(Launcher.java:352)
Caused by: org.apache.maven.plugin.MojoExecutionException: Failure or timeout
	at org.apache.maven.plugin.surefire.SurefirePlugin.assertNoFailureOrTimeout(SurefirePlugin.java:643)
	at org.apache.maven.plugin.surefire.SurefirePlugin.handleSummary(SurefirePlugin.java:624)
	at org.apache.maven.plugin.surefire.AbstractSurefireMojo.executeAfterPreconditionsChecked(AbstractSurefireMojo.java:137)
	at org.apache.maven.plugin.surefire.AbstractSurefireMojo.execute(AbstractSurefireMojo.java:98)
	at org.apache.maven.plugin.DefaultBuildPluginManager.executeMojo(DefaultBuildPluginManager.java:101)
	at org.apache.maven.lifecycle.internal.MojoExecutor.execute(MojoExecutor.java:209)
	... 23 more
[ERROR] 
[ERROR] 
[ERROR] For more information about the errors and possible solutions, please read the following
articles:
[ERROR] [Help 1] http://cwiki.apache.org/confluence/display/MAVEN/MojoExecutionException
Build step 'Invoke top-level Maven targets' marked build as failure
Archiving artifacts
Sending artifact delta relative to HBase-0.94-security #503
Archived 953 artifacts
Archive block size is 32768
Received 10 blocks and 110200448 bytes
Compression is 0.3%
Took 1 min 14 sec
Updating HBASE-11641
Recording test results

Mime
View raw message