hbase-builds mailing list archives

Site index · List index
Message view « Date » · « Thread »
Top « Date » · « Thread »
From Stack <st...@duboce.net>
Subject Re: Build failed in Jenkins: HBase-0.98 #424
Date Wed, 30 Jul 2014 21:33:44 GMT
These are resolution issues.  Does not seem to be test related.
St.Ack


On Wed, Jul 30, 2014 at 1:37 PM, Apache Jenkins Server <
jenkins@builds.apache.org> wrote:

> See <https://builds.apache.org/job/HBase-0.98/424/changes>
>
> Changes:
>
> [tedyu] HBASE-11551 BucketCache.run() doesn't handle exceptions correctly
> (Ted Yu)
>
> ------------------------------------------
> [...truncated 883 lines...]
> Running org.apache.hadoop.hbase.io.hfile.TestLruBlockCache
> Tests run: 9, Failures: 0, Errors: 0, Skipped: 0, Time elapsed: 0.568 sec
> Running org.apache.hadoop.hbase.io.hfile.TestHFileBlockCompatibility
> Tests run: 16, Failures: 0, Errors: 0, Skipped: 0, Time elapsed: 1.541 sec
> Running org.apache.hadoop.hbase.io.hfile.TestFixedFileTrailer
> Tests run: 4, Failures: 0, Errors: 0, Skipped: 0, Time elapsed: 0.11 sec
> Running
> org.apache.hadoop.hbase.io.hfile.TestHFileInlineToRootChunkConversion
> Tests run: 1, Failures: 0, Errors: 0, Skipped: 0, Time elapsed: 0.026 sec
> Running org.apache.hadoop.hbase.io.hfile.TestHFile
> Tests run: 7, Failures: 0, Errors: 0, Skipped: 0, Time elapsed: 0.451 sec
> Running org.apache.hadoop.hbase.io.hfile.TestPrefetch
> Tests run: 1, Failures: 0, Errors: 0, Skipped: 0, Time elapsed: 1.076 sec
> Running org.apache.hadoop.hbase.io.hfile.TestCachedBlockQueue
> Tests run: 2, Failures: 0, Errors: 0, Skipped: 0, Time elapsed: 0.04 sec
> Running org.apache.hadoop.hbase.io.hfile.TestSeekTo
> Tests run: 4, Failures: 0, Errors: 0, Skipped: 0, Time elapsed: 0.289 sec
> Running org.apache.hadoop.hbase.io.hfile.slab.TestSlab
> Tests run: 1, Failures: 0, Errors: 0, Skipped: 0, Time elapsed: 0.025 sec
> Running org.apache.hadoop.hbase.io.hfile.TestHFileWriterV3
> Tests run: 4, Failures: 0, Errors: 0, Skipped: 0, Time elapsed: 1.574 sec
> Running org.apache.hadoop.hbase.io.hfile.TestReseekTo
> Tests run: 1, Failures: 0, Errors: 0, Skipped: 0, Time elapsed: 0.165 sec
> Running org.apache.hadoop.hbase.io.hfile.TestHFileWriterV2
> Tests run: 2, Failures: 0, Errors: 0, Skipped: 0, Time elapsed: 0.7 sec
> Running org.apache.hadoop.hbase.io.hfile.TestHFileEncryption
> Tests run: 3, Failures: 0, Errors: 0, Skipped: 0, Time elapsed: 1.986 sec
> Running org.apache.hadoop.hbase.io.hfile.TestHFileDataBlockEncoder
> Tests run: 30, Failures: 0, Errors: 0, Skipped: 0, Time elapsed: 0.557 sec
> Running org.apache.hadoop.hbase.io.hfile.bucket.TestByteBufferIOEngine
> Tests run: 1, Failures: 0, Errors: 0, Skipped: 0, Time elapsed: 0.103 sec
> Running org.apache.hadoop.hbase.io.hfile.bucket.TestBucketCache
> Tests run: 8, Failures: 0, Errors: 0, Skipped: 0, Time elapsed: 15.805 sec
> Running org.apache.hadoop.hbase.io.hfile.bucket.TestFileIOEngine
> Tests run: 1, Failures: 0, Errors: 0, Skipped: 0, Time elapsed: 0.028 sec
> Running org.apache.hadoop.hbase.io.hfile.TestScannerSelectionUsingKeyRange
> Tests run: 3, Failures: 0, Errors: 0, Skipped: 0, Time elapsed: 0.21 sec
> Running org.apache.hadoop.hbase.io.hfile.TestChecksum
> Tests run: 3, Failures: 0, Errors: 0, Skipped: 0, Time elapsed: 0.332 sec
> Running org.apache.hadoop.hbase.io.TestImmutableBytesWritable
> Tests run: 3, Failures: 0, Errors: 0, Skipped: 0, Time elapsed: 0.052 sec
> Running org.apache.hadoop.hbase.io.TestHFileLink
> Tests run: 2, Failures: 0, Errors: 0, Skipped: 0, Time elapsed: 0.037 sec
> Running org.apache.hadoop.hbase.io.TestHeapSize
> Tests run: 3, Failures: 0, Errors: 0, Skipped: 0, Time elapsed: 0.06 sec
> Running org.apache.hadoop.hbase.io.TestReference
> Tests run: 1, Failures: 0, Errors: 0, Skipped: 0, Time elapsed: 0.022 sec
> Running org.apache.hadoop.hbase.constraint.TestConstraints
> Tests run: 6, Failures: 0, Errors: 0, Skipped: 0, Time elapsed: 0.452 sec
> Running org.apache.hadoop.hbase.TestServerLoad
> Tests run: 2, Failures: 0, Errors: 0, Skipped: 0, Time elapsed: 0.042 sec
> Running org.apache.hadoop.hbase.filter.TestInclusiveStopFilter
> Tests run: 2, Failures: 0, Errors: 0, Skipped: 0, Time elapsed: 0.041 sec
> Running org.apache.hadoop.hbase.filter.TestInvocationRecordFilter
> Tests run: 1, Failures: 0, Errors: 0, Skipped: 0, Time elapsed: 0.055 sec
> Running org.apache.hadoop.hbase.filter.TestFilterSerialization
> Tests run: 25, Failures: 0, Errors: 0, Skipped: 0, Time elapsed: 0.593 sec
> Running
> org.apache.hadoop.hbase.filter.TestFirstKeyValueMatchingQualifiersFilter
> Tests run: 1, Failures: 0, Errors: 0, Skipped: 0, Time elapsed: 0.019 sec
> Running org.apache.hadoop.hbase.filter.TestColumnPaginationFilter
> Tests run: 1, Failures: 0, Errors: 0, Skipped: 0, Time elapsed: 0.017 sec
> Running org.apache.hadoop.hbase.filter.TestRandomRowFilter
> Tests run: 2, Failures: 0, Errors: 0, Skipped: 0, Time elapsed: 0.355 sec
> Running org.apache.hadoop.hbase.filter.TestSingleColumnValueExcludeFilter
> Tests run: 1, Failures: 0, Errors: 0, Skipped: 0, Time elapsed: 0.022 sec
> Running org.apache.hadoop.hbase.filter.TestDependentColumnFilter
> Tests run: 4, Failures: 0, Errors: 0, Skipped: 0, Time elapsed: 0.262 sec
> Running org.apache.hadoop.hbase.filter.TestMultipleColumnPrefixFilter
> Tests run: 3, Failures: 0, Errors: 0, Skipped: 0, Time elapsed: 2.89 sec
> Running org.apache.hadoop.hbase.filter.TestSingleColumnValueFilter
> Tests run: 2, Failures: 0, Errors: 0, Skipped: 0, Time elapsed: 0.043 sec
> Running org.apache.hadoop.hbase.filter.TestNullComparator
> Tests run: 3, Failures: 0, Errors: 0, Skipped: 0, Time elapsed: 0.058 sec
> Running org.apache.hadoop.hbase.filter.TestColumnPrefixFilter
> Tests run: 2, Failures: 0, Errors: 0, Skipped: 0, Time elapsed: 1.663 sec
> Running org.apache.hadoop.hbase.filter.TestPrefixFilter
> Tests run: 3, Failures: 0, Errors: 0, Skipped: 0, Time elapsed: 0.057 sec
> Running org.apache.hadoop.hbase.filter.TestFilter
> Tests run: 21, Failures: 0, Errors: 0, Skipped: 0, Time elapsed: 2.284 sec
> Running org.apache.hadoop.hbase.filter.TestBitComparator
> Tests run: 6, Failures: 0, Errors: 0, Skipped: 0, Time elapsed: 0.127 sec
> Running org.apache.hadoop.hbase.filter.TestPageFilter
> Tests run: 2, Failures: 0, Errors: 0, Skipped: 0, Time elapsed: 0.036 sec
> Running org.apache.hadoop.hbase.filter.TestFuzzyRowFilter
> Tests run: 2, Failures: 0, Errors: 0, Skipped: 0, Time elapsed: 0.036 sec
> Running org.apache.hadoop.hbase.filter.TestFilterList
> Tests run: 7, Failures: 0, Errors: 0, Skipped: 0, Time elapsed: 0.132 sec
> Running org.apache.hadoop.hbase.filter.TestComparatorSerialization
> Tests run: 6, Failures: 0, Errors: 0, Skipped: 0, Time elapsed: 0.112 sec
> Running org.apache.hadoop.hbase.filter.TestParseFilter
> Tests run: 34, Failures: 0, Errors: 0, Skipped: 0, Time elapsed: 0.662 sec
> Running org.apache.hadoop.hbase.protobuf.TestProtobufUtil
> Tests run: 7, Failures: 0, Errors: 0, Skipped: 0, Time elapsed: 0.165 sec
> Running org.apache.hadoop.hbase.protobuf.TestReplicationProtobuf
> Tests run: 1, Failures: 0, Errors: 0, Skipped: 0, Time elapsed: 0.021 sec
> Running org.apache.hadoop.hbase.TestCompare
> Tests run: 1, Failures: 0, Errors: 0, Skipped: 0, Time elapsed: 0.02 sec
> Running org.apache.hadoop.hbase.codec.TestCellMessageCodec
> Tests run: 3, Failures: 0, Errors: 0, Skipped: 0, Time elapsed: 0.062 sec
> Running org.apache.hadoop.hbase.TestCheckTestClasses
> Tests run: 1, Failures: 0, Errors: 0, Skipped: 0, Time elapsed: 0.759 sec
> Running org.apache.hadoop.hbase.rest.TestGZIPResponseWrapper
> Tests run: 4, Failures: 0, Errors: 0, Skipped: 0, Time elapsed: 0.079 sec
> Running org.apache.hadoop.hbase.rest.client.TestRemoteHTableRetries
> Tests run: 7, Failures: 0, Errors: 0, Skipped: 0, Time elapsed: 1.228 sec
> Running org.apache.hadoop.hbase.rest.client.TestRemoteAdminRetries
> Tests run: 7, Failures: 0, Errors: 0, Skipped: 0, Time elapsed: 1.211 sec
> Running org.apache.hadoop.hbase.rest.model.TestTableRegionModel
> Tests run: 8, Failures: 0, Errors: 0, Skipped: 0, Time elapsed: 0.293 sec
> Running org.apache.hadoop.hbase.rest.model.TestScannerModel
> Tests run: 6, Failures: 0, Errors: 0, Skipped: 0, Time elapsed: 0.147 sec
> Running org.apache.hadoop.hbase.rest.model.TestCellSetModel
> Tests run: 6, Failures: 0, Errors: 0, Skipped: 0, Time elapsed: 0.136 sec
> Running org.apache.hadoop.hbase.rest.model.TestStorageClusterVersionModel
> Tests run: 6, Failures: 0, Errors: 0, Skipped: 0, Time elapsed: 0.127 sec
> Running org.apache.hadoop.hbase.rest.model.TestTableListModel
> Tests run: 6, Failures: 0, Errors: 0, Skipped: 0, Time elapsed: 0.133 sec
> Running org.apache.hadoop.hbase.rest.model.TestStorageClusterStatusModel
> Tests run: 6, Failures: 0, Errors: 0, Skipped: 0, Time elapsed: 0.157 sec
> Running org.apache.hadoop.hbase.rest.model.TestTableSchemaModel
> Tests run: 6, Failures: 0, Errors: 0, Skipped: 0, Time elapsed: 0.156 sec
> Running org.apache.hadoop.hbase.rest.model.TestTableInfoModel
> Tests run: 6, Failures: 0, Errors: 0, Skipped: 0, Time elapsed: 0.139 sec
> Running org.apache.hadoop.hbase.rest.model.TestRowModel
> Tests run: 6, Failures: 0, Errors: 0, Skipped: 0, Time elapsed: 0.133 sec
> Running org.apache.hadoop.hbase.rest.model.TestColumnSchemaModel
> Tests run: 6, Failures: 0, Errors: 0, Skipped: 0, Time elapsed: 0.132 sec
> Running org.apache.hadoop.hbase.rest.model.TestVersionModel
> Tests run: 6, Failures: 0, Errors: 0, Skipped: 0, Time elapsed: 0.139 sec
> Running org.apache.hadoop.hbase.rest.model.TestCellModel
> Tests run: 6, Failures: 0, Errors: 0, Skipped: 0, Time elapsed: 0.126 sec
> Running org.apache.hadoop.hbase.TestHTableDescriptor
> Tests run: 11, Failures: 0, Errors: 0, Skipped: 0, Time elapsed: 0.244 sec
> Running
> org.apache.hadoop.hbase.errorhandling.TestForeignExceptionSerialization
> Tests run: 2, Failures: 0, Errors: 0, Skipped: 0, Time elapsed: 0.057 sec
> Running org.apache.hadoop.hbase.errorhandling.TestTimeoutExceptionInjector
> Tests run: 4, Failures: 0, Errors: 0, Skipped: 0, Time elapsed: 0.128 sec
> Running
> org.apache.hadoop.hbase.errorhandling.TestForeignExceptionDispatcher
> Tests run: 3, Failures: 0, Errors: 0, Skipped: 0, Time elapsed: 0.071 sec
> Running
> org.apache.hadoop.hbase.replication.regionserver.TestReplicationSinkManager
> Tests run: 5, Failures: 0, Errors: 0, Skipped: 0, Time elapsed: 0.192 sec
> Running org.apache.hadoop.hbase.master.TestClockSkewDetection
> Tests run: 1, Failures: 0, Errors: 1, Skipped: 0, Time elapsed: 205.775
> sec <<< FAILURE!
> Running org.apache.hadoop.hbase.procedure.TestProcedureManager
> Tests run: 1, Failures: 0, Errors: 1, Skipped: 0, Time elapsed: 205.775
> sec <<< FAILURE!
> Running org.apache.hadoop.hbase.security.TestSecureRPC
> Tests run: 1, Failures: 0, Errors: 0, Skipped: 1, Time elapsed: 205.775 sec
> Running
> org.apache.hadoop.hbase.security.TestUsersOperationsWithSecureHadoop
> Tests run: 1, Failures: 0, Errors: 0, Skipped: 1, Time elapsed: 205.775 sec
> Running org.apache.hadoop.hbase.ipc.TestIPC
> Tests run: 4, Failures: 1, Errors: 3, Skipped: 0, Time elapsed: 205.775
> sec <<< FAILURE!
> Running
> org.apache.hadoop.hbase.replication.regionserver.TestReplicationThrottler
> Tests run: 1, Failures: 0, Errors: 0, Skipped: 0, Time elapsed: 205.775 sec
>
> Results :
>
> Failed tests:
> testRTEDuringConnectionSetup(org.apache.hadoop.hbase.ipc.TestIPC)
>
> Tests in error:
>
> testClockSkewDetection(org.apache.hadoop.hbase.master.TestClockSkewDetection):
> asf901.ygridcore.net: asf901.ygridcore.net
>   org.apache.hadoop.hbase.procedure.TestProcedureManager:
> asf901.ygridcore.net: asf901.ygridcore.net
>   testRpcScheduler(org.apache.hadoop.hbase.ipc.TestIPC):
> asf901.ygridcore.net: asf901.ygridcore.net
>   testCompressCellBlock(org.apache.hadoop.hbase.ipc.TestIPC):
> asf901.ygridcore.net: asf901.ygridcore.net
>   testNoCodec(org.apache.hadoop.hbase.ipc.TestIPC): asf901.ygridcore.net:
> asf901.ygridcore.net
>
> Tests run: 825, Failures: 1, Errors: 5, Skipped: 2
>
> [INFO]
> ------------------------------------------------------------------------
> [INFO] Reactor Summary:
> [INFO]
> [INFO] HBase ............................................. SUCCESS [2.705s]
> [INFO] HBase - Common .................................... SUCCESS
> [24.859s]
> [INFO] HBase - Protocol .................................. SUCCESS
> [19.309s]
> [INFO] HBase - Client .................................... SUCCESS
> [39.507s]
> [INFO] HBase - Hadoop Compatibility ...................... SUCCESS [5.545s]
> [INFO] HBase - Hadoop Two Compatibility .................. SUCCESS [1.849s]
> [INFO] HBase - Prefix Tree ............................... SUCCESS [3.912s]
> [INFO] HBase - Server .................................... FAILURE
> [3:43.118s]
> [INFO] HBase - Testing Util .............................. SKIPPED
> [INFO] HBase - Thrift .................................... SKIPPED
> [INFO] HBase - Shell ..................................... SKIPPED
> [INFO] HBase - Integration Tests ......................... SKIPPED
> [INFO] HBase - Examples .................................. SKIPPED
> [INFO] HBase - Assembly .................................. SKIPPED
> [INFO]
> ------------------------------------------------------------------------
> [INFO] BUILD FAILURE
> [INFO]
> ------------------------------------------------------------------------
> [INFO] Total time: 5:21.577s
> [INFO] Finished at: Wed Jul 30 20:32:40 UTC 2014
> [INFO] Final Memory: 57M/1106M
> [INFO]
> ------------------------------------------------------------------------
> [ERROR] Failed to execute goal
> org.apache.maven.plugins:maven-surefire-plugin:2.12-TRUNK-HBASE-2:test
> (default-test) on project hbase-server: There are test failures.
> [ERROR]
> [ERROR] Please refer to <
> https://builds.apache.org/job/HBase-0.98/ws/hbase-server/target/surefire-reports>
> for the individual test results.
> [ERROR] -> [Help 1]
> [ERROR]
> [ERROR] To see the full stack trace of the errors, re-run Maven with the
> -e switch.
> [ERROR] Re-run Maven using the -X switch to enable full debug logging.
> [ERROR]
> [ERROR] For more information about the errors and possible solutions,
> please read the following articles:
> [ERROR] [Help 1]
> http://cwiki.apache.org/confluence/display/MAVEN/MojoFailureException
> [ERROR]
> [ERROR] After correcting the problems, you can resume the build with the
> command
> [ERROR]   mvn <goals> -rf :hbase-server
> Build step 'Invoke top-level Maven targets' marked build as failure
> Performing Post build task...
> Match found for :.* : True
> Logical operation result is TRUE
> Running script  :   ZOMBIE_TESTS_COUNT=`jps | grep surefirebooter | wc -l`
>   if [[ $ZOMBIE_TESTS_COUNT != 0 ]] ; then
>     #It seems sometimes the tests are not dying immediately. Let's give
> them 10s
>     echo "Suspicious java process found - waiting 10s to see if there are
> just slow to stop"
>     sleep 10
>     ZOMBIE_TESTS_COUNT=`jps | grep surefirebooter | wc -l`
>     if [[ $ZOMBIE_TESTS_COUNT != 0 ]] ; then
>       echo "There are $ZOMBIE_TESTS_COUNT zombie tests, they should have
> been killed by surefire but survived"
>       echo "************ BEGIN zombies jstack extract"
>       ZB_STACK=`jps | grep surefirebooter | cut -d ' ' -f 1 | xargs -n 1
> jstack | grep ".test" | grep "\.java"`
>       jps | grep surefirebooter | cut -d ' ' -f 1 | xargs -n 1 jstack
>       echo "************ END  zombies jstack extract"
>       JIRA_COMMENT="$JIRA_COMMENT
>
>      {color:red}-1 core zombie tests{color}.  There are
> ${ZOMBIE_TESTS_COUNT} zombie test(s): ${ZB_STACK}"
>       BAD=1
>       jps | grep surefirebooter | cut -d ' ' -f 1 | xargs kill -9
>     else
>       echo "We're ok: there is no zombie test, but some tests took some
> time to stop"
>     fi
>   else
>     echo "We're ok: there is no zombie test"
>   fi
> [HBase-0.98] $ /bin/bash -xe /tmp/hudson5769252683755481499.sh
> ++ jps
> ++ grep surefirebooter
> ++ wc -l
> + ZOMBIE_TESTS_COUNT=0
> + [[ 0 != 0 ]]
> + echo 'We'\''re ok: there is no zombie test'
> We're ok: there is no zombie test
> POST BUILD TASK : SUCCESS
> END OF POST BUILD TASK : 0
> Archiving artifacts
> Sending artifact delta relative to HBase-0.98 #423
> Archived 757 artifacts
> Archive block size is 32768
> Received 3 blocks and 33879819 bytes
> Compression is 0.3%
> Took 1 min 45 sec
> Recording test results
> Updating HBASE-11551
>

Mime
  • Unnamed multipart/alternative (inline, None, 0 bytes)
View raw message