hbase-builds mailing list archives

Site index · List index
Message view « Date » · « Thread »
Top « Date » · « Thread »
From Apache Jenkins Server <jenk...@builds.apache.org>
Subject Build failed in Jenkins: HBase-1.0 #50
Date Thu, 17 Jul 2014 01:55:49 GMT
See <https://builds.apache.org/job/HBase-1.0/50/changes>

Changes:

[stack] HBASE-11517 TestReplicaWithCluster turns zombie (Mikhail Antonov) -- REAPPLY

------------------------------------------
[...truncated 1625 lines...]
	at java.lang.Thread.run(Thread.java:724)
No results for java.util.concurrent.FutureTask@1a2a588
Running org.apache.hadoop.hbase.client.TestTableSnapshotScanner
Tests run: 3, Failures: 0, Errors: 0, Skipped: 0, Time elapsed: 35.359 sec
Running org.apache.hadoop.hbase.client.TestFromClientSide3
Tests run: 6, Failures: 0, Errors: 0, Skipped: 0, Time elapsed: 36.354 sec
Running org.apache.hadoop.hbase.client.TestFromClientSideNoCodec
Tests run: 2, Failures: 0, Errors: 0, Skipped: 0, Time elapsed: 9.863 sec
Running org.apache.hadoop.hbase.client.TestScannersFromClientSide
Tests run: 5, Failures: 0, Errors: 0, Skipped: 0, Time elapsed: 13.631 sec
Running org.apache.hadoop.hbase.client.TestSnapshotFromClientWithRegionReplicas
Tests run: 5, Failures: 0, Errors: 0, Skipped: 0, Time elapsed: 17.506 sec
Running org.apache.hadoop.hbase.client.TestClientOperationInterrupt
Tests run: 1, Failures: 0, Errors: 0, Skipped: 0, Time elapsed: 61.476 sec
Running org.apache.hadoop.hbase.client.TestMultipleTimestamps
Tests run: 8, Failures: 0, Errors: 0, Skipped: 0, Time elapsed: 12.279 sec
Running org.apache.hadoop.hbase.client.TestFromClientSide
Tests run: 79, Failures: 0, Errors: 0, Skipped: 4, Time elapsed: 96.045 sec
Running org.apache.hadoop.hbase.client.TestClientTimeouts
Tests run: 1, Failures: 0, Errors: 0, Skipped: 0, Time elapsed: 10.091 sec
Running org.apache.hadoop.hbase.client.TestMetaScanner
Tests run: 2, Failures: 0, Errors: 0, Skipped: 0, Time elapsed: 43.62 sec
Running org.apache.hadoop.hbase.client.TestCloneSnapshotFromClient
Tests run: 5, Failures: 0, Errors: 0, Skipped: 0, Time elapsed: 57.992 sec
Running org.apache.hadoop.hbase.TestLocalHBaseCluster
Tests run: 1, Failures: 0, Errors: 0, Skipped: 0, Time elapsed: 8.423 sec
Running org.apache.hadoop.hbase.TestDrainingServer
Tests run: 2, Failures: 0, Errors: 0, Skipped: 0, Time elapsed: 2.583 sec
Running org.apache.hadoop.hbase.snapshot.TestSnapshotDescriptionUtils
Tests run: 2, Failures: 0, Errors: 0, Skipped: 0, Time elapsed: 1.207 sec
Running org.apache.hadoop.hbase.snapshot.TestFlushSnapshotFromClient
Tests run: 9, Failures: 0, Errors: 0, Skipped: 0, Time elapsed: 42.261 sec
Running org.apache.hadoop.hbase.snapshot.TestRestoreFlushSnapshotFromClient
Tests run: 5, Failures: 0, Errors: 0, Skipped: 0, Time elapsed: 48.902 sec
Running org.apache.hadoop.hbase.client.TestHCM
Tests run: 21, Failures: 0, Errors: 0, Skipped: 2, Time elapsed: 153.891 sec
Running org.apache.hadoop.hbase.snapshot.TestExportSnapshot
Tests run: 9, Failures: 0, Errors: 0, Skipped: 0, Time elapsed: 295.812 sec
Running org.apache.hadoop.hbase.migration.TestUpgradeTo96
Tests run: 5, Failures: 0, Errors: 0, Skipped: 0, Time elapsed: 8.089 sec
Running org.apache.hadoop.hbase.snapshot.TestSecureExportSnapshot
Tests run: 9, Failures: 0, Errors: 0, Skipped: 0, Time elapsed: 293.996 sec
Running org.apache.hadoop.hbase.TestMultiVersions
Tests run: 3, Failures: 0, Errors: 0, Skipped: 0, Time elapsed: 12.788 sec
Running org.apache.hadoop.hbase.migration.TestNamespaceUpgrade
Tests run: 5, Failures: 0, Errors: 0, Skipped: 0, Time elapsed: 23.299 sec
Running org.apache.hadoop.hbase.TestGlobalMemStoreSize
Tests run: 1, Failures: 0, Errors: 0, Skipped: 0, Time elapsed: 11.236 sec
Running org.apache.hadoop.hbase.security.access.TestScanEarlyTermination
Tests run: 1, Failures: 0, Errors: 0, Skipped: 0, Time elapsed: 11.405 sec
Running org.apache.hadoop.hbase.TestRegionRebalancing
Tests run: 2, Failures: 0, Errors: 0, Skipped: 0, Time elapsed: 28.082 sec
Running org.apache.hadoop.hbase.security.access.TestZKPermissionsWatcher
Tests run: 1, Failures: 0, Errors: 0, Skipped: 0, Time elapsed: 10.801 sec
Running org.apache.hadoop.hbase.security.access.TestAccessControlFilter
Tests run: 1, Failures: 0, Errors: 0, Skipped: 0, Time elapsed: 10.675 sec
Running org.apache.hadoop.hbase.security.access.TestCellACLs
Tests run: 2, Failures: 0, Errors: 0, Skipped: 0, Time elapsed: 13.055 sec
Running org.apache.hadoop.hbase.security.access.TestTablePermissions
Tests run: 7, Failures: 0, Errors: 0, Skipped: 0, Time elapsed: 21.591 sec
Running org.apache.hadoop.hbase.security.access.TestCellACLWithMultipleVersions
Tests run: 8, Failures: 0, Errors: 0, Skipped: 0, Time elapsed: 22.313 sec
Running org.apache.hadoop.hbase.security.access.TestNamespaceCommands
Tests run: 3, Failures: 0, Errors: 0, Skipped: 0, Time elapsed: 10.386 sec
Running org.apache.hadoop.hbase.security.token.TestZKSecretWatcher
Tests run: 1, Failures: 0, Errors: 0, Skipped: 0, Time elapsed: 14.981 sec
Running org.apache.hadoop.hbase.security.token.TestTokenAuthentication
Tests run: 2, Failures: 0, Errors: 0, Skipped: 0, Time elapsed: 2.677 sec
Running org.apache.hadoop.hbase.security.visibility.TestEnforcingScanLabelGenerator
Tests run: 1, Failures: 0, Errors: 0, Skipped: 0, Time elapsed: 10.022 sec
Running org.apache.hadoop.hbase.security.visibility.TestVisibilityLabelsWithSLGStack
Tests run: 1, Failures: 0, Errors: 0, Skipped: 0, Time elapsed: 9.392 sec
Running org.apache.hadoop.hbase.security.visibility.TestVisibilityLabelsWithACL
Tests run: 5, Failures: 0, Errors: 0, Skipped: 0, Time elapsed: 12.791 sec
Running org.apache.hadoop.hbase.security.visibility.TestVisibilityLabelsOpWithDifferentUsersNoACL
Tests run: 1, Failures: 0, Errors: 0, Skipped: 0, Time elapsed: 10.323 sec
Running org.apache.hadoop.hbase.security.access.TestAccessController
Tests run: 44, Failures: 0, Errors: 0, Skipped: 0, Time elapsed: 83.562 sec
Running org.apache.hadoop.hbase.security.visibility.TestVisibilityLabelsWithDistributedLogReplay
Tests run: 19, Failures: 0, Errors: 0, Skipped: 0, Time elapsed: 22.512 sec
Running org.apache.hadoop.hbase.security.visibility.TestVisibilityLabels
Tests run: 19, Failures: 0, Errors: 0, Skipped: 0, Time elapsed: 20.959 sec
Running org.apache.hadoop.hbase.security.visibility.TestVisibilityLabelsWithDeletes
Tests run: 37, Failures: 0, Errors: 0, Skipped: 0, Time elapsed: 46.475 sec
Running org.apache.hadoop.hbase.fs.TestBlockReorder
Tests run: 3, Failures: 0, Errors: 0, Skipped: 0, Time elapsed: 21.322 sec
Running org.apache.hadoop.hbase.TestInfoServers
Tests run: 3, Failures: 0, Errors: 0, Skipped: 0, Time elapsed: 9.35 sec
Running org.apache.hadoop.hbase.backup.example.TestZooKeeperTableArchiveClient
Tests run: 3, Failures: 0, Errors: 0, Skipped: 0, Time elapsed: 5.279 sec
Running org.apache.hadoop.hbase.zookeeper.TestHQuorumPeer
Tests run: 3, Failures: 0, Errors: 0, Skipped: 0, Time elapsed: 2.412 sec
Running org.apache.hadoop.hbase.zookeeper.lock.TestZKInterProcessReadWriteLock
Tests run: 6, Failures: 0, Errors: 0, Skipped: 0, Time elapsed: 25.314 sec
Running org.apache.hadoop.hbase.zookeeper.TestZKTableStateManager
Tests run: 1, Failures: 0, Errors: 0, Skipped: 0, Time elapsed: 1.588 sec
Running org.apache.hadoop.hbase.backup.TestHFileArchiving
Tests run: 5, Failures: 0, Errors: 0, Skipped: 0, Time elapsed: 42.155 sec
Running org.apache.hadoop.hbase.zookeeper.TestZKLeaderManager
Tests run: 1, Failures: 0, Errors: 0, Skipped: 0, Time elapsed: 1.086 sec
Running org.apache.hadoop.hbase.zookeeper.TestRecoverableZooKeeper
Tests run: 1, Failures: 0, Errors: 0, Skipped: 0, Time elapsed: 2.001 sec
Running org.apache.hadoop.hbase.zookeeper.TestZooKeeperNodeTracker
Tests run: 3, Failures: 0, Errors: 0, Skipped: 0, Time elapsed: 1.679 sec
Running org.apache.hadoop.hbase.zookeeper.TestZKMulti
Tests run: 6, Failures: 0, Errors: 0, Skipped: 0, Time elapsed: 1.193 sec
Running org.apache.hadoop.hbase.zookeeper.TestZooKeeperACL
Tests run: 6, Failures: 0, Errors: 0, Skipped: 0, Time elapsed: 7.961 sec
Running org.apache.hadoop.hbase.mapreduce.TestTableMapReduce
Tests run: 2, Failures: 0, Errors: 0, Skipped: 0, Time elapsed: 166.927 sec
Running org.apache.hadoop.hbase.mapreduce.TestHLogRecordReader
Tests run: 2, Failures: 0, Errors: 0, Skipped: 0, Time elapsed: 4.881 sec
Running org.apache.hadoop.hbase.mapreduce.TestTableInputFormatScan2
Tests run: 7, Failures: 0, Errors: 0, Skipped: 0, Time elapsed: 250.701 sec
Running org.apache.hadoop.hbase.mapreduce.TestWALPlayer
Tests run: 3, Failures: 0, Errors: 0, Skipped: 0, Time elapsed: 73.197 sec
Running org.apache.hadoop.hbase.mapreduce.TestCopyTable
Tests run: 4, Failures: 0, Errors: 0, Skipped: 0, Time elapsed: 117.447 sec
Running org.apache.hadoop.hbase.mapreduce.TestImportExport
Tests run: 11, Failures: 0, Errors: 0, Skipped: 0, Time elapsed: 333.797 sec
Running org.apache.hadoop.hbase.mapreduce.TestImportTSVWithOperationAttributes
Tests run: 2, Failures: 0, Errors: 0, Skipped: 0, Time elapsed: 97.447 sec
Running org.apache.hadoop.hbase.mapreduce.TestRowCounter
Tests run: 5, Failures: 0, Errors: 0, Skipped: 0, Time elapsed: 132.549 sec
Running org.apache.hadoop.hbase.mapreduce.TestSecureLoadIncrementalHFiles
Tests run: 8, Failures: 0, Errors: 0, Skipped: 0, Time elapsed: 16.244 sec
Running org.apache.hadoop.hbase.mapreduce.TestTimeRangeMapRed
Tests run: 1, Failures: 0, Errors: 0, Skipped: 0, Time elapsed: 58.628 sec
Running org.apache.hadoop.hbase.mapreduce.TestImportTsv
Tests run: 7, Failures: 0, Errors: 0, Skipped: 0, Time elapsed: 207.024 sec
Running org.apache.hadoop.hbase.mapreduce.TestLoadIncrementalHFiles
Tests run: 8, Failures: 0, Errors: 0, Skipped: 0, Time elapsed: 14.081 sec
Running org.apache.hadoop.hbase.mapreduce.TestHRegionPartitioner
Tests run: 1, Failures: 0, Errors: 0, Skipped: 0, Time elapsed: 26.044 sec
Running org.apache.hadoop.hbase.mapreduce.TestLoadIncrementalHFilesSplitRecovery
Tests run: 5, Failures: 0, Errors: 0, Skipped: 0, Time elapsed: 21.544 sec
Running org.apache.hadoop.hbase.mapreduce.TestTableSnapshotInputFormat
Tests run: 7, Failures: 0, Errors: 0, Skipped: 0, Time elapsed: 252.453 sec
Running org.apache.hadoop.hbase.mapreduce.TestImportTSVWithVisibilityLabels
Tests run: 5, Failures: 0, Errors: 0, Skipped: 0, Time elapsed: 182.727 sec
Running org.apache.hadoop.hbase.mapreduce.TestMultithreadedTableMapper
Tests run: 1, Failures: 0, Errors: 0, Skipped: 0, Time elapsed: 113.573 sec
Running org.apache.hadoop.hbase.mapreduce.TestHFileOutputFormat
Tests run: 13, Failures: 0, Errors: 0, Skipped: 1, Time elapsed: 258.987 sec
Running org.apache.hadoop.hbase.mapreduce.TestHFileOutputFormat2
Tests run: 13, Failures: 0, Errors: 0, Skipped: 1, Time elapsed: 257.118 sec
Running org.apache.hadoop.hbase.mapreduce.TestCellCounter
Tests run: 2, Failures: 0, Errors: 0, Skipped: 0, Time elapsed: 86.56 sec
Running org.apache.hadoop.hbase.mapreduce.TestTableInputFormatScan1
Tests run: 5, Failures: 0, Errors: 0, Skipped: 0, Time elapsed: 220.841 sec
Running org.apache.hadoop.hbase.mapreduce.TestSecureLoadIncrementalHFilesSplitRecovery
Tests run: 5, Failures: 0, Errors: 0, Skipped: 0, Time elapsed: 20.75 sec
Running org.apache.hadoop.hbase.filter.TestFilterWithScanLimits
Tests run: 1, Failures: 0, Errors: 0, Skipped: 0, Time elapsed: 9.315 sec
Running org.apache.hadoop.hbase.filter.TestFuzzyRowAndColumnRangeFilter
Tests run: 1, Failures: 0, Errors: 0, Skipped: 0, Time elapsed: 9.909 sec
Running org.apache.hadoop.hbase.filter.TestColumnRangeFilter
Tests run: 1, Failures: 0, Errors: 0, Skipped: 0, Time elapsed: 15.009 sec
Running org.apache.hadoop.hbase.filter.TestFilterWrapper
Tests run: 1, Failures: 0, Errors: 0, Skipped: 0, Time elapsed: 9.704 sec
Running org.apache.hadoop.hbase.TestMetaTableAccessor
Tests run: 8, Failures: 0, Errors: 0, Skipped: 0, Time elapsed: 12.952 sec
Running org.apache.hadoop.hbase.mapreduce.TestMultiTableInputFormat
Tests run: 4, Failures: 0, Errors: 0, Skipped: 0, Time elapsed: 169.023 sec

Results :

Tests run: 2008, Failures: 0, Errors: 0, Skipped: 21

[INFO] ------------------------------------------------------------------------
[INFO] Reactor Summary:
[INFO] 
[INFO] HBase ............................................. SUCCESS [2.569s]
[INFO] HBase - Common .................................... SUCCESS [34.280s]
[INFO] HBase - Protocol .................................. SUCCESS [9.008s]
[INFO] HBase - Client .................................... SUCCESS [54.501s]
[INFO] HBase - Hadoop Compatibility ...................... SUCCESS [5.254s]
[INFO] HBase - Hadoop Two Compatibility .................. SUCCESS [1.576s]
[INFO] HBase - Prefix Tree ............................... SUCCESS [3.324s]
[INFO] HBase - Server .................................... FAILURE [2:04:46.170s]
[INFO] HBase - Testing Util .............................. SKIPPED
[INFO] HBase - Thrift .................................... SKIPPED
[INFO] HBase - Shell ..................................... SKIPPED
[INFO] HBase - Integration Tests ......................... SKIPPED
[INFO] HBase - Examples .................................. SKIPPED
[INFO] HBase - Assembly .................................. SKIPPED
[INFO] ------------------------------------------------------------------------
[INFO] BUILD FAILURE
[INFO] ------------------------------------------------------------------------
[INFO] Total time: 2:06:37.506s
[INFO] Finished at: Thu Jul 17 01:51:32 UTC 2014
[INFO] Final Memory: 39M/834M
[INFO] ------------------------------------------------------------------------
[ERROR] Failed to execute goal org.apache.maven.plugins:maven-surefire-plugin:2.12-TRUNK-HBASE-2:test
(secondPartTestsExecution) on project hbase-server: Failure or timeout -> [Help 1]
[ERROR] 
[ERROR] To see the full stack trace of the errors, re-run Maven with the -e switch.
[ERROR] Re-run Maven using the -X switch to enable full debug logging.
[ERROR] 
[ERROR] For more information about the errors and possible solutions, please read the following
articles:
[ERROR] [Help 1] http://cwiki.apache.org/confluence/display/MAVEN/MojoExecutionException
[ERROR] 
[ERROR] After correcting the problems, you can resume the build with the command
[ERROR]   mvn <goals> -rf :hbase-server
Build step 'Invoke top-level Maven targets' marked build as failure
Performing Post build task...
Match found for :.* : True
Logical operation result is TRUE
Running script  :   ZOMBIE_TESTS_COUNT=`jps | grep surefirebooter | wc -l`
  if [[ $ZOMBIE_TESTS_COUNT != 0 ]] ; then
    #It seems sometimes the tests are not dying immediately. Let's give them 10s
    echo "Suspicious java process found - waiting 10s to see if there are just slow to stop"
    sleep 10   
    ZOMBIE_TESTS_COUNT=`jps | grep surefirebooter | wc -l`
    if [[ $ZOMBIE_TESTS_COUNT != 0 ]] ; then
      echo "There are $ZOMBIE_TESTS_COUNT zombie tests, they should have been killed by surefire
but survived"
      echo "************ BEGIN zombies jstack extract"
      ZB_STACK=`jps | grep surefirebooter | cut -d ' ' -f 1 | xargs -n 1 jstack | grep ".test"
| grep "\.java"`
      jps | grep surefirebooter | cut -d ' ' -f 1 | xargs -n 1 jstack
      echo "************ END  zombies jstack extract"
      JIRA_COMMENT="$JIRA_COMMENT

     {color:red}-1 core zombie tests{color}.  There are ${ZOMBIE_TESTS_COUNT} zombie test(s):
${ZB_STACK}"
      BAD=1
      jps | grep surefirebooter | cut -d ' ' -f 1 | xargs kill -9
    else
      echo "We're ok: there is no zombie test, but some tests took some time to stop"
    fi
  else
    echo "We're ok: there is no zombie test"
  fi
[HBase-1.0] $ /bin/bash -xe /tmp/hudson3699264413828080509.sh
++ jps
++ grep surefirebooter
++ wc -l
+ ZOMBIE_TESTS_COUNT=0
+ [[ 0 != 0 ]]
+ echo 'We'\''re ok: there is no zombie test'
We're ok: there is no zombie test
POST BUILD TASK : SUCCESS
END OF POST BUILD TASK : 0
Archiving artifacts
Sending artifact delta relative to HBase-1.0 #40
Archived 1728 artifacts
Archive block size is 32768
Received 77 blocks and 591783025 bytes
Compression is 0.4%
Took 2 min 41 sec
Recording test results
Updating HBASE-11517

Mime
View raw message