hbase-builds mailing list archives

Site index · List index
Message view « Date » · « Thread »
Top « Date » · « Thread »
From Apache Jenkins Server <jenk...@builds.apache.org>
Subject Build failed in Jenkins: HBase-TRUNK #5306
Date Tue, 15 Jul 2014 19:27:31 GMT
See <https://builds.apache.org/job/HBase-TRUNK/5306/changes>

Changes:

[ramkrishna] HBASE-10930 Change Filters and GetClosestRowBeforeTracker to work with

[stack] HBASE-11517 TestReplicaWithCluster turns zombie -- ADDS TIMEOUTS SO CAN DEBUG ZOMBIE

[ramkrishna] HBASE-11489 ClassNotFoundException while running IT tests in trunk using

------------------------------------------
[...truncated 1741 lines...]
Tests run: 4, Failures: 0, Errors: 0, Skipped: 0, Time elapsed: 21.423 sec
Running org.apache.hadoop.hbase.master.TestDistributedLogSplitting
Tests run: 17, Failures: 0, Errors: 0, Skipped: 0, Time elapsed: 144.544 sec
Running org.apache.hadoop.hbase.snapshot.TestFlushSnapshotFromClient
Tests run: 9, Failures: 0, Errors: 0, Skipped: 0, Time elapsed: 41.904 sec
Running org.apache.hadoop.hbase.snapshot.TestSnapshotDescriptionUtils
Tests run: 2, Failures: 0, Errors: 0, Skipped: 0, Time elapsed: 1.204 sec
Running org.apache.hadoop.hbase.snapshot.TestRestoreFlushSnapshotFromClient
Tests run: 5, Failures: 0, Errors: 0, Skipped: 0, Time elapsed: 48.055 sec
Running org.apache.hadoop.hbase.snapshot.TestExportSnapshot
Tests run: 9, Failures: 0, Errors: 0, Skipped: 0, Time elapsed: 298.122 sec
Running org.apache.hadoop.hbase.snapshot.TestSecureExportSnapshot
Tests run: 9, Failures: 0, Errors: 0, Skipped: 0, Time elapsed: 291.16 sec

Results :

Tests in error: 
  testCreateDeleteTable(org.apache.hadoop.hbase.client.TestReplicaWithCluster): test timed
out after 30000 milliseconds
  testChangeTable(org.apache.hadoop.hbase.client.TestReplicaWithCluster): test timed out after
30000 milliseconds

Tests run: 2072, Failures: 0, Errors: 2, Skipped: 21

[INFO] ------------------------------------------------------------------------
[INFO] Reactor Summary:
[INFO] 
[INFO] HBase ............................................. SUCCESS [2.548s]
[INFO] HBase - Common .................................... SUCCESS [37.456s]
[INFO] HBase - Protocol .................................. SUCCESS [8.813s]
[INFO] HBase - Client .................................... SUCCESS [54.667s]
[INFO] HBase - Hadoop Compatibility ...................... SUCCESS [5.327s]
[INFO] HBase - Hadoop Two Compatibility .................. SUCCESS [1.627s]
[INFO] HBase - Prefix Tree ............................... SUCCESS [3.481s]
[INFO] HBase - Server .................................... FAILURE [1:59:10.745s]
[INFO] HBase - Testing Util .............................. SKIPPED
[INFO] HBase - Thrift .................................... SKIPPED
[INFO] HBase - Shell ..................................... SKIPPED
[INFO] HBase - Integration Tests ......................... SKIPPED
[INFO] HBase - Examples .................................. SKIPPED
[INFO] HBase - Assembly .................................. SKIPPED
[INFO] ------------------------------------------------------------------------
[INFO] BUILD FAILURE
[INFO] ------------------------------------------------------------------------
[INFO] Total time: 2:01:05.425s
[INFO] Finished at: Tue Jul 15 19:22:16 UTC 2014
[INFO] Final Memory: 39M/781M
[INFO] ------------------------------------------------------------------------
[ERROR] Failed to execute goal org.apache.maven.plugins:maven-surefire-plugin:2.12-TRUNK-HBASE-2:test
(secondPartTestsExecution) on project hbase-server: There are test failures.
[ERROR] 
[ERROR] Please refer to <https://builds.apache.org/job/HBase-TRUNK/ws/hbase-server/target/surefire-reports>
for the individual test results.
[ERROR] -> [Help 1]
[ERROR] 
[ERROR] To see the full stack trace of the errors, re-run Maven with the -e switch.
[ERROR] Re-run Maven using the -X switch to enable full debug logging.
[ERROR] 
[ERROR] For more information about the errors and possible solutions, please read the following
articles:
[ERROR] [Help 1] http://cwiki.apache.org/confluence/display/MAVEN/MojoFailureException
[ERROR] 
[ERROR] After correcting the problems, you can resume the build with the command
[ERROR]   mvn <goals> -rf :hbase-server
Build step 'Invoke top-level Maven targets' marked build as failure
Performing Post build task...
Match found for :.* : True
Logical operation result is TRUE
Running script  :   ZOMBIE_TESTS_COUNT=`jps | grep surefirebooter | wc -l`
  if [[ $ZOMBIE_TESTS_COUNT != 0 ]] ; then
    #It seems sometimes the tests are not dying immediately. Let's give them 10s
    echo "Suspicious java process found - waiting 10s to see if there are just slow to stop"
    sleep 10   
    ZOMBIE_TESTS_COUNT=`jps | grep surefirebooter | wc -l`
    if [[ $ZOMBIE_TESTS_COUNT != 0 ]] ; then
      echo "There are $ZOMBIE_TESTS_COUNT zombie tests, they should have been killed by surefire
but survived"
      echo "************ BEGIN zombies jstack extract"
      ZB_STACK=`jps | grep surefirebooter | cut -d ' ' -f 1 | xargs -n 1 jstack | grep ".test"
| grep "\.java"`
      jps | grep surefirebooter | cut -d ' ' -f 1 | xargs -n 1 jstack
      echo "************ END  zombies jstack extract"
      JIRA_COMMENT="$JIRA_COMMENT

     {color:red}-1 core zombie tests{color}.  There are ${ZOMBIE_TESTS_COUNT} zombie test(s):
${ZB_STACK}"
      BAD=1
      jps | grep surefirebooter | cut -d ' ' -f 1 | xargs kill -9
    else
      echo "We're ok: there is no zombie test, but some tests took some time to stop"
    fi
  else
    echo "We're ok: there is no zombie test"
  fi
[HBase-TRUNK] $ /bin/bash -xe /tmp/hudson773173488591816601.sh
++ jps
++ grep surefirebooter
++ wc -l
+ ZOMBIE_TESTS_COUNT=1
+ [[ 1 != 0 ]]
+ echo 'Suspicious java process found - waiting 10s to see if there are just slow to stop'
Suspicious java process found - waiting 10s to see if there are just slow to stop
+ sleep 10
++ jps
++ wc -l
++ grep surefirebooter
+ ZOMBIE_TESTS_COUNT=1
+ [[ 1 != 0 ]]
+ echo 'There are 1 zombie tests, they should have been killed by surefire but survived'
There are 1 zombie tests, they should have been killed by surefire but survived
+ echo '************ BEGIN zombies jstack extract'
************ BEGIN zombies jstack extract
++ jps
++ grep surefirebooter
++ cut -d ' ' -f 1
++ grep .test
++ xargs -n 1 jstack
++ grep '\.java'
+ ZB_STACK='	at org.apache.axis2.jaxws.framework.StartServer.testStartServer(StartServer.java:42)'
+ jps
+ grep surefirebooter
+ xargs -n 1 jstack
+ cut -d ' ' -f 1
2014-07-15 19:22:31
Full thread dump Java HotSpot(TM) Server VM (20.45-b01 mixed mode):

"Attach Listener" daemon prio=10 tid=0xcd200800 nid=0xd4a waiting on condition [0x00000000]
   java.lang.Thread.State: RUNNABLE

"Low Memory Detector" daemon prio=10 tid=0xcd868400 nid=0xd2c runnable [0x00000000]
   java.lang.Thread.State: RUNNABLE

"C2 CompilerThread1" daemon prio=10 tid=0xcd866800 nid=0xd2b waiting on condition [0x00000000]
   java.lang.Thread.State: RUNNABLE

"C2 CompilerThread0" daemon prio=10 tid=0xcd864800 nid=0xd2a runnable [0x00000000]
   java.lang.Thread.State: RUNNABLE

"Signal Dispatcher" daemon prio=10 tid=0xcd863000 nid=0xd29 runnable [0x00000000]
   java.lang.Thread.State: RUNNABLE

"Finalizer" daemon prio=10 tid=0xcd855400 nid=0xd28 in Object.wait() [0xcf17d000]
   java.lang.Thread.State: WAITING (on object monitor)
	at java.lang.Object.wait(Native Method)
	- waiting on <0xe8ba1150> (a java.lang.ref.ReferenceQueue$Lock)
	at java.lang.ref.ReferenceQueue.remove(ReferenceQueue.java:118)
	- locked <0xe8ba1150> (a java.lang.ref.ReferenceQueue$Lock)
	at java.lang.ref.ReferenceQueue.remove(ReferenceQueue.java:134)
	at java.lang.ref.Finalizer$FinalizerThread.run(Finalizer.java:171)

"Reference Handler" daemon prio=10 tid=0xcd853c00 nid=0xd27 in Object.wait() [0xcf370000]
   java.lang.Thread.State: WAITING (on object monitor)
	at java.lang.Object.wait(Native Method)
	- waiting on <0xe8ba1050> (a java.lang.ref.Reference$Lock)
	at java.lang.Object.wait(Object.java:485)
	at java.lang.ref.Reference$ReferenceHandler.run(Reference.java:116)
	- locked <0xe8ba1050> (a java.lang.ref.Reference$Lock)

"main" prio=10 tid=0xf6705c00 nid=0xd08 runnable [0xf694f000]
   java.lang.Thread.State: RUNNABLE
	at java.util.zip.Inflater.inflateBytes(Native Method)
	at java.util.zip.Inflater.inflate(Inflater.java:238)
	- locked <0xeb5930a0> (a java.util.zip.ZStreamRef)
	at java.util.zip.InflaterInputStream.read(InflaterInputStream.java:135)
	at java.util.zip.ZipInputStream.read(ZipInputStream.java:154)
	at java.util.zip.ZipInputStream.closeEntry(ZipInputStream.java:100)
	at java.util.zip.ZipInputStream.getNextEntry(ZipInputStream.java:78)
	at org.apache.axis2.deployment.util.Utils.getURLsForAllJars(Utils.java:179)
	at org.apache.axis2.deployment.util.Utils.createClassLoader(Utils.java:813)
	at org.apache.axis2.jaxws.framework.JAXWSDeployer.deploy(JAXWSDeployer.java:145)
	at org.apache.axis2.deployment.repository.util.DeploymentFileData.deploy(DeploymentFileData.java:144)
	at org.apache.axis2.deployment.DeploymentEngine.doDeploy(DeploymentEngine.java:585)
	- locked <0xe92bcd68> (a org.apache.axis2.deployment.FileSystemConfigurator)
	at org.apache.axis2.deployment.repository.util.WSInfoList.update(WSInfoList.java:164)
	- locked <0xe92bcd68> (a org.apache.axis2.deployment.FileSystemConfigurator)
	at org.apache.axis2.deployment.RepositoryListener.update(RepositoryListener.java:377)
	at org.apache.axis2.deployment.RepositoryListener.checkServices(RepositoryListener.java:254)
	at org.apache.axis2.deployment.DeploymentEngine.loadServices(DeploymentEngine.java:136)
	at org.apache.axis2.deployment.FileSystemConfigurator.loadServices(FileSystemConfigurator.java:147)
	at org.apache.axis2.context.ConfigurationContextFactory.createConfigurationContext(ConfigurationContextFactory.java:95)
	at org.apache.axis2.context.ConfigurationContextFactory.createConfigurationContextFromFileSystem(ConfigurationContextFactory.java:210)
	at org.apache.axis2.jaxws.utility.SimpleServer.init(SimpleServer.java:58)
	at org.apache.axis2.jaxws.utility.SimpleServer.start(SimpleServer.java:68)
	at org.apache.axis2.jaxws.framework.StartServer.testStartServer(StartServer.java:42)
	at org.apache.axis2.jaxws.framework.AbstractTestCase$2.setUp(AbstractTestCase.java:64)
	at junit.extensions.TestSetup$1.protect(TestSetup.java:22)
	at junit.framework.TestResult.runProtected(TestResult.java:128)
	at junit.extensions.TestSetup.run(TestSetup.java:27)
	at org.junit.internal.runners.JUnit38ClassRunner.run(JUnit38ClassRunner.java:81)
	at org.apache.maven.surefire.junit4.JUnit4Provider.execute(JUnit4Provider.java:264)
	at org.apache.maven.surefire.junit4.JUnit4Provider.executeTestSet(JUnit4Provider.java:153)
	at org.apache.maven.surefire.junit4.JUnit4Provider.invoke(JUnit4Provider.java:124)
	at sun.reflect.NativeMethodAccessorImpl.invoke0(Native Method)
	at sun.reflect.NativeMethodAccessorImpl.invoke(NativeMethodAccessorImpl.java:39)
	at sun.reflect.DelegatingMethodAccessorImpl.invoke(DelegatingMethodAccessorImpl.java:25)
	at java.lang.reflect.Method.invoke(Method.java:597)
	at org.apache.maven.surefire.util.ReflectionUtils.invokeMethodWithArray2(ReflectionUtils.java:208)
	at org.apache.maven.surefire.booter.ProviderFactory$ProviderProxy.invoke(ProviderFactory.java:158)
	at org.apache.maven.surefire.booter.ProviderFactory.invokeProvider(ProviderFactory.java:86)
	at org.apache.maven.surefire.booter.ForkedBooter.runSuitesInProcess(ForkedBooter.java:153)
	at org.apache.maven.surefire.booter.ForkedBooter.main(ForkedBooter.java:95)

"VM Thread" prio=10 tid=0xcd850400 nid=0xd23 runnable 

"GC task thread#0 (ParallelGC)" prio=10 tid=0xf670d400 nid=0xd16 runnable 

"GC task thread#1 (ParallelGC)" prio=10 tid=0xf670e800 nid=0xd17 runnable 

"GC task thread#2 (ParallelGC)" prio=10 tid=0xf6710000 nid=0xd18 runnable 

"GC task thread#3 (ParallelGC)" prio=10 tid=0xf6711400 nid=0xd19 runnable 

"GC task thread#4 (ParallelGC)" prio=10 tid=0xf6712c00 nid=0xd1a runnable 

"GC task thread#5 (ParallelGC)" prio=10 tid=0xf6714000 nid=0xd1b runnable 

"GC task thread#6 (ParallelGC)" prio=10 tid=0xf6715800 nid=0xd1c runnable 

"GC task thread#7 (ParallelGC)" prio=10 tid=0xf6716c00 nid=0xd1d runnable 

"GC task thread#8 (ParallelGC)" prio=10 tid=0xf6718400 nid=0xd1e runnable 

"GC task thread#9 (ParallelGC)" prio=10 tid=0xf6719800 nid=0xd1f runnable 

"GC task thread#10 (ParallelGC)" prio=10 tid=0xf671b000 nid=0xd20 runnable 

"GC task thread#11 (ParallelGC)" prio=10 tid=0xf671c400 nid=0xd21 runnable 

"GC task thread#12 (ParallelGC)" prio=10 tid=0xf671dc00 nid=0xd22 runnable 

"VM Periodic Task Thread" prio=10 tid=0xcd86a400 nid=0xd2d waiting on condition 

JNI global references: 1135

+ echo '************ END  zombies jstack extract'
************ END  zombies jstack extract
+ JIRA_COMMENT='

     {color:red}-1 core zombie tests{color}.  There are 1 zombie test(s): 	at org.apache.axis2.jaxws.framework.StartServer.testStartServer(StartServer.java:42)'
+ BAD=1
+ jps
+ grep surefirebooter
+ cut -d ' ' -f 1
+ xargs kill -9
POST BUILD TASK : SUCCESS
END OF POST BUILD TASK : 0
Archiving artifacts
Sending artifact delta relative to HBase-TRUNK #5301
Archived 1740 artifacts
Archive block size is 32768
Received 83 blocks and 627220823 bytes
Compression is 0.4%
Took 2 min 53 sec
Recording test results
Updating HBASE-11517
Updating HBASE-11489
Updating HBASE-10930

Mime
View raw message