hbase-builds mailing list archives

Site index · List index
Message view « Date » · « Thread »
Top « Date » · « Thread »
From Apache Jenkins Server <jenk...@builds.apache.org>
Subject Build failed in Jenkins: HBase-0.94-security #429
Date Tue, 04 Mar 2014 13:13:33 GMT
See <https://builds.apache.org/job/HBase-0.94-security/429/changes>

Changes:

[mbertozzi] HBASE-10622 Improve log and Exceptions in Export Snapshot

------------------------------------------
[...truncated 20682 lines...]
Forking command line: /bin/sh -c cd <https://builds.apache.org/job/HBase-0.94-security/ws/trunk>
&& /home/jenkins/tools/java/jdk1.6.0_45-32/jre/bin/java -enableassertions -Xmx1900m
-Djava.security.egd=file:/dev/./urandom -jar <https://builds.apache.org/job/HBase-0.94-security/ws/trunk/target/surefire/surefirebooter2121029687331512138.jar>
<https://builds.apache.org/job/HBase-0.94-security/ws/trunk/target/surefire/surefire1416040842751046210tmp>
<https://builds.apache.org/job/HBase-0.94-security/ws/trunk/target/surefire/surefire_998469180187431854348tmp>
Running org.apache.hadoop.hbase.regionserver.handler.TestCloseRegionHandler
Tests run: 3, Failures: 0, Errors: 0, Skipped: 0, Time elapsed: 3.532 sec
Forking command line: /bin/sh -c cd <https://builds.apache.org/job/HBase-0.94-security/ws/trunk>
&& /home/jenkins/tools/java/jdk1.6.0_45-32/jre/bin/java -enableassertions -Xmx1900m
-Djava.security.egd=file:/dev/./urandom -jar <https://builds.apache.org/job/HBase-0.94-security/ws/trunk/target/surefire/surefirebooter3425494997181650768.jar>
<https://builds.apache.org/job/HBase-0.94-security/ws/trunk/target/surefire/surefire2789255294411413832tmp>
<https://builds.apache.org/job/HBase-0.94-security/ws/trunk/target/surefire/surefire_100568017793887921530tmp>
Running org.apache.hadoop.hbase.regionserver.handler.TestOpenRegionHandler
Tests run: 4, Failures: 0, Errors: 0, Skipped: 0, Time elapsed: 18.249 sec
Forking command line: /bin/sh -c cd <https://builds.apache.org/job/HBase-0.94-security/ws/trunk>
&& /home/jenkins/tools/java/jdk1.6.0_45-32/jre/bin/java -enableassertions -Xmx1900m
-Djava.security.egd=file:/dev/./urandom -jar <https://builds.apache.org/job/HBase-0.94-security/ws/trunk/target/surefire/surefirebooter8079233165276868884.jar>
<https://builds.apache.org/job/HBase-0.94-security/ws/trunk/target/surefire/surefire6426931670054978767tmp>
<https://builds.apache.org/job/HBase-0.94-security/ws/trunk/target/surefire/surefire_1014642038033164935747tmp>
Running org.apache.hadoop.hbase.regionserver.TestMasterAddressManager
Tests run: 1, Failures: 0, Errors: 0, Skipped: 0, Time elapsed: 1.487 sec
Forking command line: /bin/sh -c cd <https://builds.apache.org/job/HBase-0.94-security/ws/trunk>
&& /home/jenkins/tools/java/jdk1.6.0_45-32/jre/bin/java -enableassertions -Xmx1900m
-Djava.security.egd=file:/dev/./urandom -jar <https://builds.apache.org/job/HBase-0.94-security/ws/trunk/target/surefire/surefirebooter6459762202204091176.jar>
<https://builds.apache.org/job/HBase-0.94-security/ws/trunk/target/surefire/surefire7112997089307850045tmp>
<https://builds.apache.org/job/HBase-0.94-security/ws/trunk/target/surefire/surefire_1023328196368094809127tmp>
Running org.apache.hadoop.hbase.regionserver.TestSplitLogWorker
Tests run: 5, Failures: 0, Errors: 0, Skipped: 0, Time elapsed: 2.87 sec
Forking command line: /bin/sh -c cd <https://builds.apache.org/job/HBase-0.94-security/ws/trunk>
&& /home/jenkins/tools/java/jdk1.6.0_45-32/jre/bin/java -enableassertions -Xmx1900m
-Djava.security.egd=file:/dev/./urandom -jar <https://builds.apache.org/job/HBase-0.94-security/ws/trunk/target/surefire/surefirebooter6149743566593938999.jar>
<https://builds.apache.org/job/HBase-0.94-security/ws/trunk/target/surefire/surefire4353531109957206749tmp>
<https://builds.apache.org/job/HBase-0.94-security/ws/trunk/target/surefire/surefire_1031247575982224837503tmp>
Running org.apache.hadoop.hbase.regionserver.TestSeekOptimizations
Tests run: 6, Failures: 0, Errors: 0, Skipped: 0, Time elapsed: 6.469 sec
Forking command line: /bin/sh -c cd <https://builds.apache.org/job/HBase-0.94-security/ws/trunk>
&& /home/jenkins/tools/java/jdk1.6.0_45-32/jre/bin/java -enableassertions -Xmx1900m
-Djava.security.egd=file:/dev/./urandom -jar <https://builds.apache.org/job/HBase-0.94-security/ws/trunk/target/surefire/surefirebooter9025276141794091995.jar>
<https://builds.apache.org/job/HBase-0.94-security/ws/trunk/target/surefire/surefire866025010678168781tmp>
<https://builds.apache.org/job/HBase-0.94-security/ws/trunk/target/surefire/surefire_1045226462811791158368tmp>
Running org.apache.hadoop.hbase.regionserver.TestMultiColumnScanner
Tests run: 12, Failures: 0, Errors: 0, Skipped: 0, Time elapsed: 66.605 sec
Forking command line: /bin/sh -c cd <https://builds.apache.org/job/HBase-0.94-security/ws/trunk>
&& /home/jenkins/tools/java/jdk1.6.0_45-32/jre/bin/java -enableassertions -Xmx1900m
-Djava.security.egd=file:/dev/./urandom -jar <https://builds.apache.org/job/HBase-0.94-security/ws/trunk/target/surefire/surefirebooter5382949602486359978.jar>
<https://builds.apache.org/job/HBase-0.94-security/ws/trunk/target/surefire/surefire4683641820042165153tmp>
<https://builds.apache.org/job/HBase-0.94-security/ws/trunk/target/surefire/surefire_1054325646051825885353tmp>
Running org.apache.hadoop.hbase.regionserver.TestFSErrorsExposed
Tests run: 3, Failures: 0, Errors: 0, Skipped: 0, Time elapsed: 38.816 sec
Forking command line: /bin/sh -c cd <https://builds.apache.org/job/HBase-0.94-security/ws/trunk>
&& /home/jenkins/tools/java/jdk1.6.0_45-32/jre/bin/java -enableassertions -Xmx1900m
-Djava.security.egd=file:/dev/./urandom -jar <https://builds.apache.org/job/HBase-0.94-security/ws/trunk/target/surefire/surefirebooter768715602702539646.jar>
<https://builds.apache.org/job/HBase-0.94-security/ws/trunk/target/surefire/surefire1137451082264767857tmp>
<https://builds.apache.org/job/HBase-0.94-security/ws/trunk/target/surefire/surefire_1061154201132862316124tmp>
Running org.apache.hadoop.hbase.filter.TestColumnRangeFilter
Tests run: 1, Failures: 0, Errors: 0, Skipped: 0, Time elapsed: 29.421 sec
Forking command line: /bin/sh -c cd <https://builds.apache.org/job/HBase-0.94-security/ws/trunk>
&& /home/jenkins/tools/java/jdk1.6.0_45-32/jre/bin/java -enableassertions -Xmx1900m
-Djava.security.egd=file:/dev/./urandom -jar <https://builds.apache.org/job/HBase-0.94-security/ws/trunk/target/surefire/surefirebooter5231425268296323338.jar>
<https://builds.apache.org/job/HBase-0.94-security/ws/trunk/target/surefire/surefire8836425587467587012tmp>
<https://builds.apache.org/job/HBase-0.94-security/ws/trunk/target/surefire/surefire_1078790345880489366260tmp>
Running org.apache.hadoop.hbase.filter.TestFuzzyRowAndColumnRangeFilter
Tests run: 1, Failures: 0, Errors: 0, Skipped: 0, Time elapsed: 22.618 sec
Forking command line: /bin/sh -c cd <https://builds.apache.org/job/HBase-0.94-security/ws/trunk>
&& /home/jenkins/tools/java/jdk1.6.0_45-32/jre/bin/java -enableassertions -Xmx1900m
-Djava.security.egd=file:/dev/./urandom -jar <https://builds.apache.org/job/HBase-0.94-security/ws/trunk/target/surefire/surefirebooter8483673258825417726.jar>
<https://builds.apache.org/job/HBase-0.94-security/ws/trunk/target/surefire/surefire1069312975984446756tmp>
<https://builds.apache.org/job/HBase-0.94-security/ws/trunk/target/surefire/surefire_1084472272761285567159tmp>
Running org.apache.hadoop.hbase.TestGlobalMemStoreSize
Tests run: 1, Failures: 0, Errors: 0, Skipped: 0, Time elapsed: 27.769 sec
Forking command line: /bin/sh -c cd <https://builds.apache.org/job/HBase-0.94-security/ws/trunk>
&& /home/jenkins/tools/java/jdk1.6.0_45-32/jre/bin/java -enableassertions -Xmx1900m
-Djava.security.egd=file:/dev/./urandom -jar <https://builds.apache.org/job/HBase-0.94-security/ws/trunk/target/surefire/surefirebooter9073794516679935180.jar>
<https://builds.apache.org/job/HBase-0.94-security/ws/trunk/target/surefire/surefire6574463106642487982tmp>
<https://builds.apache.org/job/HBase-0.94-security/ws/trunk/target/surefire/surefire_1097177169352661701006tmp>
Running org.apache.hadoop.hbase.TestMultiVersions
Tests run: 3, Failures: 0, Errors: 0, Skipped: 0, Time elapsed: 28.859 sec
Forking command line: /bin/sh -c cd <https://builds.apache.org/job/HBase-0.94-security/ws/trunk>
&& /home/jenkins/tools/java/jdk1.6.0_45-32/jre/bin/java -enableassertions -Xmx1900m
-Djava.security.egd=file:/dev/./urandom -jar <https://builds.apache.org/job/HBase-0.94-security/ws/trunk/target/surefire/surefirebooter6474198898673735584.jar>
<https://builds.apache.org/job/HBase-0.94-security/ws/trunk/target/surefire/surefire6074944649426990315tmp>
<https://builds.apache.org/job/HBase-0.94-security/ws/trunk/target/surefire/surefire_110776725741715484266tmp>
Running org.apache.hadoop.hbase.replication.TestReplicationZookeeper
Tests run: 1, Failures: 0, Errors: 0, Skipped: 0, Time elapsed: 1.757 sec
Forking command line: /bin/sh -c cd <https://builds.apache.org/job/HBase-0.94-security/ws/trunk>
&& /home/jenkins/tools/java/jdk1.6.0_45-32/jre/bin/java -enableassertions -Xmx1900m
-Djava.security.egd=file:/dev/./urandom -jar <https://builds.apache.org/job/HBase-0.94-security/ws/trunk/target/surefire/surefirebooter5351356656398857600.jar>
<https://builds.apache.org/job/HBase-0.94-security/ws/trunk/target/surefire/surefire2633913122741379938tmp>
<https://builds.apache.org/job/HBase-0.94-security/ws/trunk/target/surefire/surefire_1116057723560321522653tmp>
Running org.apache.hadoop.hbase.replication.regionserver.TestReplicationSourceManager
Tests run: 3, Failures: 0, Errors: 0, Skipped: 0, Time elapsed: 3.858 sec
Forking command line: /bin/sh -c cd <https://builds.apache.org/job/HBase-0.94-security/ws/trunk>
&& /home/jenkins/tools/java/jdk1.6.0_45-32/jre/bin/java -enableassertions -Xmx1900m
-Djava.security.egd=file:/dev/./urandom -jar <https://builds.apache.org/job/HBase-0.94-security/ws/trunk/target/surefire/surefirebooter4370556588989607231.jar>
<https://builds.apache.org/job/HBase-0.94-security/ws/trunk/target/surefire/surefire4366832273104201639tmp>
<https://builds.apache.org/job/HBase-0.94-security/ws/trunk/target/surefire/surefire_1124217434180078708597tmp>
Running org.apache.hadoop.hbase.thrift2.TestThriftHBaseServiceHandler
Tests run: 19, Failures: 0, Errors: 0, Skipped: 0, Time elapsed: 23.534 sec
Forking command line: /bin/sh -c cd <https://builds.apache.org/job/HBase-0.94-security/ws/trunk>
&& /home/jenkins/tools/java/jdk1.6.0_45-32/jre/bin/java -enableassertions -Xmx1900m
-Djava.security.egd=file:/dev/./urandom -jar <https://builds.apache.org/job/HBase-0.94-security/ws/trunk/target/surefire/surefirebooter7700118634512280439.jar>
<https://builds.apache.org/job/HBase-0.94-security/ws/trunk/target/surefire/surefire408213970615583315tmp>
<https://builds.apache.org/job/HBase-0.94-security/ws/trunk/target/surefire/surefire_1135952013055830272435tmp>
Running org.apache.hadoop.hbase.replication.TestReplicationSource
Tests run: 1, Failures: 0, Errors: 0, Skipped: 0, Time elapsed: 6.16 sec
Forking command line: /bin/sh -c cd <https://builds.apache.org/job/HBase-0.94-security/ws/trunk>
&& /home/jenkins/tools/java/jdk1.6.0_45-32/jre/bin/java -enableassertions -Xmx1900m
-Djava.security.egd=file:/dev/./urandom -jar <https://builds.apache.org/job/HBase-0.94-security/ws/trunk/target/surefire/surefirebooter4286672429371272156.jar>
<https://builds.apache.org/job/HBase-0.94-security/ws/trunk/target/surefire/surefire1765635278641024558tmp>
<https://builds.apache.org/job/HBase-0.94-security/ws/trunk/target/surefire/surefire_1146811307720960468820tmp>
Running org.apache.hadoop.hbase.replication.regionserver.TestReplicationSink
Tests run: 5, Failures: 0, Errors: 0, Skipped: 0, Time elapsed: 28.26 sec
Forking command line: /bin/sh -c cd <https://builds.apache.org/job/HBase-0.94-security/ws/trunk>
&& /home/jenkins/tools/java/jdk1.6.0_45-32/jre/bin/java -enableassertions -Xmx1900m
-Djava.security.egd=file:/dev/./urandom -jar <https://builds.apache.org/job/HBase-0.94-security/ws/trunk/target/surefire/surefirebooter7628239259000348246.jar>
<https://builds.apache.org/job/HBase-0.94-security/ws/trunk/target/surefire/surefire89749363281849818tmp>
<https://builds.apache.org/job/HBase-0.94-security/ws/trunk/target/surefire/surefire_1151656642311376776931tmp>
Running org.apache.hadoop.hbase.TestHBaseFileSystem
Tests run: 2, Failures: 0, Errors: 0, Skipped: 0, Time elapsed: 25.762 sec
Forking command line: /bin/sh -c cd <https://builds.apache.org/job/HBase-0.94-security/ws/trunk>
&& /home/jenkins/tools/java/jdk1.6.0_45-32/jre/bin/java -enableassertions -Xmx1900m
-Djava.security.egd=file:/dev/./urandom -jar <https://builds.apache.org/job/HBase-0.94-security/ws/trunk/target/surefire/surefirebooter835429390315848765.jar>
<https://builds.apache.org/job/HBase-0.94-security/ws/trunk/target/surefire/surefire6959914028344286504tmp>
<https://builds.apache.org/job/HBase-0.94-security/ws/trunk/target/surefire/surefire_1166948847165194711338tmp>
Running org.apache.hadoop.hbase.avro.TestAvroServer
Tests run: 3, Failures: 0, Errors: 0, Skipped: 0, Time elapsed: 32.596 sec
Forking command line: /bin/sh -c cd <https://builds.apache.org/job/HBase-0.94-security/ws/trunk>
&& /home/jenkins/tools/java/jdk1.6.0_45-32/jre/bin/java -enableassertions -Xmx1900m
-Djava.security.egd=file:/dev/./urandom -jar <https://builds.apache.org/job/HBase-0.94-security/ws/trunk/target/surefire/surefirebooter3174000971614501870.jar>
<https://builds.apache.org/job/HBase-0.94-security/ws/trunk/target/surefire/surefire4285345793007710813tmp>
<https://builds.apache.org/job/HBase-0.94-security/ws/trunk/target/surefire/surefire_1175899777662345878509tmp>
Running org.apache.hadoop.hbase.TestLocalHBaseCluster
Tests run: 1, Failures: 0, Errors: 0, Skipped: 0, Time elapsed: 13.843 sec
Forking command line: /bin/sh -c cd <https://builds.apache.org/job/HBase-0.94-security/ws/trunk>
&& /home/jenkins/tools/java/jdk1.6.0_45-32/jre/bin/java -enableassertions -Xmx1900m
-Djava.security.egd=file:/dev/./urandom -jar <https://builds.apache.org/job/HBase-0.94-security/ws/trunk/target/surefire/surefirebooter5265519686878901869.jar>
<https://builds.apache.org/job/HBase-0.94-security/ws/trunk/target/surefire/surefire2799344917779309626tmp>
<https://builds.apache.org/job/HBase-0.94-security/ws/trunk/target/surefire/surefire_11816067905100601087tmp>
Running org.apache.hadoop.hbase.coprocessor.TestRegionServerCoprocessorExceptionWithRemove
Tests run: 1, Failures: 0, Errors: 0, Skipped: 0, Time elapsed: 26.867 sec
Forking command line: /bin/sh -c cd <https://builds.apache.org/job/HBase-0.94-security/ws/trunk>
&& /home/jenkins/tools/java/jdk1.6.0_45-32/jre/bin/java -enableassertions -Xmx1900m
-Djava.security.egd=file:/dev/./urandom -jar <https://builds.apache.org/job/HBase-0.94-security/ws/trunk/target/surefire/surefirebooter6946368686702100760.jar>
<https://builds.apache.org/job/HBase-0.94-security/ws/trunk/target/surefire/surefire3895671236787800016tmp>
<https://builds.apache.org/job/HBase-0.94-security/ws/trunk/target/surefire/surefire_119641070907544527014tmp>
Running org.apache.hadoop.hbase.TestAcidGuarantees
Tests run: 3, Failures: 0, Errors: 0, Skipped: 0, Time elapsed: 103.792 sec
Forking command line: /bin/sh -c cd <https://builds.apache.org/job/HBase-0.94-security/ws/trunk>
&& /home/jenkins/tools/java/jdk1.6.0_45-32/jre/bin/java -enableassertions -Xmx1900m
-Djava.security.egd=file:/dev/./urandom -jar <https://builds.apache.org/job/HBase-0.94-security/ws/trunk/target/surefire/surefirebooter5266200367161100382.jar>
<https://builds.apache.org/job/HBase-0.94-security/ws/trunk/target/surefire/surefire6364571307752747266tmp>
<https://builds.apache.org/job/HBase-0.94-security/ws/trunk/target/surefire/surefire_1206009098388930251809tmp>
Running org.apache.hadoop.hbase.coprocessor.TestRegionObserverInterface
Tests run: 7, Failures: 0, Errors: 0, Skipped: 0, Time elapsed: 44.977 sec
Forking command line: /bin/sh -c cd <https://builds.apache.org/job/HBase-0.94-security/ws/trunk>
&& /home/jenkins/tools/java/jdk1.6.0_45-32/jre/bin/java -enableassertions -Xmx1900m
-Djava.security.egd=file:/dev/./urandom -jar <https://builds.apache.org/job/HBase-0.94-security/ws/trunk/target/surefire/surefirebooter6475467280023156410.jar>
<https://builds.apache.org/job/HBase-0.94-security/ws/trunk/target/surefire/surefire6185420137541622666tmp>
<https://builds.apache.org/job/HBase-0.94-security/ws/trunk/target/surefire/surefire_121778074630253568782tmp>
Running org.apache.hadoop.hbase.coprocessor.TestCoprocessorEndpoint
Tests run: 4, Failures: 0, Errors: 0, Skipped: 1, Time elapsed: 37.307 sec
Forking command line: /bin/sh -c cd <https://builds.apache.org/job/HBase-0.94-security/ws/trunk>
&& /home/jenkins/tools/java/jdk1.6.0_45-32/jre/bin/java -enableassertions -Xmx1900m
-Djava.security.egd=file:/dev/./urandom -jar <https://builds.apache.org/job/HBase-0.94-security/ws/trunk/target/surefire/surefirebooter8476165939656743103.jar>
<https://builds.apache.org/job/HBase-0.94-security/ws/trunk/target/surefire/surefire7685737344117757596tmp>
<https://builds.apache.org/job/HBase-0.94-security/ws/trunk/target/surefire/surefire_1224541180765439881455tmp>
Running org.apache.hadoop.hbase.coprocessor.TestMasterObserver
Tests run: 5, Failures: 0, Errors: 0, Skipped: 0, Time elapsed: 52.76 sec
Forking command line: /bin/sh -c cd <https://builds.apache.org/job/HBase-0.94-security/ws/trunk>
&& /home/jenkins/tools/java/jdk1.6.0_45-32/jre/bin/java -enableassertions -Xmx1900m
-Djava.security.egd=file:/dev/./urandom -jar <https://builds.apache.org/job/HBase-0.94-security/ws/trunk/target/surefire/surefirebooter8494336486930062186.jar>
<https://builds.apache.org/job/HBase-0.94-security/ws/trunk/target/surefire/surefire7081938972156809163tmp>
<https://builds.apache.org/job/HBase-0.94-security/ws/trunk/target/surefire/surefire_1235053927130969439660tmp>
Running org.apache.hadoop.hbase.coprocessor.TestWALObserver
Tests run: 3, Failures: 0, Errors: 0, Skipped: 0, Time elapsed: 27.95 sec
Forking command line: /bin/sh -c cd <https://builds.apache.org/job/HBase-0.94-security/ws/trunk>
&& /home/jenkins/tools/java/jdk1.6.0_45-32/jre/bin/java -enableassertions -Xmx1900m
-Djava.security.egd=file:/dev/./urandom -jar <https://builds.apache.org/job/HBase-0.94-security/ws/trunk/target/surefire/surefirebooter3165029308494068587.jar>
<https://builds.apache.org/job/HBase-0.94-security/ws/trunk/target/surefire/surefire1580239925007755939tmp>
<https://builds.apache.org/job/HBase-0.94-security/ws/trunk/target/surefire/surefire_1243210137059062823429tmp>
Running org.apache.hadoop.hbase.coprocessor.TestHTableWrapper
Tests run: 1, Failures: 0, Errors: 0, Skipped: 0, Time elapsed: 29.567 sec
Forking command line: /bin/sh -c cd <https://builds.apache.org/job/HBase-0.94-security/ws/trunk>
&& /home/jenkins/tools/java/jdk1.6.0_45-32/jre/bin/java -enableassertions -Xmx1900m
-Djava.security.egd=file:/dev/./urandom -jar <https://builds.apache.org/job/HBase-0.94-security/ws/trunk/target/surefire/surefirebooter7004922570352502390.jar>
<https://builds.apache.org/job/HBase-0.94-security/ws/trunk/target/surefire/surefire1609076004164574051tmp>
<https://builds.apache.org/job/HBase-0.94-security/ws/trunk/target/surefire/surefire_125898916661550514115tmp>
Running org.apache.hadoop.hbase.coprocessor.TestBigDecimalColumnInterpreter
Tests run: 38, Failures: 0, Errors: 0, Skipped: 0, Time elapsed: 25.439 sec
Forking command line: /bin/sh -c cd <https://builds.apache.org/job/HBase-0.94-security/ws/trunk>
&& /home/jenkins/tools/java/jdk1.6.0_45-32/jre/bin/java -enableassertions -Xmx1900m
-Djava.security.egd=file:/dev/./urandom -jar <https://builds.apache.org/job/HBase-0.94-security/ws/trunk/target/surefire/surefirebooter3378168866842463697.jar>
<https://builds.apache.org/job/HBase-0.94-security/ws/trunk/target/surefire/surefire1798126358670450239tmp>
<https://builds.apache.org/job/HBase-0.94-security/ws/trunk/target/surefire/surefire_1266562896507011458816tmp>
Running org.apache.hadoop.hbase.coprocessor.TestRegionObserverBypass
Tests run: 2, Failures: 0, Errors: 0, Skipped: 0, Time elapsed: 20.284 sec
Forking command line: /bin/sh -c cd <https://builds.apache.org/job/HBase-0.94-security/ws/trunk>
&& /home/jenkins/tools/java/jdk1.6.0_45-32/jre/bin/java -enableassertions -Xmx1900m
-Djava.security.egd=file:/dev/./urandom -jar <https://builds.apache.org/job/HBase-0.94-security/ws/trunk/target/surefire/surefirebooter6649228835721640466.jar>
<https://builds.apache.org/job/HBase-0.94-security/ws/trunk/target/surefire/surefire2866583341920921479tmp>
<https://builds.apache.org/job/HBase-0.94-security/ws/trunk/target/surefire/surefire_1272934432250768109848tmp>
Running org.apache.hadoop.hbase.coprocessor.example.TestZooKeeperScanPolicyObserver
Tests run: 1, Failures: 0, Errors: 0, Skipped: 0, Time elapsed: 25.055 sec
Forking command line: /bin/sh -c cd <https://builds.apache.org/job/HBase-0.94-security/ws/trunk>
&& /home/jenkins/tools/java/jdk1.6.0_45-32/jre/bin/java -enableassertions -Xmx1900m
-Djava.security.egd=file:/dev/./urandom -jar <https://builds.apache.org/job/HBase-0.94-security/ws/trunk/target/surefire/surefirebooter4987448478353583901.jar>
<https://builds.apache.org/job/HBase-0.94-security/ws/trunk/target/surefire/surefire1712375604153686105tmp>
<https://builds.apache.org/job/HBase-0.94-security/ws/trunk/target/surefire/surefire_1284842387404317051130tmp>
Running org.apache.hadoop.hbase.coprocessor.example.TestBulkDeleteProtocol
Tests run: 8, Failures: 0, Errors: 0, Skipped: 0, Time elapsed: 53.259 sec
Forking command line: /bin/sh -c cd <https://builds.apache.org/job/HBase-0.94-security/ws/trunk>
&& /home/jenkins/tools/java/jdk1.6.0_45-32/jre/bin/java -enableassertions -Xmx1900m
-Djava.security.egd=file:/dev/./urandom -jar <https://builds.apache.org/job/HBase-0.94-security/ws/trunk/target/surefire/surefirebooter1977538945486548350.jar>
<https://builds.apache.org/job/HBase-0.94-security/ws/trunk/target/surefire/surefire3702797686299213002tmp>
<https://builds.apache.org/job/HBase-0.94-security/ws/trunk/target/surefire/surefire_129707992932992974817tmp>
Running org.apache.hadoop.hbase.coprocessor.TestMasterCoprocessorExceptionWithAbort
Tests run: 1, Failures: 0, Errors: 0, Skipped: 0, Time elapsed: 42.501 sec
Forking command line: /bin/sh -c cd <https://builds.apache.org/job/HBase-0.94-security/ws/trunk>
&& /home/jenkins/tools/java/jdk1.6.0_45-32/jre/bin/java -enableassertions -Xmx1900m
-Djava.security.egd=file:/dev/./urandom -jar <https://builds.apache.org/job/HBase-0.94-security/ws/trunk/target/surefire/surefirebooter8807808091113456521.jar>
<https://builds.apache.org/job/HBase-0.94-security/ws/trunk/target/surefire/surefire7893990419604106991tmp>
<https://builds.apache.org/job/HBase-0.94-security/ws/trunk/target/surefire/surefire_1302136872828054200661tmp>
Running org.apache.hadoop.hbase.coprocessor.TestRegionServerCoprocessorExceptionWithAbort
Tests run: 1, Failures: 1, Errors: 0, Skipped: 0, Time elapsed: 24.331 sec <<< FAILURE!
Forking command line: /bin/sh -c cd <https://builds.apache.org/job/HBase-0.94-security/ws/trunk>
&& /home/jenkins/tools/java/jdk1.6.0_45-32/jre/bin/java -enableassertions -Xmx1900m
-Djava.security.egd=file:/dev/./urandom -jar <https://builds.apache.org/job/HBase-0.94-security/ws/trunk/target/surefire/surefirebooter971860880228391686.jar>
<https://builds.apache.org/job/HBase-0.94-security/ws/trunk/target/surefire/surefire3787591822625754003tmp>
<https://builds.apache.org/job/HBase-0.94-security/ws/trunk/target/surefire/surefire_1317508993015260448991tmp>
Running org.apache.hadoop.hbase.coprocessor.TestOpenTableInCoprocessor
Tests run: 2, Failures: 0, Errors: 0, Skipped: 0, Time elapsed: 33.339 sec
Running org.apache.hadoop.hbase.coprocessor.TestAggregateProtocol
Forking command line: /bin/sh -c cd <https://builds.apache.org/job/HBase-0.94-security/ws/trunk>
&& /home/jenkins/tools/java/jdk1.6.0_45-32/jre/bin/java -enableassertions -Xmx1900m
-Djava.security.egd=file:/dev/./urandom -jar <https://builds.apache.org/job/HBase-0.94-security/ws/trunk/target/surefire/surefirebooter2304804512011335070.jar>
<https://builds.apache.org/job/HBase-0.94-security/ws/trunk/target/surefire/surefire4191075504443510805tmp>
<https://builds.apache.org/job/HBase-0.94-security/ws/trunk/target/surefire/surefire_1329130382768671179186tmp>
Tests run: 45, Failures: 0, Errors: 0, Skipped: 0, Time elapsed: 26.104 sec
Forking command line: /bin/sh -c cd <https://builds.apache.org/job/HBase-0.94-security/ws/trunk>
&& /home/jenkins/tools/java/jdk1.6.0_45-32/jre/bin/java -enableassertions -Xmx1900m
-Djava.security.egd=file:/dev/./urandom -jar <https://builds.apache.org/job/HBase-0.94-security/ws/trunk/target/surefire/surefirebooter5945748028642578019.jar>
<https://builds.apache.org/job/HBase-0.94-security/ws/trunk/target/surefire/surefire5611103597170133193tmp>
<https://builds.apache.org/job/HBase-0.94-security/ws/trunk/target/surefire/surefire_1334550134675961294950tmp>
Running org.apache.hadoop.hbase.coprocessor.TestMasterCoprocessorExceptionWithRemove
Tests run: 1, Failures: 0, Errors: 0, Skipped: 0, Time elapsed: 21.692 sec
Forking command line: /bin/sh -c cd <https://builds.apache.org/job/HBase-0.94-security/ws/trunk>
&& /home/jenkins/tools/java/jdk1.6.0_45-32/jre/bin/java -enableassertions -Xmx1900m
-Djava.security.egd=file:/dev/./urandom -jar <https://builds.apache.org/job/HBase-0.94-security/ws/trunk/target/surefire/surefirebooter1329385757674906632.jar>
<https://builds.apache.org/job/HBase-0.94-security/ws/trunk/target/surefire/surefire1939805827425638454tmp>
<https://builds.apache.org/job/HBase-0.94-security/ws/trunk/target/surefire/surefire_1341443925048426825549tmp>
Running org.apache.hadoop.hbase.coprocessor.TestRegionObserverScannerOpenHook
Tests run: 1, Failures: 0, Errors: 0, Skipped: 0, Time elapsed: 19.996 sec
Forking command line: /bin/sh -c cd <https://builds.apache.org/job/HBase-0.94-security/ws/trunk>
&& /home/jenkins/tools/java/jdk1.6.0_45-32/jre/bin/java -enableassertions -Xmx1900m
-Djava.security.egd=file:/dev/./urandom -jar <https://builds.apache.org/job/HBase-0.94-security/ws/trunk/target/surefire/surefirebooter5281142427350945858.jar>
<https://builds.apache.org/job/HBase-0.94-security/ws/trunk/target/surefire/surefire4815359380650243545tmp>
<https://builds.apache.org/job/HBase-0.94-security/ws/trunk/target/surefire/surefire_13552295658078274099tmp>
Running org.apache.hadoop.hbase.coprocessor.TestClassLoading
Tests run: 8, Failures: 0, Errors: 0, Skipped: 0, Time elapsed: 44.434 sec
Forking command line: /bin/sh -c cd <https://builds.apache.org/job/HBase-0.94-security/ws/trunk>
&& /home/jenkins/tools/java/jdk1.6.0_45-32/jre/bin/java -enableassertions -Xmx1900m
-Djava.security.egd=file:/dev/./urandom -jar <https://builds.apache.org/job/HBase-0.94-security/ws/trunk/target/surefire/surefirebooter3226688854553017074.jar>
<https://builds.apache.org/job/HBase-0.94-security/ws/trunk/target/surefire/surefire3614345265704806925tmp>
<https://builds.apache.org/job/HBase-0.94-security/ws/trunk/target/surefire/surefire_136889957806540725847tmp>
Running org.apache.hadoop.hbase.procedure.TestZKProcedureControllers
Tests run: 4, Failures: 0, Errors: 0, Skipped: 0, Time elapsed: 8.011 sec
Forking command line: /bin/sh -c cd <https://builds.apache.org/job/HBase-0.94-security/ws/trunk>
&& /home/jenkins/tools/java/jdk1.6.0_45-32/jre/bin/java -enableassertions -Xmx1900m
-Djava.security.egd=file:/dev/./urandom -jar <https://builds.apache.org/job/HBase-0.94-security/ws/trunk/target/surefire/surefirebooter4039757042311410191.jar>
<https://builds.apache.org/job/HBase-0.94-security/ws/trunk/target/surefire/surefire6798511718579915079tmp>
<https://builds.apache.org/job/HBase-0.94-security/ws/trunk/target/surefire/surefire_1378521526778622322558tmp>
Running org.apache.hadoop.hbase.procedure.TestZKProcedure
Tests run: 4, Failures: 0, Errors: 0, Skipped: 0, Time elapsed: 8.039 sec
Forking command line: /bin/sh -c cd <https://builds.apache.org/job/HBase-0.94-security/ws/trunk>
&& /home/jenkins/tools/java/jdk1.6.0_45-32/jre/bin/java -enableassertions -Xmx1900m
-Djava.security.egd=file:/dev/./urandom -jar <https://builds.apache.org/job/HBase-0.94-security/ws/trunk/target/surefire/surefirebooter4292465026110365471.jar>
<https://builds.apache.org/job/HBase-0.94-security/ws/trunk/target/surefire/surefire6653515096662107015tmp>
<https://builds.apache.org/job/HBase-0.94-security/ws/trunk/target/surefire/surefire_138888127335078871190tmp>
Running org.apache.hadoop.hbase.snapshot.TestSnapshotDescriptionUtils
Tests run: 2, Failures: 0, Errors: 0, Skipped: 0, Time elapsed: 3.547 sec
Forking command line: /bin/sh -c cd <https://builds.apache.org/job/HBase-0.94-security/ws/trunk>
&& /home/jenkins/tools/java/jdk1.6.0_45-32/jre/bin/java -enableassertions -Xmx1900m
-Djava.security.egd=file:/dev/./urandom -jar <https://builds.apache.org/job/HBase-0.94-security/ws/trunk/target/surefire/surefirebooter3862479933284269453.jar>
<https://builds.apache.org/job/HBase-0.94-security/ws/trunk/target/surefire/surefire4528740911854563711tmp>
<https://builds.apache.org/job/HBase-0.94-security/ws/trunk/target/surefire/surefire_1392182909570574257014tmp>
Running org.apache.hadoop.hbase.constraint.TestConstraint
Tests run: 5, Failures: 0, Errors: 0, Skipped: 0, Time elapsed: 48.698 sec
Forking command line: /bin/sh -c cd <https://builds.apache.org/job/HBase-0.94-security/ws/trunk>
&& /home/jenkins/tools/java/jdk1.6.0_45-32/jre/bin/java -enableassertions -Xmx1900m
-Djava.security.egd=file:/dev/./urandom -jar <https://builds.apache.org/job/HBase-0.94-security/ws/trunk/target/surefire/surefirebooter7608044919200468081.jar>
<https://builds.apache.org/job/HBase-0.94-security/ws/trunk/target/surefire/surefire7578911122168564210tmp>
<https://builds.apache.org/job/HBase-0.94-security/ws/trunk/target/surefire/surefire_1403473935680524800907tmp>
Running org.apache.hadoop.hbase.master.TestOpenedRegionHandler
Tests run: 2, Failures: 0, Errors: 0, Skipped: 0, Time elapsed: 21.142 sec
Forking command line: /bin/sh -c cd <https://builds.apache.org/job/HBase-0.94-security/ws/trunk>
&& /home/jenkins/tools/java/jdk1.6.0_45-32/jre/bin/java -enableassertions -Xmx1900m
-Djava.security.egd=file:/dev/./urandom -jar <https://builds.apache.org/job/HBase-0.94-security/ws/trunk/target/surefire/surefirebooter6436978899507526642.jar>
<https://builds.apache.org/job/HBase-0.94-security/ws/trunk/target/surefire/surefire4916271122963572892tmp>
<https://builds.apache.org/job/HBase-0.94-security/ws/trunk/target/surefire/surefire_1417336958363557745166tmp>
Running org.apache.hadoop.hbase.master.TestAssignmentManager
Tests run: 15, Failures: 0, Errors: 0, Skipped: 0, Time elapsed: 6.99 sec
Forking command line: /bin/sh -c cd <https://builds.apache.org/job/HBase-0.94-security/ws/trunk>
&& /home/jenkins/tools/java/jdk1.6.0_45-32/jre/bin/java -enableassertions -Xmx1900m
-Djava.security.egd=file:/dev/./urandom -jar <https://builds.apache.org/job/HBase-0.94-security/ws/trunk/target/surefire/surefirebooter529256069526661432.jar>
<https://builds.apache.org/job/HBase-0.94-security/ws/trunk/target/surefire/surefire1346442782894353283tmp>
<https://builds.apache.org/job/HBase-0.94-security/ws/trunk/target/surefire/surefire_1421614887196579059662tmp>
Running org.apache.hadoop.hbase.master.TestActiveMasterManager
Tests run: 2, Failures: 0, Errors: 0, Skipped: 0, Time elapsed: 3.391 sec
Forking command line: /bin/sh -c cd <https://builds.apache.org/job/HBase-0.94-security/ws/trunk>
&& /home/jenkins/tools/java/jdk1.6.0_45-32/jre/bin/java -enableassertions -Xmx1900m
-Djava.security.egd=file:/dev/./urandom -jar <https://builds.apache.org/job/HBase-0.94-security/ws/trunk/target/surefire/surefirebooter6698897195307741392.jar>
<https://builds.apache.org/job/HBase-0.94-security/ws/trunk/target/surefire/surefire4777793317561535885tmp>
<https://builds.apache.org/job/HBase-0.94-security/ws/trunk/target/surefire/surefire_1432759962954683232252tmp>
Running org.apache.hadoop.hbase.master.TestMasterStatusServlet
Tests run: 5, Failures: 0, Errors: 0, Skipped: 0, Time elapsed: 4.616 sec
Forking command line: /bin/sh -c cd <https://builds.apache.org/job/HBase-0.94-security/ws/trunk>
&& /home/jenkins/tools/java/jdk1.6.0_45-32/jre/bin/java -enableassertions -Xmx1900m
-Djava.security.egd=file:/dev/./urandom -jar <https://builds.apache.org/job/HBase-0.94-security/ws/trunk/target/surefire/surefirebooter6110670455635019212.jar>
<https://builds.apache.org/job/HBase-0.94-security/ws/trunk/target/surefire/surefire2938241721814019930tmp>
<https://builds.apache.org/job/HBase-0.94-security/ws/trunk/target/surefire/surefire_144857466584492588406tmp>
Running org.apache.hadoop.hbase.master.TestClockSkewDetection
Tests run: 1, Failures: 0, Errors: 0, Skipped: 0, Time elapsed: 1.035 sec
Forking command line: /bin/sh -c cd <https://builds.apache.org/job/HBase-0.94-security/ws/trunk>
&& /home/jenkins/tools/java/jdk1.6.0_45-32/jre/bin/java -enableassertions -Xmx1900m
-Djava.security.egd=file:/dev/./urandom -jar <https://builds.apache.org/job/HBase-0.94-security/ws/trunk/target/surefire/surefirebooter8245684480175344336.jar>
<https://builds.apache.org/job/HBase-0.94-security/ws/trunk/target/surefire/surefire5362453204070582415tmp>
<https://builds.apache.org/job/HBase-0.94-security/ws/trunk/target/surefire/surefire_1451517231389069808207tmp>
Running org.apache.hadoop.hbase.master.metrics.TestMasterStatistics
Tests run: 2, Failures: 0, Errors: 0, Skipped: 0, Time elapsed: 1.666 sec
Forking command line: /bin/sh -c cd <https://builds.apache.org/job/HBase-0.94-security/ws/trunk>
&& /home/jenkins/tools/java/jdk1.6.0_45-32/jre/bin/java -enableassertions -Xmx1900m
-Djava.security.egd=file:/dev/./urandom -jar <https://builds.apache.org/job/HBase-0.94-security/ws/trunk/target/surefire/surefirebooter6726191639469890802.jar>
<https://builds.apache.org/job/HBase-0.94-security/ws/trunk/target/surefire/surefire4999418417545873379tmp>
<https://builds.apache.org/job/HBase-0.94-security/ws/trunk/target/surefire/surefire_1461562611524450098067tmp>
Running org.apache.hadoop.hbase.master.TestDefaultLoadBalancer
Tests run: 4, Failures: 0, Errors: 0, Skipped: 0, Time elapsed: 6.788 sec
Forking command line: /bin/sh -c cd <https://builds.apache.org/job/HBase-0.94-security/ws/trunk>
&& /home/jenkins/tools/java/jdk1.6.0_45-32/jre/bin/java -enableassertions -Xmx1900m
-Djava.security.egd=file:/dev/./urandom -jar <https://builds.apache.org/job/HBase-0.94-security/ws/trunk/target/surefire/surefirebooter2998909339727068659.jar>
<https://builds.apache.org/job/HBase-0.94-security/ws/trunk/target/surefire/surefire7426139888536209264tmp>
<https://builds.apache.org/job/HBase-0.94-security/ws/trunk/target/surefire/surefire_1476365369593299045009tmp>
Running org.apache.hadoop.hbase.master.TestHMasterRPCException
Tests run: 1, Failures: 0, Errors: 0, Skipped: 0, Time elapsed: 7.427 sec
Forking command line: /bin/sh -c cd <https://builds.apache.org/job/HBase-0.94-security/ws/trunk>
&& /home/jenkins/tools/java/jdk1.6.0_45-32/jre/bin/java -enableassertions -Xmx1900m
-Djava.security.egd=file:/dev/./urandom -jar <https://builds.apache.org/job/HBase-0.94-security/ws/trunk/target/surefire/surefirebooter9019100541195979606.jar>
<https://builds.apache.org/job/HBase-0.94-security/ws/trunk/target/surefire/surefire5139298713740084719tmp>
<https://builds.apache.org/job/HBase-0.94-security/ws/trunk/target/surefire/surefire_1481876160088591448849tmp>
Running org.apache.hadoop.hbase.master.TestMXBean
Tests run: 1, Failures: 0, Errors: 0, Skipped: 0, Time elapsed: 30.784 sec
Forking command line: /bin/sh -c cd <https://builds.apache.org/job/HBase-0.94-security/ws/trunk>
&& /home/jenkins/tools/java/jdk1.6.0_45-32/jre/bin/java -enableassertions -Xmx1900m
-Djava.security.egd=file:/dev/./urandom -jar <https://builds.apache.org/job/HBase-0.94-security/ws/trunk/target/surefire/surefirebooter8144381093964692920.jar>
<https://builds.apache.org/job/HBase-0.94-security/ws/trunk/target/surefire/surefire1043004772054600224tmp>
<https://builds.apache.org/job/HBase-0.94-security/ws/trunk/target/surefire/surefire_1493551024240701757654tmp>
Running org.apache.hadoop.hbase.snapshot.TestExportSnapshot
Tests run: 6, Failures: 0, Errors: 0, Skipped: 0, Time elapsed: 135.481 sec
Forking command line: /bin/sh -c cd <https://builds.apache.org/job/HBase-0.94-security/ws/trunk>
&& /home/jenkins/tools/java/jdk1.6.0_45-32/jre/bin/java -enableassertions -Xmx1900m
-Djava.security.egd=file:/dev/./urandom -jar <https://builds.apache.org/job/HBase-0.94-security/ws/trunk/target/surefire/surefirebooter2562385425514028957.jar>
<https://builds.apache.org/job/HBase-0.94-security/ws/trunk/target/surefire/surefire7069051689732031561tmp>
<https://builds.apache.org/job/HBase-0.94-security/ws/trunk/target/surefire/surefire_1506315117779169075617tmp>
Running org.apache.hadoop.hbase.master.cleaner.TestHFileCleaner
Tests run: 3, Failures: 0, Errors: 0, Skipped: 0, Time elapsed: 6.352 sec
Forking command line: /bin/sh -c cd <https://builds.apache.org/job/HBase-0.94-security/ws/trunk>
&& /home/jenkins/tools/java/jdk1.6.0_45-32/jre/bin/java -enableassertions -Xmx1900m
-Djava.security.egd=file:/dev/./urandom -jar <https://builds.apache.org/job/HBase-0.94-security/ws/trunk/target/surefire/surefirebooter9189999704387739160.jar>
<https://builds.apache.org/job/HBase-0.94-security/ws/trunk/target/surefire/surefire1466154351841076833tmp>
<https://builds.apache.org/job/HBase-0.94-security/ws/trunk/target/surefire/surefire_1511954073467594873795tmp>
Running org.apache.hadoop.hbase.master.TestMaster
Tests run: 2, Failures: 0, Errors: 0, Skipped: 0, Time elapsed: 26.309 sec
Forking command line: /bin/sh -c cd <https://builds.apache.org/job/HBase-0.94-security/ws/trunk>
&& /home/jenkins/tools/java/jdk1.6.0_45-32/jre/bin/java -enableassertions -Xmx1900m
-Djava.security.egd=file:/dev/./urandom -jar <https://builds.apache.org/job/HBase-0.94-security/ws/trunk/target/surefire/surefirebooter3604193705174280618.jar>
<https://builds.apache.org/job/HBase-0.94-security/ws/trunk/target/surefire/surefire1437761282558557002tmp>
<https://builds.apache.org/job/HBase-0.94-security/ws/trunk/target/surefire/surefire_1528755536664582077323tmp>
Running org.apache.hadoop.hbase.master.cleaner.TestLogsCleaner
Tests run: 1, Failures: 0, Errors: 0, Skipped: 0, Time elapsed: 4.027 sec
Forking command line: /bin/sh -c cd <https://builds.apache.org/job/HBase-0.94-security/ws/trunk>
&& /home/jenkins/tools/java/jdk1.6.0_45-32/jre/bin/java -enableassertions -Xmx1900m
-Djava.security.egd=file:/dev/./urandom -jar <https://builds.apache.org/job/HBase-0.94-security/ws/trunk/target/surefire/surefirebooter5156617046890233339.jar>
<https://builds.apache.org/job/HBase-0.94-security/ws/trunk/target/surefire/surefire2158623194968256154tmp>
<https://builds.apache.org/job/HBase-0.94-security/ws/trunk/target/surefire/surefire_1538107456299209299527tmp>
Running org.apache.hadoop.hbase.master.TestMasterFileSystem
Tests run: 1, Failures: 0, Errors: 0, Skipped: 0, Time elapsed: 14.465 sec
Forking command line: /bin/sh -c cd <https://builds.apache.org/job/HBase-0.94-security/ws/trunk>
&& /home/jenkins/tools/java/jdk1.6.0_45-32/jre/bin/java -enableassertions -Xmx1900m
-Djava.security.egd=file:/dev/./urandom -jar <https://builds.apache.org/job/HBase-0.94-security/ws/trunk/target/surefire/surefirebooter4022515484711773593.jar>
<https://builds.apache.org/job/HBase-0.94-security/ws/trunk/target/surefire/surefire1341106646633215438tmp>
<https://builds.apache.org/job/HBase-0.94-security/ws/trunk/target/surefire/surefire_1544042983531921348837tmp>
Running org.apache.hadoop.hbase.master.cleaner.TestSnapshotFromMaster
Tests run: 4, Failures: 0, Errors: 0, Skipped: 0, Time elapsed: 41.106 sec
Forking command line: /bin/sh -c cd <https://builds.apache.org/job/HBase-0.94-security/ws/trunk>
&& /home/jenkins/tools/java/jdk1.6.0_45-32/jre/bin/java -enableassertions -Xmx1900m
-Djava.security.egd=file:/dev/./urandom -jar <https://builds.apache.org/job/HBase-0.94-security/ws/trunk/target/surefire/surefirebooter5680481702352374899.jar>
<https://builds.apache.org/job/HBase-0.94-security/ws/trunk/target/surefire/surefire1085666877859004892tmp>
<https://builds.apache.org/job/HBase-0.94-security/ws/trunk/target/surefire/surefire_1555079374070634771886tmp>
Running org.apache.hadoop.hbase.master.handler.TestCreateTableHandler
Tests run: 3, Failures: 0, Errors: 0, Skipped: 0, Time elapsed: 48.039 sec
Forking command line: /bin/sh -c cd <https://builds.apache.org/job/HBase-0.94-security/ws/trunk>
&& /home/jenkins/tools/java/jdk1.6.0_45-32/jre/bin/java -enableassertions -Xmx1900m
-Djava.security.egd=file:/dev/./urandom -jar <https://builds.apache.org/job/HBase-0.94-security/ws/trunk/target/surefire/surefirebooter1221081291409970935.jar>
<https://builds.apache.org/job/HBase-0.94-security/ws/trunk/target/surefire/surefire6719011005996774016tmp>
<https://builds.apache.org/job/HBase-0.94-security/ws/trunk/target/surefire/surefire_1568543429901519674459tmp>
Running org.apache.hadoop.hbase.master.snapshot.TestSnapshotFileCache
Tests run: 4, Failures: 0, Errors: 0, Skipped: 0, Time elapsed: 5.008 sec
Forking command line: /bin/sh -c cd <https://builds.apache.org/job/HBase-0.94-security/ws/trunk>
&& /home/jenkins/tools/java/jdk1.6.0_45-32/jre/bin/java -enableassertions -Xmx1900m
-Djava.security.egd=file:/dev/./urandom -jar <https://builds.apache.org/job/HBase-0.94-security/ws/trunk/target/surefire/surefirebooter6442709813253312585.jar>
<https://builds.apache.org/job/HBase-0.94-security/ws/trunk/target/surefire/surefire8080361175325601005tmp>
<https://builds.apache.org/job/HBase-0.94-security/ws/trunk/target/surefire/surefire_1572129353769683128866tmp>
Running org.apache.hadoop.hbase.master.TestDeadServer
Tests run: 1, Failures: 0, Errors: 0, Skipped: 0, Time elapsed: 0.328 sec
Forking command line: /bin/sh -c cd <https://builds.apache.org/job/HBase-0.94-security/ws/trunk>
&& /home/jenkins/tools/java/jdk1.6.0_45-32/jre/bin/java -enableassertions -Xmx1900m
-Djava.security.egd=file:/dev/./urandom -jar <https://builds.apache.org/job/HBase-0.94-security/ws/trunk/target/surefire/surefirebooter2581059431469247755.jar>
<https://builds.apache.org/job/HBase-0.94-security/ws/trunk/target/surefire/surefire7132337322837376098tmp>
<https://builds.apache.org/job/HBase-0.94-security/ws/trunk/target/surefire/surefire_1583922441262010098796tmp>
Running org.apache.hadoop.hbase.master.TestSplitLogManager
Tests run: 13, Failures: 0, Errors: 0, Skipped: 0, Time elapsed: 86.088 sec
Forking command line: /bin/sh -c cd <https://builds.apache.org/job/HBase-0.94-security/ws/trunk>
&& /home/jenkins/tools/java/jdk1.6.0_45-32/jre/bin/java -enableassertions -Xmx1900m
-Djava.security.egd=file:/dev/./urandom -jar <https://builds.apache.org/job/HBase-0.94-security/ws/trunk/target/surefire/surefirebooter5899445615615586166.jar>
<https://builds.apache.org/job/HBase-0.94-security/ws/trunk/target/surefire/surefire7394566216226682332tmp>
<https://builds.apache.org/job/HBase-0.94-security/ws/trunk/target/surefire/surefire_1591692527812112042386tmp>
Running org.apache.hadoop.hbase.master.TestZKBasedOpenCloseRegion
Tests run: 4, Failures: 0, Errors: 0, Skipped: 0, Time elapsed: 25.277 sec
Running org.apache.hadoop.hbase.master.TestMasterZKSessionRecovery
Tests run: 2, Failures: 0, Errors: 0, Skipped: 0, Time elapsed: 36.403 sec

Results :

Failed tests:   testExceptionFromCoprocessorDuringPut(org.apache.hadoop.hbase.coprocessor.TestRegionServerCoprocessorExceptionWithAbort):
The put should have failed, as the coprocessor is buggy

Tests run: 916, Failures: 1, Errors: 0, Skipped: 2

[INFO] ------------------------------------------------------------------------
[INFO] BUILD FAILURE
[INFO] ------------------------------------------------------------------------
[INFO] Total time: 52:21.929s
[INFO] Finished at: Tue Mar 04 13:12:57 UTC 2014
[INFO] Final Memory: 45M/1038M
[INFO] ------------------------------------------------------------------------
[ERROR] Failed to execute goal org.apache.maven.plugins:maven-surefire-plugin:2.12-TRUNK-HBASE-2:test
(secondPartTestsExecution) on project hbase: There are test failures.
[ERROR] 
[ERROR] Please refer to <https://builds.apache.org/job/HBase-0.94-security/ws/trunk/target/surefire-reports>
for the individual test results.
[ERROR] -> [Help 1]
org.apache.maven.lifecycle.LifecycleExecutionException: Failed to execute goal org.apache.maven.plugins:maven-surefire-plugin:2.12-TRUNK-HBASE-2:test
(secondPartTestsExecution) on project hbase: There are test failures.

Please refer to <https://builds.apache.org/job/HBase-0.94-security/ws/trunk/target/surefire-reports>
for the individual test results.
	at org.apache.maven.lifecycle.internal.MojoExecutor.execute(MojoExecutor.java:213)
	at org.apache.maven.lifecycle.internal.MojoExecutor.execute(MojoExecutor.java:153)
	at org.apache.maven.lifecycle.internal.MojoExecutor.execute(MojoExecutor.java:145)
	at org.apache.maven.lifecycle.internal.MojoExecutor.executeForkedExecutions(MojoExecutor.java:365)
	at org.apache.maven.lifecycle.internal.MojoExecutor.execute(MojoExecutor.java:199)
	at org.apache.maven.lifecycle.internal.MojoExecutor.execute(MojoExecutor.java:153)
	at org.apache.maven.lifecycle.internal.MojoExecutor.execute(MojoExecutor.java:145)
	at org.apache.maven.lifecycle.internal.LifecycleModuleBuilder.buildProject(LifecycleModuleBuilder.java:84)
	at org.apache.maven.lifecycle.internal.LifecycleModuleBuilder.buildProject(LifecycleModuleBuilder.java:59)
	at org.apache.maven.lifecycle.internal.LifecycleStarter.singleThreadedBuild(LifecycleStarter.java:183)
	at org.apache.maven.lifecycle.internal.LifecycleStarter.execute(LifecycleStarter.java:161)
	at org.apache.maven.DefaultMaven.doExecute(DefaultMaven.java:320)
	at org.apache.maven.DefaultMaven.execute(DefaultMaven.java:156)
	at org.apache.maven.cli.MavenCli.execute(MavenCli.java:537)
	at org.apache.maven.cli.MavenCli.doMain(MavenCli.java:196)
	at org.apache.maven.cli.MavenCli.main(MavenCli.java:141)
	at sun.reflect.NativeMethodAccessorImpl.invoke0(Native Method)
	at sun.reflect.NativeMethodAccessorImpl.invoke(NativeMethodAccessorImpl.java:39)
	at sun.reflect.DelegatingMethodAccessorImpl.invoke(DelegatingMethodAccessorImpl.java:25)
	at java.lang.reflect.Method.invoke(Method.java:597)
	at org.codehaus.plexus.classworlds.launcher.Launcher.launchEnhanced(Launcher.java:290)
	at org.codehaus.plexus.classworlds.launcher.Launcher.launch(Launcher.java:230)
	at org.codehaus.plexus.classworlds.launcher.Launcher.mainWithExitCode(Launcher.java:409)
	at org.codehaus.plexus.classworlds.launcher.Launcher.main(Launcher.java:352)
Caused by: org.apache.maven.plugin.MojoFailureException: There are test failures.

Please refer to <https://builds.apache.org/job/HBase-0.94-security/ws/trunk/target/surefire-reports>
for the individual test results.
	at org.apache.maven.plugin.surefire.SurefireHelper.reportExecution(SurefireHelper.java:87)
	at org.apache.maven.plugin.surefire.SurefirePlugin.writeSummary(SurefirePlugin.java:651)
	at org.apache.maven.plugin.surefire.SurefirePlugin.handleSummary(SurefirePlugin.java:625)
	at org.apache.maven.plugin.surefire.AbstractSurefireMojo.executeAfterPreconditionsChecked(AbstractSurefireMojo.java:137)
	at org.apache.maven.plugin.surefire.AbstractSurefireMojo.execute(AbstractSurefireMojo.java:98)
	at org.apache.maven.plugin.DefaultBuildPluginManager.executeMojo(DefaultBuildPluginManager.java:101)
	at org.apache.maven.lifecycle.internal.MojoExecutor.execute(MojoExecutor.java:209)
	... 23 more
[ERROR] 
[ERROR] 
[ERROR] For more information about the errors and possible solutions, please read the following
articles:
[ERROR] [Help 1] http://cwiki.apache.org/confluence/display/MAVEN/MojoFailureException
Build step 'Invoke top-level Maven targets' marked build as failure
Archiving artifacts
Updating HBASE-10622
Recording test results

Mime
View raw message