hbase-builds mailing list archives

Site index · List index
Message view « Date » · « Thread »
Top « Date » · « Thread »
From Apache Jenkins Server <jenk...@builds.apache.org>
Subject Build failed in Jenkins: HBase-0.94-security #451
Date Tue, 25 Mar 2014 09:48:13 GMT
See <https://builds.apache.org/job/HBase-0.94-security/451/changes>

Changes:

[larsh] 0.94.19-SNAPSHOT

------------------------------------------
[...truncated 20710 lines...]
Forking command line: /bin/sh -c cd /x1/jenkins/jenkins-slave/workspace/HBase-0.94-security/trunk
&& /x1/jenkins/tools/java/jdk1.6.0_45-32/jre/bin/java -enableassertions -Xmx1900m
-Djava.security.egd=file:/dev/./urandom -jar /x1/jenkins/jenkins-slave/workspace/HBase-0.94-security/trunk/target/surefire/surefirebooter5225430892976658648.jar
/x1/jenkins/jenkins-slave/workspace/HBase-0.94-security/trunk/target/surefire/surefire1463269353800919817tmp
/x1/jenkins/jenkins-slave/workspace/HBase-0.94-security/trunk/target/surefire/surefire_1008766213335586457631tmp
Running org.apache.hadoop.hbase.regionserver.TestStoreScanner
Tests run: 16, Failures: 0, Errors: 0, Skipped: 0, Time elapsed: 0.089 sec
Forking command line: /bin/sh -c cd /x1/jenkins/jenkins-slave/workspace/HBase-0.94-security/trunk
&& /x1/jenkins/tools/java/jdk1.6.0_45-32/jre/bin/java -enableassertions -Xmx1900m
-Djava.security.egd=file:/dev/./urandom -jar /x1/jenkins/jenkins-slave/workspace/HBase-0.94-security/trunk/target/surefire/surefirebooter4829969958238930964.jar
/x1/jenkins/jenkins-slave/workspace/HBase-0.94-security/trunk/target/surefire/surefire394291683463872130tmp
/x1/jenkins/jenkins-slave/workspace/HBase-0.94-security/trunk/target/surefire/surefire_1015790098438331977851tmp
Running org.apache.hadoop.hbase.regionserver.TestSplitLogWorker
Tests run: 5, Failures: 0, Errors: 0, Skipped: 0, Time elapsed: 18.641 sec
Forking command line: /bin/sh -c cd /x1/jenkins/jenkins-slave/workspace/HBase-0.94-security/trunk
&& /x1/jenkins/tools/java/jdk1.6.0_45-32/jre/bin/java -enableassertions -Xmx1900m
-Djava.security.egd=file:/dev/./urandom -jar /x1/jenkins/jenkins-slave/workspace/HBase-0.94-security/trunk/target/surefire/surefirebooter372300451419956151.jar
/x1/jenkins/jenkins-slave/workspace/HBase-0.94-security/trunk/target/surefire/surefire696497926379182947tmp
/x1/jenkins/jenkins-slave/workspace/HBase-0.94-security/trunk/target/surefire/surefire_1021298587169116709726tmp
Running org.apache.hadoop.hbase.regionserver.metrics.TestSchemaMetrics
Tests run: 6, Failures: 0, Errors: 0, Skipped: 0, Time elapsed: 16.677 sec
Forking command line: /bin/sh -c cd /x1/jenkins/jenkins-slave/workspace/HBase-0.94-security/trunk
&& /x1/jenkins/tools/java/jdk1.6.0_45-32/jre/bin/java -enableassertions -Xmx1900m
-Djava.security.egd=file:/dev/./urandom -jar /x1/jenkins/jenkins-slave/workspace/HBase-0.94-security/trunk/target/surefire/surefirebooter4513386794839658026.jar
/x1/jenkins/jenkins-slave/workspace/HBase-0.94-security/trunk/target/surefire/surefire8447936409150092645tmp
/x1/jenkins/jenkins-slave/workspace/HBase-0.94-security/trunk/target/surefire/surefire_1033975828221138530698tmp
Running org.apache.hadoop.hbase.regionserver.TestStoreFileBlockCacheSummary
Tests run: 1, Failures: 0, Errors: 0, Skipped: 0, Time elapsed: 33.279 sec
Forking command line: /bin/sh -c cd /x1/jenkins/jenkins-slave/workspace/HBase-0.94-security/trunk
&& /x1/jenkins/tools/java/jdk1.6.0_45-32/jre/bin/java -enableassertions -Xmx1900m
-Djava.security.egd=file:/dev/./urandom -jar /x1/jenkins/jenkins-slave/workspace/HBase-0.94-security/trunk/target/surefire/surefirebooter4473692385660455309.jar
/x1/jenkins/jenkins-slave/workspace/HBase-0.94-security/trunk/target/surefire/surefire6424761367845985605tmp
/x1/jenkins/jenkins-slave/workspace/HBase-0.94-security/trunk/target/surefire/surefire_1041115969535257173313tmp
Running org.apache.hadoop.hbase.regionserver.TestMasterAddressManager
Tests run: 1, Failures: 0, Errors: 0, Skipped: 0, Time elapsed: 4.478 sec
Forking command line: /bin/sh -c cd /x1/jenkins/jenkins-slave/workspace/HBase-0.94-security/trunk
&& /x1/jenkins/tools/java/jdk1.6.0_45-32/jre/bin/java -enableassertions -Xmx1900m
-Djava.security.egd=file:/dev/./urandom -jar /x1/jenkins/jenkins-slave/workspace/HBase-0.94-security/trunk/target/surefire/surefirebooter4102149073249377060.jar
/x1/jenkins/jenkins-slave/workspace/HBase-0.94-security/trunk/target/surefire/surefire3001917859594689360tmp
/x1/jenkins/jenkins-slave/workspace/HBase-0.94-security/trunk/target/surefire/surefire_1058629558693531043875tmp
Running org.apache.hadoop.hbase.regionserver.TestMultiColumnScanner
Tests run: 12, Failures: 0, Errors: 0, Skipped: 0, Time elapsed: 58.448 sec
Forking command line: /bin/sh -c cd /x1/jenkins/jenkins-slave/workspace/HBase-0.94-security/trunk
&& /x1/jenkins/tools/java/jdk1.6.0_45-32/jre/bin/java -enableassertions -Xmx1900m
-Djava.security.egd=file:/dev/./urandom -jar /x1/jenkins/jenkins-slave/workspace/HBase-0.94-security/trunk/target/surefire/surefirebooter5601150633446997479.jar
/x1/jenkins/jenkins-slave/workspace/HBase-0.94-security/trunk/target/surefire/surefire2881847857243376940tmp
/x1/jenkins/jenkins-slave/workspace/HBase-0.94-security/trunk/target/surefire/surefire_1068555399575514391953tmp
Running org.apache.hadoop.hbase.regionserver.TestHRegion
Tests run: 74, Failures: 0, Errors: 0, Skipped: 0, Time elapsed: 75.783 sec
Forking command line: /bin/sh -c cd /x1/jenkins/jenkins-slave/workspace/HBase-0.94-security/trunk
&& /x1/jenkins/tools/java/jdk1.6.0_45-32/jre/bin/java -enableassertions -Xmx1900m
-Djava.security.egd=file:/dev/./urandom -jar /x1/jenkins/jenkins-slave/workspace/HBase-0.94-security/trunk/target/surefire/surefirebooter9080406939051337068.jar
/x1/jenkins/jenkins-slave/workspace/HBase-0.94-security/trunk/target/surefire/surefire2036771107041624045tmp
/x1/jenkins/jenkins-slave/workspace/HBase-0.94-security/trunk/target/surefire/surefire_1076330012680943477726tmp
Running org.apache.hadoop.hbase.TestLocalHBaseCluster
Tests run: 1, Failures: 0, Errors: 0, Skipped: 0, Time elapsed: 14.06 sec
Forking command line: /bin/sh -c cd /x1/jenkins/jenkins-slave/workspace/HBase-0.94-security/trunk
&& /x1/jenkins/tools/java/jdk1.6.0_45-32/jre/bin/java -enableassertions -Xmx1900m
-Djava.security.egd=file:/dev/./urandom -jar /x1/jenkins/jenkins-slave/workspace/HBase-0.94-security/trunk/target/surefire/surefirebooter4671443800931253974.jar
/x1/jenkins/jenkins-slave/workspace/HBase-0.94-security/trunk/target/surefire/surefire8703787816548803025tmp
/x1/jenkins/jenkins-slave/workspace/HBase-0.94-security/trunk/target/surefire/surefire_108839101113225063057tmp
Running org.apache.hadoop.hbase.ipc.TestDelayedRpc
Tests run: 4, Failures: 0, Errors: 0, Skipped: 0, Time elapsed: 3.312 sec
Forking command line: /bin/sh -c cd /x1/jenkins/jenkins-slave/workspace/HBase-0.94-security/trunk
&& /x1/jenkins/tools/java/jdk1.6.0_45-32/jre/bin/java -enableassertions -Xmx1900m
-Djava.security.egd=file:/dev/./urandom -jar /x1/jenkins/jenkins-slave/workspace/HBase-0.94-security/trunk/target/surefire/surefirebooter9015652045384431973.jar
/x1/jenkins/jenkins-slave/workspace/HBase-0.94-security/trunk/target/surefire/surefire5972291587873923594tmp
/x1/jenkins/jenkins-slave/workspace/HBase-0.94-security/trunk/target/surefire/surefire_1096874108230695348500tmp
Running org.apache.hadoop.hbase.ipc.TestPBOnWritableRpc
Tests run: 1, Failures: 0, Errors: 0, Skipped: 0, Time elapsed: 1.362 sec
Forking command line: /bin/sh -c cd /x1/jenkins/jenkins-slave/workspace/HBase-0.94-security/trunk
&& /x1/jenkins/tools/java/jdk1.6.0_45-32/jre/bin/java -enableassertions -Xmx1900m
-Djava.security.egd=file:/dev/./urandom -jar /x1/jenkins/jenkins-slave/workspace/HBase-0.94-security/trunk/target/surefire/surefirebooter8281025861556519552.jar
/x1/jenkins/jenkins-slave/workspace/HBase-0.94-security/trunk/target/surefire/surefire6189190505370991900tmp
/x1/jenkins/jenkins-slave/workspace/HBase-0.94-security/trunk/target/surefire/surefire_1103187380061955520967tmp
Running org.apache.hadoop.hbase.TestGlobalMemStoreSize
Tests run: 1, Failures: 0, Errors: 0, Skipped: 0, Time elapsed: 53.654 sec
Forking command line: /bin/sh -c cd /x1/jenkins/jenkins-slave/workspace/HBase-0.94-security/trunk
&& /x1/jenkins/tools/java/jdk1.6.0_45-32/jre/bin/java -enableassertions -Xmx1900m
-Djava.security.egd=file:/dev/./urandom -jar /x1/jenkins/jenkins-slave/workspace/HBase-0.94-security/trunk/target/surefire/surefirebooter8758213157993333436.jar
/x1/jenkins/jenkins-slave/workspace/HBase-0.94-security/trunk/target/surefire/surefire8055804466152056344tmp
/x1/jenkins/jenkins-slave/workspace/HBase-0.94-security/trunk/target/surefire/surefire_1118608828209649222291tmp
Running org.apache.hadoop.hbase.constraint.TestConstraint
Tests run: 5, Failures: 0, Errors: 0, Skipped: 0, Time elapsed: 59.619 sec
Forking command line: /bin/sh -c cd /x1/jenkins/jenkins-slave/workspace/HBase-0.94-security/trunk
&& /x1/jenkins/tools/java/jdk1.6.0_45-32/jre/bin/java -enableassertions -Xmx1900m
-Djava.security.egd=file:/dev/./urandom -jar /x1/jenkins/jenkins-slave/workspace/HBase-0.94-security/trunk/target/surefire/surefirebooter9153124881902576792.jar
/x1/jenkins/jenkins-slave/workspace/HBase-0.94-security/trunk/target/surefire/surefire9210784986426687033tmp
/x1/jenkins/jenkins-slave/workspace/HBase-0.94-security/trunk/target/surefire/surefire_1124093110147922413785tmp
Running org.apache.hadoop.hbase.rest.TestSchemaResource
Tests run: 2, Failures: 0, Errors: 0, Skipped: 0, Time elapsed: 46.771 sec
Forking command line: /bin/sh -c cd /x1/jenkins/jenkins-slave/workspace/HBase-0.94-security/trunk
&& /x1/jenkins/tools/java/jdk1.6.0_45-32/jre/bin/java -enableassertions -Xmx1900m
-Djava.security.egd=file:/dev/./urandom -jar /x1/jenkins/jenkins-slave/workspace/HBase-0.94-security/trunk/target/surefire/surefirebooter1229178547561839279.jar
/x1/jenkins/jenkins-slave/workspace/HBase-0.94-security/trunk/target/surefire/surefire7533172377592038337tmp
/x1/jenkins/jenkins-slave/workspace/HBase-0.94-security/trunk/target/surefire/surefire_1132522460815063705690tmp
Running org.apache.hadoop.hbase.backup.TestHFileArchiving
Tests run: 5, Failures: 0, Errors: 0, Skipped: 0, Time elapsed: 253.101 sec
Forking command line: /bin/sh -c cd /x1/jenkins/jenkins-slave/workspace/HBase-0.94-security/trunk
&& /x1/jenkins/tools/java/jdk1.6.0_45-32/jre/bin/java -enableassertions -Xmx1900m
-Djava.security.egd=file:/dev/./urandom -jar /x1/jenkins/jenkins-slave/workspace/HBase-0.94-security/trunk/target/surefire/surefirebooter7908266833876046441.jar
/x1/jenkins/jenkins-slave/workspace/HBase-0.94-security/trunk/target/surefire/surefire7555728992685624907tmp
/x1/jenkins/jenkins-slave/workspace/HBase-0.94-security/trunk/target/surefire/surefire_1145382715597390845113tmp
Running org.apache.hadoop.hbase.rest.client.TestRemoteAdmin
Tests run: 5, Failures: 0, Errors: 0, Skipped: 0, Time elapsed: 31.899 sec
Forking command line: /bin/sh -c cd /x1/jenkins/jenkins-slave/workspace/HBase-0.94-security/trunk
&& /x1/jenkins/tools/java/jdk1.6.0_45-32/jre/bin/java -enableassertions -Xmx1900m
-Djava.security.egd=file:/dev/./urandom -jar /x1/jenkins/jenkins-slave/workspace/HBase-0.94-security/trunk/target/surefire/surefirebooter8400338258264719706.jar
/x1/jenkins/jenkins-slave/workspace/HBase-0.94-security/trunk/target/surefire/surefire2310882578766080412tmp
/x1/jenkins/jenkins-slave/workspace/HBase-0.94-security/trunk/target/surefire/surefire_115164082138149548416tmp
Running org.apache.hadoop.hbase.rest.TestTableResource
Tests run: 8, Failures: 0, Errors: 0, Skipped: 0, Time elapsed: 46.733 sec
Forking command line: /bin/sh -c cd /x1/jenkins/jenkins-slave/workspace/HBase-0.94-security/trunk
&& /x1/jenkins/tools/java/jdk1.6.0_45-32/jre/bin/java -enableassertions -Xmx1900m
-Djava.security.egd=file:/dev/./urandom -jar /x1/jenkins/jenkins-slave/workspace/HBase-0.94-security/trunk/target/surefire/surefirebooter972577581857489833.jar
/x1/jenkins/jenkins-slave/workspace/HBase-0.94-security/trunk/target/surefire/surefire2618411056176902621tmp
/x1/jenkins/jenkins-slave/workspace/HBase-0.94-security/trunk/target/surefire/surefire_1164567683946784362884tmp
Running org.apache.hadoop.hbase.rest.TestMultiRowResource
Tests run: 3, Failures: 0, Errors: 0, Skipped: 0, Time elapsed: 27.756 sec
Running org.apache.hadoop.hbase.rest.client.TestRemoteTable
Tests run: 9, Failures: 0, Errors: 0, Skipped: 0, Time elapsed: 78.793 sec
Forking command line: /bin/sh -c cd /x1/jenkins/jenkins-slave/workspace/HBase-0.94-security/trunk
&& /x1/jenkins/tools/java/jdk1.6.0_45-32/jre/bin/java -enableassertions -Xmx1900m
-Djava.security.egd=file:/dev/./urandom -jar /x1/jenkins/jenkins-slave/workspace/HBase-0.94-security/trunk/target/surefire/surefirebooter6220876595459034631.jar
/x1/jenkins/jenkins-slave/workspace/HBase-0.94-security/trunk/target/surefire/surefire7930238453723782472tmp
/x1/jenkins/jenkins-slave/workspace/HBase-0.94-security/trunk/target/surefire/surefire_1177797737649942455091tmp
Forking command line: /bin/sh -c cd /x1/jenkins/jenkins-slave/workspace/HBase-0.94-security/trunk
&& /x1/jenkins/tools/java/jdk1.6.0_45-32/jre/bin/java -enableassertions -Xmx1900m
-Djava.security.egd=file:/dev/./urandom -jar /x1/jenkins/jenkins-slave/workspace/HBase-0.94-security/trunk/target/surefire/surefirebooter429986163463010871.jar
/x1/jenkins/jenkins-slave/workspace/HBase-0.94-security/trunk/target/surefire/surefire5861196956382475939tmp
/x1/jenkins/jenkins-slave/workspace/HBase-0.94-security/trunk/target/surefire/surefire_1184816321762015947596tmp
Running org.apache.hadoop.hbase.rest.TestGzipFilter
Tests run: 2, Failures: 0, Errors: 0, Skipped: 0, Time elapsed: 24.75 sec
Forking command line: /bin/sh -c cd /x1/jenkins/jenkins-slave/workspace/HBase-0.94-security/trunk
&& /x1/jenkins/tools/java/jdk1.6.0_45-32/jre/bin/java -enableassertions -Xmx1900m
-Djava.security.egd=file:/dev/./urandom -jar /x1/jenkins/jenkins-slave/workspace/HBase-0.94-security/trunk/target/surefire/surefirebooter7425490625985926594.jar
/x1/jenkins/jenkins-slave/workspace/HBase-0.94-security/trunk/target/surefire/surefire5534398595701057567tmp
/x1/jenkins/jenkins-slave/workspace/HBase-0.94-security/trunk/target/surefire/surefire_1197119481946390625056tmp
Running org.apache.hadoop.hbase.rest.TestRowResource
Tests run: 12, Failures: 0, Errors: 0, Skipped: 0, Time elapsed: 27.86 sec
Forking command line: /bin/sh -c cd /x1/jenkins/jenkins-slave/workspace/HBase-0.94-security/trunk
&& /x1/jenkins/tools/java/jdk1.6.0_45-32/jre/bin/java -enableassertions -Xmx1900m
-Djava.security.egd=file:/dev/./urandom -jar /x1/jenkins/jenkins-slave/workspace/HBase-0.94-security/trunk/target/surefire/surefirebooter1031842108436526575.jar
/x1/jenkins/jenkins-slave/workspace/HBase-0.94-security/trunk/target/surefire/surefire7592098426316947080tmp
/x1/jenkins/jenkins-slave/workspace/HBase-0.94-security/trunk/target/surefire/surefire_1206365446230663211956tmp
Running org.apache.hadoop.hbase.rest.TestVersionResource
Tests run: 7, Failures: 0, Errors: 0, Skipped: 0, Time elapsed: 37.346 sec
Forking command line: /bin/sh -c cd /x1/jenkins/jenkins-slave/workspace/HBase-0.94-security/trunk
&& /x1/jenkins/tools/java/jdk1.6.0_45-32/jre/bin/java -enableassertions -Xmx1900m
-Djava.security.egd=file:/dev/./urandom -jar /x1/jenkins/jenkins-slave/workspace/HBase-0.94-security/trunk/target/surefire/surefirebooter8407126165993744839.jar
/x1/jenkins/jenkins-slave/workspace/HBase-0.94-security/trunk/target/surefire/surefire2643681599548820692tmp
/x1/jenkins/jenkins-slave/workspace/HBase-0.94-security/trunk/target/surefire/surefire_1215339947676560340656tmp
Running org.apache.hadoop.hbase.rest.TestScannerResource
Tests run: 5, Failures: 0, Errors: 0, Skipped: 0, Time elapsed: 58.882 sec
Forking command line: /bin/sh -c cd /x1/jenkins/jenkins-slave/workspace/HBase-0.94-security/trunk
&& /x1/jenkins/tools/java/jdk1.6.0_45-32/jre/bin/java -enableassertions -Xmx1900m
-Djava.security.egd=file:/dev/./urandom -jar /x1/jenkins/jenkins-slave/workspace/HBase-0.94-security/trunk/target/surefire/surefirebooter3258145418355221009.jar
/x1/jenkins/jenkins-slave/workspace/HBase-0.94-security/trunk/target/surefire/surefire4283327989478017293tmp
/x1/jenkins/jenkins-slave/workspace/HBase-0.94-security/trunk/target/surefire/surefire_1223060264126424568245tmp
Running org.apache.hadoop.hbase.rest.TestGZIPResponseWrapper
Tests run: 5, Failures: 0, Errors: 0, Skipped: 0, Time elapsed: 0.266 sec
Forking command line: /bin/sh -c cd /x1/jenkins/jenkins-slave/workspace/HBase-0.94-security/trunk
&& /x1/jenkins/tools/java/jdk1.6.0_45-32/jre/bin/java -enableassertions -Xmx1900m
-Djava.security.egd=file:/dev/./urandom -jar /x1/jenkins/jenkins-slave/workspace/HBase-0.94-security/trunk/target/surefire/surefirebooter5035204407143088288.jar
/x1/jenkins/jenkins-slave/workspace/HBase-0.94-security/trunk/target/surefire/surefire4532728102342844379tmp
/x1/jenkins/jenkins-slave/workspace/HBase-0.94-security/trunk/target/surefire/surefire_1239160641979938121925tmp
Running org.apache.hadoop.hbase.rest.TestStatusResource
Tests run: 2, Failures: 0, Errors: 0, Skipped: 0, Time elapsed: 31.513 sec
Forking command line: /bin/sh -c cd /x1/jenkins/jenkins-slave/workspace/HBase-0.94-security/trunk
&& /x1/jenkins/tools/java/jdk1.6.0_45-32/jre/bin/java -enableassertions -Xmx1900m
-Djava.security.egd=file:/dev/./urandom -jar /x1/jenkins/jenkins-slave/workspace/HBase-0.94-security/trunk/target/surefire/surefirebooter8165250377340084185.jar
/x1/jenkins/jenkins-slave/workspace/HBase-0.94-security/trunk/target/surefire/surefire6179799401384477598tmp
/x1/jenkins/jenkins-slave/workspace/HBase-0.94-security/trunk/target/surefire/surefire_1247474904478767315598tmp
Running org.apache.hadoop.hbase.rest.TestScannersWithFilters
Tests run: 10, Failures: 0, Errors: 0, Skipped: 0, Time elapsed: 35.292 sec
Forking command line: /bin/sh -c cd /x1/jenkins/jenkins-slave/workspace/HBase-0.94-security/trunk
&& /x1/jenkins/tools/java/jdk1.6.0_45-32/jre/bin/java -enableassertions -Xmx1900m
-Djava.security.egd=file:/dev/./urandom -jar /x1/jenkins/jenkins-slave/workspace/HBase-0.94-security/trunk/target/surefire/surefirebooter2825490734511706551.jar
/x1/jenkins/jenkins-slave/workspace/HBase-0.94-security/trunk/target/surefire/surefire7841341124982956527tmp
/x1/jenkins/jenkins-slave/workspace/HBase-0.94-security/trunk/target/surefire/surefire_1251827786511762612696tmp
Running org.apache.hadoop.hbase.metrics.TestMetricsMBeanBase
Tests run: 3, Failures: 0, Errors: 0, Skipped: 0, Time elapsed: 1.346 sec
Forking command line: /bin/sh -c cd /x1/jenkins/jenkins-slave/workspace/HBase-0.94-security/trunk
&& /x1/jenkins/tools/java/jdk1.6.0_45-32/jre/bin/java -enableassertions -Xmx1900m
-Djava.security.egd=file:/dev/./urandom -jar /x1/jenkins/jenkins-slave/workspace/HBase-0.94-security/trunk/target/surefire/surefirebooter1851849279759937962.jar
/x1/jenkins/jenkins-slave/workspace/HBase-0.94-security/trunk/target/surefire/surefire2248312970368807955tmp
/x1/jenkins/jenkins-slave/workspace/HBase-0.94-security/trunk/target/surefire/surefire_1263196072277607030483tmp
Running org.apache.hadoop.hbase.io.hfile.TestHFileBlockIndex
Tests run: 10, Failures: 0, Errors: 0, Skipped: 0, Time elapsed: 9.626 sec
Forking command line: /bin/sh -c cd /x1/jenkins/jenkins-slave/workspace/HBase-0.94-security/trunk
&& /x1/jenkins/tools/java/jdk1.6.0_45-32/jre/bin/java -enableassertions -Xmx1900m
-Djava.security.egd=file:/dev/./urandom -jar /x1/jenkins/jenkins-slave/workspace/HBase-0.94-security/trunk/target/surefire/surefirebooter1044501833043710394.jar
/x1/jenkins/jenkins-slave/workspace/HBase-0.94-security/trunk/target/surefire/surefire7581210458861196033tmp
/x1/jenkins/jenkins-slave/workspace/HBase-0.94-security/trunk/target/surefire/surefire_1271635211737102263999tmp
Running org.apache.hadoop.hbase.TestHBaseFileSystem
Tests run: 2, Failures: 0, Errors: 0, Skipped: 0, Time elapsed: 36.912 sec
Forking command line: /bin/sh -c cd /x1/jenkins/jenkins-slave/workspace/HBase-0.94-security/trunk
&& /x1/jenkins/tools/java/jdk1.6.0_45-32/jre/bin/java -enableassertions -Xmx1900m
-Djava.security.egd=file:/dev/./urandom -jar /x1/jenkins/jenkins-slave/workspace/HBase-0.94-security/trunk/target/surefire/surefirebooter7614082058524191199.jar
/x1/jenkins/jenkins-slave/workspace/HBase-0.94-security/trunk/target/surefire/surefire6686411925668437973tmp
/x1/jenkins/jenkins-slave/workspace/HBase-0.94-security/trunk/target/surefire/surefire_1285856345722692412777tmp
Running org.apache.hadoop.hbase.io.hfile.TestLruBlockCache
Tests run: 16, Failures: 0, Errors: 0, Skipped: 0, Time elapsed: 1.041 sec
Forking command line: /bin/sh -c cd /x1/jenkins/jenkins-slave/workspace/HBase-0.94-security/trunk
&& /x1/jenkins/tools/java/jdk1.6.0_45-32/jre/bin/java -enableassertions -Xmx1900m
-Djava.security.egd=file:/dev/./urandom -jar /x1/jenkins/jenkins-slave/workspace/HBase-0.94-security/trunk/target/surefire/surefirebooter5808119029813282550.jar
/x1/jenkins/jenkins-slave/workspace/HBase-0.94-security/trunk/target/surefire/surefire4631453084459934019tmp
/x1/jenkins/jenkins-slave/workspace/HBase-0.94-security/trunk/target/surefire/surefire_1295062673217285613566tmp
Running org.apache.hadoop.hbase.io.hfile.TestHFileSeek
Tests run: 1, Failures: 0, Errors: 0, Skipped: 0, Time elapsed: 5.797 sec
Forking command line: /bin/sh -c cd /x1/jenkins/jenkins-slave/workspace/HBase-0.94-security/trunk
&& /x1/jenkins/tools/java/jdk1.6.0_45-32/jre/bin/java -enableassertions -Xmx1900m
-Djava.security.egd=file:/dev/./urandom -jar /x1/jenkins/jenkins-slave/workspace/HBase-0.94-security/trunk/target/surefire/surefirebooter8616586900743359666.jar
/x1/jenkins/jenkins-slave/workspace/HBase-0.94-security/trunk/target/surefire/surefire8608259491091217768tmp
/x1/jenkins/jenkins-slave/workspace/HBase-0.94-security/trunk/target/surefire/surefire_1301984814394872284533tmp
Running org.apache.hadoop.hbase.io.hfile.TestFixedFileTrailer
Tests run: 2, Failures: 0, Errors: 0, Skipped: 0, Time elapsed: 2.047 sec
Forking command line: /bin/sh -c cd /x1/jenkins/jenkins-slave/workspace/HBase-0.94-security/trunk
&& /x1/jenkins/tools/java/jdk1.6.0_45-32/jre/bin/java -enableassertions -Xmx1900m
-Djava.security.egd=file:/dev/./urandom -jar /x1/jenkins/jenkins-slave/workspace/HBase-0.94-security/trunk/target/surefire/surefirebooter6000385318335114087.jar
/x1/jenkins/jenkins-slave/workspace/HBase-0.94-security/trunk/target/surefire/surefire14092754178905953tmp
/x1/jenkins/jenkins-slave/workspace/HBase-0.94-security/trunk/target/surefire/surefire_1315788553757365880591tmp
Running org.apache.hadoop.hbase.io.hfile.TestHFilePerformance
Tests run: 1, Failures: 0, Errors: 0, Skipped: 0, Time elapsed: 8.337 sec
Forking command line: /bin/sh -c cd /x1/jenkins/jenkins-slave/workspace/HBase-0.94-security/trunk
&& /x1/jenkins/tools/java/jdk1.6.0_45-32/jre/bin/java -enableassertions -Xmx1900m
-Djava.security.egd=file:/dev/./urandom -jar /x1/jenkins/jenkins-slave/workspace/HBase-0.94-security/trunk/target/surefire/surefirebooter6933917872409968840.jar
/x1/jenkins/jenkins-slave/workspace/HBase-0.94-security/trunk/target/surefire/surefire1476853258497958916tmp
/x1/jenkins/jenkins-slave/workspace/HBase-0.94-security/trunk/target/surefire/surefire_132643960087735652561tmp
Running org.apache.hadoop.hbase.io.hfile.TestHFileBlockCompatibility
Tests run: 10, Failures: 0, Errors: 0, Skipped: 0, Time elapsed: 7.276 sec
Forking command line: /bin/sh -c cd /x1/jenkins/jenkins-slave/workspace/HBase-0.94-security/trunk
&& /x1/jenkins/tools/java/jdk1.6.0_45-32/jre/bin/java -enableassertions -Xmx1900m
-Djava.security.egd=file:/dev/./urandom -jar /x1/jenkins/jenkins-slave/workspace/HBase-0.94-security/trunk/target/surefire/surefirebooter7166790096957233070.jar
/x1/jenkins/jenkins-slave/workspace/HBase-0.94-security/trunk/target/surefire/surefire1318573236502461658tmp
/x1/jenkins/jenkins-slave/workspace/HBase-0.94-security/trunk/target/surefire/surefire_1335929148226499521667tmp
Running org.apache.hadoop.hbase.io.hfile.TestCacheOnWrite
Tests run: 36, Failures: 0, Errors: 0, Skipped: 0, Time elapsed: 45.632 sec
Forking command line: /bin/sh -c cd /x1/jenkins/jenkins-slave/workspace/HBase-0.94-security/trunk
&& /x1/jenkins/tools/java/jdk1.6.0_45-32/jre/bin/java -enableassertions -Xmx1900m
-Djava.security.egd=file:/dev/./urandom -jar /x1/jenkins/jenkins-slave/workspace/HBase-0.94-security/trunk/target/surefire/surefirebooter7581052447775433797.jar
/x1/jenkins/jenkins-slave/workspace/HBase-0.94-security/trunk/target/surefire/surefire5367080047453683064tmp
/x1/jenkins/jenkins-slave/workspace/HBase-0.94-security/trunk/target/surefire/surefire_1347098421260865583322tmp
Running org.apache.hadoop.hbase.io.hfile.TestChecksum
Tests run: 3, Failures: 0, Errors: 0, Skipped: 0, Time elapsed: 2.313 sec
Forking command line: /bin/sh -c cd /x1/jenkins/jenkins-slave/workspace/HBase-0.94-security/trunk
&& /x1/jenkins/tools/java/jdk1.6.0_45-32/jre/bin/java -enableassertions -Xmx1900m
-Djava.security.egd=file:/dev/./urandom -jar /x1/jenkins/jenkins-slave/workspace/HBase-0.94-security/trunk/target/surefire/surefirebooter9151678978874293005.jar
/x1/jenkins/jenkins-slave/workspace/HBase-0.94-security/trunk/target/surefire/surefire609907681126639750tmp
/x1/jenkins/jenkins-slave/workspace/HBase-0.94-security/trunk/target/surefire/surefire_1353948483573272560598tmp
Running org.apache.hadoop.hbase.io.hfile.TestForceCacheImportantBlocks
Tests run: 4, Failures: 0, Errors: 0, Skipped: 0, Time elapsed: 70.372 sec
Forking command line: /bin/sh -c cd /x1/jenkins/jenkins-slave/workspace/HBase-0.94-security/trunk
&& /x1/jenkins/tools/java/jdk1.6.0_45-32/jre/bin/java -enableassertions -Xmx1900m
-Djava.security.egd=file:/dev/./urandom -jar /x1/jenkins/jenkins-slave/workspace/HBase-0.94-security/trunk/target/surefire/surefirebooter4858296662485123582.jar
/x1/jenkins/jenkins-slave/workspace/HBase-0.94-security/trunk/target/surefire/surefire7916794540689003944tmp
/x1/jenkins/jenkins-slave/workspace/HBase-0.94-security/trunk/target/surefire/surefire_136253305375493696601tmp
Running org.apache.hadoop.hbase.io.hfile.slab.TestSlabCache
Tests run: 7, Failures: 0, Errors: 0, Skipped: 0, Time elapsed: 18.11 sec
Forking command line: /bin/sh -c cd /x1/jenkins/jenkins-slave/workspace/HBase-0.94-security/trunk
&& /x1/jenkins/tools/java/jdk1.6.0_45-32/jre/bin/java -enableassertions -Xmx1900m
-Djava.security.egd=file:/dev/./urandom -jar /x1/jenkins/jenkins-slave/workspace/HBase-0.94-security/trunk/target/surefire/surefirebooter6504534347135840545.jar
/x1/jenkins/jenkins-slave/workspace/HBase-0.94-security/trunk/target/surefire/surefire116048933184393134tmp
/x1/jenkins/jenkins-slave/workspace/HBase-0.94-security/trunk/target/surefire/surefire_1377803012214976368335tmp
Running org.apache.hadoop.hbase.io.hfile.slab.TestSingleSizeCache
Tests run: 5, Failures: 0, Errors: 0, Skipped: 0, Time elapsed: 50.078 sec
Forking command line: /bin/sh -c cd /x1/jenkins/jenkins-slave/workspace/HBase-0.94-security/trunk
&& /x1/jenkins/tools/java/jdk1.6.0_45-32/jre/bin/java -enableassertions -Xmx1900m
-Djava.security.egd=file:/dev/./urandom -jar /x1/jenkins/jenkins-slave/workspace/HBase-0.94-security/trunk/target/surefire/surefirebooter8454747578482174458.jar
/x1/jenkins/jenkins-slave/workspace/HBase-0.94-security/trunk/target/surefire/surefire3274574771789640486tmp
/x1/jenkins/jenkins-slave/workspace/HBase-0.94-security/trunk/target/surefire/surefire_1388129033825387013136tmp
Running org.apache.hadoop.hbase.io.hfile.TestHFileBlock
Tests run: 16, Failures: 0, Errors: 0, Skipped: 0, Time elapsed: 81.018 sec
Forking command line: /bin/sh -c cd /x1/jenkins/jenkins-slave/workspace/HBase-0.94-security/trunk
&& /x1/jenkins/tools/java/jdk1.6.0_45-32/jre/bin/java -enableassertions -Xmx1900m
-Djava.security.egd=file:/dev/./urandom -jar /x1/jenkins/jenkins-slave/workspace/HBase-0.94-security/trunk/target/surefire/surefirebooter5281206695365023159.jar
/x1/jenkins/jenkins-slave/workspace/HBase-0.94-security/trunk/target/surefire/surefire7209468640751108413tmp
/x1/jenkins/jenkins-slave/workspace/HBase-0.94-security/trunk/target/surefire/surefire_1393534696856571436211tmp
Running org.apache.hadoop.hbase.io.TestFileLink
Tests run: 3, Failures: 0, Errors: 0, Skipped: 0, Time elapsed: 30.99 sec
Forking command line: /bin/sh -c cd /x1/jenkins/jenkins-slave/workspace/HBase-0.94-security/trunk
&& /x1/jenkins/tools/java/jdk1.6.0_45-32/jre/bin/java -enableassertions -Xmx1900m
-Djava.security.egd=file:/dev/./urandom -jar /x1/jenkins/jenkins-slave/workspace/HBase-0.94-security/trunk/target/surefire/surefirebooter1723622277423359022.jar
/x1/jenkins/jenkins-slave/workspace/HBase-0.94-security/trunk/target/surefire/surefire744454186710299090tmp
/x1/jenkins/jenkins-slave/workspace/HBase-0.94-security/trunk/target/surefire/surefire_1407863434814851422010tmp
Running org.apache.hadoop.hbase.replication.TestReplicationZookeeper
Tests run: 1, Failures: 0, Errors: 0, Skipped: 0, Time elapsed: 2.103 sec
Forking command line: /bin/sh -c cd /x1/jenkins/jenkins-slave/workspace/HBase-0.94-security/trunk
&& /x1/jenkins/tools/java/jdk1.6.0_45-32/jre/bin/java -enableassertions -Xmx1900m
-Djava.security.egd=file:/dev/./urandom -jar /x1/jenkins/jenkins-slave/workspace/HBase-0.94-security/trunk/target/surefire/surefirebooter6472097229128916142.jar
/x1/jenkins/jenkins-slave/workspace/HBase-0.94-security/trunk/target/surefire/surefire3967889244022208076tmp
/x1/jenkins/jenkins-slave/workspace/HBase-0.94-security/trunk/target/surefire/surefire_1413812658552099609025tmp
Running org.apache.hadoop.hbase.io.encoding.TestLoadAndSwitchEncodeOnDisk
Tests run: 1, Failures: 0, Errors: 0, Skipped: 0, Time elapsed: 44.176 sec
Forking command line: /bin/sh -c cd /x1/jenkins/jenkins-slave/workspace/HBase-0.94-security/trunk
&& /x1/jenkins/tools/java/jdk1.6.0_45-32/jre/bin/java -enableassertions -Xmx1900m
-Djava.security.egd=file:/dev/./urandom -jar /x1/jenkins/jenkins-slave/workspace/HBase-0.94-security/trunk/target/surefire/surefirebooter4201082134414405532.jar
/x1/jenkins/jenkins-slave/workspace/HBase-0.94-security/trunk/target/surefire/surefire24060606608409644tmp
/x1/jenkins/jenkins-slave/workspace/HBase-0.94-security/trunk/target/surefire/surefire_1423169158070000232534tmp
Running org.apache.hadoop.hbase.replication.regionserver.TestReplicationSink
Tests run: 5, Failures: 0, Errors: 0, Skipped: 0, Time elapsed: 26.833 sec
Forking command line: /bin/sh -c cd /x1/jenkins/jenkins-slave/workspace/HBase-0.94-security/trunk
&& /x1/jenkins/tools/java/jdk1.6.0_45-32/jre/bin/java -enableassertions -Xmx1900m
-Djava.security.egd=file:/dev/./urandom -jar /x1/jenkins/jenkins-slave/workspace/HBase-0.94-security/trunk/target/surefire/surefirebooter1196184989176538561.jar
/x1/jenkins/jenkins-slave/workspace/HBase-0.94-security/trunk/target/surefire/surefire7908364625828607221tmp
/x1/jenkins/jenkins-slave/workspace/HBase-0.94-security/trunk/target/surefire/surefire_14376348661455780094tmp
Running org.apache.hadoop.hbase.replication.regionserver.TestReplicationSourceManager
Tests run: 3, Failures: 0, Errors: 0, Skipped: 0, Time elapsed: 5.163 sec
Forking command line: /bin/sh -c cd /x1/jenkins/jenkins-slave/workspace/HBase-0.94-security/trunk
&& /x1/jenkins/tools/java/jdk1.6.0_45-32/jre/bin/java -enableassertions -Xmx1900m
-Djava.security.egd=file:/dev/./urandom -jar /x1/jenkins/jenkins-slave/workspace/HBase-0.94-security/trunk/target/surefire/surefirebooter1461122465715944122.jar
/x1/jenkins/jenkins-slave/workspace/HBase-0.94-security/trunk/target/surefire/surefire6233866639365587222tmp
/x1/jenkins/jenkins-slave/workspace/HBase-0.94-security/trunk/target/surefire/surefire_1442397067155207560818tmp
Running org.apache.hadoop.hbase.util.TestFSTableDescriptors
Tests run: 11, Failures: 0, Errors: 0, Skipped: 0, Time elapsed: 5.868 sec
Forking command line: /bin/sh -c cd /x1/jenkins/jenkins-slave/workspace/HBase-0.94-security/trunk
&& /x1/jenkins/tools/java/jdk1.6.0_45-32/jre/bin/java -enableassertions -Xmx1900m
-Djava.security.egd=file:/dev/./urandom -jar /x1/jenkins/jenkins-slave/workspace/HBase-0.94-security/trunk/target/surefire/surefirebooter6288343651705341547.jar
/x1/jenkins/jenkins-slave/workspace/HBase-0.94-security/trunk/target/surefire/surefire4718223737307692260tmp
/x1/jenkins/jenkins-slave/workspace/HBase-0.94-security/trunk/target/surefire/surefire_145446934955724991200tmp
Running org.apache.hadoop.hbase.replication.TestReplicationSource
Tests run: 1, Failures: 0, Errors: 0, Skipped: 0, Time elapsed: 18.71 sec
Forking command line: /bin/sh -c cd /x1/jenkins/jenkins-slave/workspace/HBase-0.94-security/trunk
&& /x1/jenkins/tools/java/jdk1.6.0_45-32/jre/bin/java -enableassertions -Xmx1900m
-Djava.security.egd=file:/dev/./urandom -jar /x1/jenkins/jenkins-slave/workspace/HBase-0.94-security/trunk/target/surefire/surefirebooter1606055477807324073.jar
/x1/jenkins/jenkins-slave/workspace/HBase-0.94-security/trunk/target/surefire/surefire5657026971271463628tmp
/x1/jenkins/jenkins-slave/workspace/HBase-0.94-security/trunk/target/surefire/surefire_1461085119687975515840tmp
Running org.apache.hadoop.hbase.util.TestEnvironmentEdgeManager
Tests run: 2, Failures: 0, Errors: 0, Skipped: 0, Time elapsed: 0.485 sec
Forking command line: /bin/sh -c cd /x1/jenkins/jenkins-slave/workspace/HBase-0.94-security/trunk
&& /x1/jenkins/tools/java/jdk1.6.0_45-32/jre/bin/java -enableassertions -Xmx1900m
-Djava.security.egd=file:/dev/./urandom -jar /x1/jenkins/jenkins-slave/workspace/HBase-0.94-security/trunk/target/surefire/surefirebooter4927786513415674146.jar
/x1/jenkins/jenkins-slave/workspace/HBase-0.94-security/trunk/target/surefire/surefire8282224151619669470tmp
/x1/jenkins/jenkins-slave/workspace/HBase-0.94-security/trunk/target/surefire/surefire_147910635591672757883tmp
Running org.apache.hadoop.hbase.util.TestIdLock
Tests run: 1, Failures: 0, Errors: 0, Skipped: 0, Time elapsed: 15.421 sec
Forking command line: /bin/sh -c cd /x1/jenkins/jenkins-slave/workspace/HBase-0.94-security/trunk
&& /x1/jenkins/tools/java/jdk1.6.0_45-32/jre/bin/java -enableassertions -Xmx1900m
-Djava.security.egd=file:/dev/./urandom -jar /x1/jenkins/jenkins-slave/workspace/HBase-0.94-security/trunk/target/surefire/surefirebooter6203254417239837829.jar
/x1/jenkins/jenkins-slave/workspace/HBase-0.94-security/trunk/target/surefire/surefire1847976532342511009tmp
/x1/jenkins/jenkins-slave/workspace/HBase-0.94-security/trunk/target/surefire/surefire_148549342938037660398tmp
Running org.apache.hadoop.hbase.util.TestMergeTable
Tests run: 1, Failures: 0, Errors: 0, Skipped: 0, Time elapsed: 46.001 sec
Forking command line: /bin/sh -c cd /x1/jenkins/jenkins-slave/workspace/HBase-0.94-security/trunk
&& /x1/jenkins/tools/java/jdk1.6.0_45-32/jre/bin/java -enableassertions -Xmx1900m
-Djava.security.egd=file:/dev/./urandom -jar /x1/jenkins/jenkins-slave/workspace/HBase-0.94-security/trunk/target/surefire/surefirebooter698910810032202276.jar
/x1/jenkins/jenkins-slave/workspace/HBase-0.94-security/trunk/target/surefire/surefire1113291932299211793tmp
/x1/jenkins/jenkins-slave/workspace/HBase-0.94-security/trunk/target/surefire/surefire_1493936551797212271626tmp
Running org.apache.hadoop.hbase.util.TestPoolMap$TestRoundRobinPoolType
Tests run: 3, Failures: 0, Errors: 0, Skipped: 0, Time elapsed: 0.009 sec
Running org.apache.hadoop.hbase.util.TestPoolMap$TestThreadLocalPoolType
Tests run: 3, Failures: 0, Errors: 0, Skipped: 0, Time elapsed: 0.005 sec
Running org.apache.hadoop.hbase.util.TestPoolMap$TestReusablePoolType
Tests run: 3, Failures: 0, Errors: 0, Skipped: 0, Time elapsed: 0.028 sec
Forking command line: /bin/sh -c cd /x1/jenkins/jenkins-slave/workspace/HBase-0.94-security/trunk
&& /x1/jenkins/tools/java/jdk1.6.0_45-32/jre/bin/java -enableassertions -Xmx1900m
-Djava.security.egd=file:/dev/./urandom -jar /x1/jenkins/jenkins-slave/workspace/HBase-0.94-security/trunk/target/surefire/surefirebooter2869184469015933638.jar
/x1/jenkins/jenkins-slave/workspace/HBase-0.94-security/trunk/target/surefire/surefire8671705681006806745tmp
/x1/jenkins/jenkins-slave/workspace/HBase-0.94-security/trunk/target/surefire/surefire_1504685645013767721077tmp
Running org.apache.hadoop.hbase.util.TestFSUtils
Tests run: 4, Failures: 0, Errors: 0, Skipped: 0, Time elapsed: 45.051 sec
Forking command line: /bin/sh -c cd /x1/jenkins/jenkins-slave/workspace/HBase-0.94-security/trunk
&& /x1/jenkins/tools/java/jdk1.6.0_45-32/jre/bin/java -enableassertions -Xmx1900m
-Djava.security.egd=file:/dev/./urandom -jar /x1/jenkins/jenkins-slave/workspace/HBase-0.94-security/trunk/target/surefire/surefirebooter3921837692137253664.jar
/x1/jenkins/jenkins-slave/workspace/HBase-0.94-security/trunk/target/surefire/surefire7235329688220862311tmp
/x1/jenkins/jenkins-slave/workspace/HBase-0.94-security/trunk/target/surefire/surefire_1517866383752077890230tmp
Running org.apache.hadoop.hbase.util.TestRegionSplitter
Tests run: 5, Failures: 0, Errors: 0, Skipped: 0, Time elapsed: 27.25 sec
Forking command line: /bin/sh -c cd /x1/jenkins/jenkins-slave/workspace/HBase-0.94-security/trunk
&& /x1/jenkins/tools/java/jdk1.6.0_45-32/jre/bin/java -enableassertions -Xmx1900m
-Djava.security.egd=file:/dev/./urandom -jar /x1/jenkins/jenkins-slave/workspace/HBase-0.94-security/trunk/target/surefire/surefirebooter3811463464223963543.jar
/x1/jenkins/jenkins-slave/workspace/HBase-0.94-security/trunk/target/surefire/surefire5073412713907374177tmp
/x1/jenkins/jenkins-slave/workspace/HBase-0.94-security/trunk/target/surefire/surefire_152349049020996506952tmp
Running org.apache.hadoop.hbase.util.TestFSVisitor
Tests run: 3, Failures: 0, Errors: 0, Skipped: 0, Time elapsed: 1.889 sec
Forking command line: /bin/sh -c cd /x1/jenkins/jenkins-slave/workspace/HBase-0.94-security/trunk
&& /x1/jenkins/tools/java/jdk1.6.0_45-32/jre/bin/java -enableassertions -Xmx1900m
-Djava.security.egd=file:/dev/./urandom -jar /x1/jenkins/jenkins-slave/workspace/HBase-0.94-security/trunk/target/surefire/surefirebooter1580449238338256139.jar
/x1/jenkins/jenkins-slave/workspace/HBase-0.94-security/trunk/target/surefire/surefire8911231679508276884tmp
/x1/jenkins/jenkins-slave/workspace/HBase-0.94-security/trunk/target/surefire/surefire_1533789896959621056940tmp
Running org.apache.hadoop.hbase.util.TestCoprocessorScanPolicy
Tests run: 2, Failures: 0, Errors: 0, Skipped: 0, Time elapsed: 29.728 sec
Forking command line: /bin/sh -c cd /x1/jenkins/jenkins-slave/workspace/HBase-0.94-security/trunk
&& /x1/jenkins/tools/java/jdk1.6.0_45-32/jre/bin/java -enableassertions -Xmx1900m
-Djava.security.egd=file:/dev/./urandom -jar /x1/jenkins/jenkins-slave/workspace/HBase-0.94-security/trunk/target/surefire/surefirebooter5569984780624240262.jar
/x1/jenkins/jenkins-slave/workspace/HBase-0.94-security/trunk/target/surefire/surefire3214425882767146962tmp
/x1/jenkins/jenkins-slave/workspace/HBase-0.94-security/trunk/target/surefire/surefire_1547972368825170476752tmp
Running org.apache.hadoop.hbase.util.hbck.TestOfflineMetaRebuildOverlap
Tests run: 1, Failures: 0, Errors: 0, Skipped: 0, Time elapsed: 44.662 sec
Forking command line: /bin/sh -c cd /x1/jenkins/jenkins-slave/workspace/HBase-0.94-security/trunk
&& /x1/jenkins/tools/java/jdk1.6.0_45-32/jre/bin/java -enableassertions -Xmx1900m
-Djava.security.egd=file:/dev/./urandom -jar /x1/jenkins/jenkins-slave/workspace/HBase-0.94-security/trunk/target/surefire/surefirebooter532268924075479178.jar
/x1/jenkins/jenkins-slave/workspace/HBase-0.94-security/trunk/target/surefire/surefire4130299634444467555tmp
/x1/jenkins/jenkins-slave/workspace/HBase-0.94-security/trunk/target/surefire/surefire_1552224437755869849919tmp
Running org.apache.hadoop.hbase.util.hbck.TestOfflineMetaRebuildBase
Tests run: 1, Failures: 0, Errors: 0, Skipped: 0, Time elapsed: 51.318 sec
Forking command line: /bin/sh -c cd /x1/jenkins/jenkins-slave/workspace/HBase-0.94-security/trunk
&& /x1/jenkins/tools/java/jdk1.6.0_45-32/jre/bin/java -enableassertions -Xmx1900m
-Djava.security.egd=file:/dev/./urandom -jar /x1/jenkins/jenkins-slave/workspace/HBase-0.94-security/trunk/target/surefire/surefirebooter3228686092620642558.jar
/x1/jenkins/jenkins-slave/workspace/HBase-0.94-security/trunk/target/surefire/surefire5986773031205858687tmp
/x1/jenkins/jenkins-slave/workspace/HBase-0.94-security/trunk/target/surefire/surefire_1564250932480783342476tmp
Running org.apache.hadoop.hbase.util.TestDefaultEnvironmentEdge
Tests run: 1, Failures: 0, Errors: 0, Skipped: 0, Time elapsed: 0.294 sec
Forking command line: /bin/sh -c cd /x1/jenkins/jenkins-slave/workspace/HBase-0.94-security/trunk
&& /x1/jenkins/tools/java/jdk1.6.0_45-32/jre/bin/java -enableassertions -Xmx1900m
-Djava.security.egd=file:/dev/./urandom -jar /x1/jenkins/jenkins-slave/workspace/HBase-0.94-security/trunk/target/surefire/surefirebooter3082644994304498016.jar
/x1/jenkins/jenkins-slave/workspace/HBase-0.94-security/trunk/target/surefire/surefire5477856713048067591tmp
/x1/jenkins/jenkins-slave/workspace/HBase-0.94-security/trunk/target/surefire/surefire_1578940681322294221093tmp
Running org.apache.hadoop.hbase.util.TestFSHDFSUtils
Tests run: 3, Failures: 0, Errors: 0, Skipped: 0, Time elapsed: 4.038 sec
Forking command line: /bin/sh -c cd /x1/jenkins/jenkins-slave/workspace/HBase-0.94-security/trunk
&& /x1/jenkins/tools/java/jdk1.6.0_45-32/jre/bin/java -enableassertions -Xmx1900m
-Djava.security.egd=file:/dev/./urandom -jar /x1/jenkins/jenkins-slave/workspace/HBase-0.94-security/trunk/target/surefire/surefirebooter8565219608759548541.jar
/x1/jenkins/jenkins-slave/workspace/HBase-0.94-security/trunk/target/surefire/surefire5036966369865763561tmp
/x1/jenkins/jenkins-slave/workspace/HBase-0.94-security/trunk/target/surefire/surefire_1587594050619127433673tmp
Running org.apache.hadoop.hbase.util.hbck.TestOfflineMetaRebuildHole
Tests run: 1, Failures: 0, Errors: 0, Skipped: 0, Time elapsed: 42.353 sec
Forking command line: /bin/sh -c cd /x1/jenkins/jenkins-slave/workspace/HBase-0.94-security/trunk
&& /x1/jenkins/tools/java/jdk1.6.0_45-32/jre/bin/java -enableassertions -Xmx1900m
-Djava.security.egd=file:/dev/./urandom -jar /x1/jenkins/jenkins-slave/workspace/HBase-0.94-security/trunk/target/surefire/surefirebooter2009594177024532326.jar
/x1/jenkins/jenkins-slave/workspace/HBase-0.94-security/trunk/target/surefire/surefire488248311904154880tmp
/x1/jenkins/jenkins-slave/workspace/HBase-0.94-security/trunk/target/surefire/surefire_1594160926061906964563tmp
Running org.apache.hadoop.hbase.TestInfoServers
Tests run: 3, Failures: 0, Errors: 0, Skipped: 0, Time elapsed: 24.852 sec
Running org.apache.hadoop.hbase.util.TestSizeBasedThrottler
Tests run: 3, Failures: 0, Errors: 0, Skipped: 0, Time elapsed: 68.752 sec

Results :

Failed tests:   testInfo(org.apache.hadoop.hbase.master.TestMXBean)

Tests run: 918, Failures: 1, Errors: 0, Skipped: 2

[INFO] ------------------------------------------------------------------------
[INFO] BUILD FAILURE
[INFO] ------------------------------------------------------------------------
[INFO] Total time: 58:50.217s
[INFO] Finished at: Tue Mar 25 09:47:56 UTC 2014
[INFO] Final Memory: 37M/976M
[INFO] ------------------------------------------------------------------------
[ERROR] Failed to execute goal org.apache.maven.plugins:maven-surefire-plugin:2.12-TRUNK-HBASE-2:test
(secondPartTestsExecution) on project hbase: There are test failures.
[ERROR] 
[ERROR] Please refer to /x1/jenkins/jenkins-slave/workspace/HBase-0.94-security/trunk/target/surefire-reports
for the individual test results.
[ERROR] -> [Help 1]
org.apache.maven.lifecycle.LifecycleExecutionException: Failed to execute goal org.apache.maven.plugins:maven-surefire-plugin:2.12-TRUNK-HBASE-2:test
(secondPartTestsExecution) on project hbase: There are test failures.

Please refer to /x1/jenkins/jenkins-slave/workspace/HBase-0.94-security/trunk/target/surefire-reports
for the individual test results.
	at org.apache.maven.lifecycle.internal.MojoExecutor.execute(MojoExecutor.java:213)
	at org.apache.maven.lifecycle.internal.MojoExecutor.execute(MojoExecutor.java:153)
	at org.apache.maven.lifecycle.internal.MojoExecutor.execute(MojoExecutor.java:145)
	at org.apache.maven.lifecycle.internal.MojoExecutor.executeForkedExecutions(MojoExecutor.java:365)
	at org.apache.maven.lifecycle.internal.MojoExecutor.execute(MojoExecutor.java:199)
	at org.apache.maven.lifecycle.internal.MojoExecutor.execute(MojoExecutor.java:153)
	at org.apache.maven.lifecycle.internal.MojoExecutor.execute(MojoExecutor.java:145)
	at org.apache.maven.lifecycle.internal.LifecycleModuleBuilder.buildProject(LifecycleModuleBuilder.java:84)
	at org.apache.maven.lifecycle.internal.LifecycleModuleBuilder.buildProject(LifecycleModuleBuilder.java:59)
	at org.apache.maven.lifecycle.internal.LifecycleStarter.singleThreadedBuild(LifecycleStarter.java:183)
	at org.apache.maven.lifecycle.internal.LifecycleStarter.execute(LifecycleStarter.java:161)
	at org.apache.maven.DefaultMaven.doExecute(DefaultMaven.java:320)
	at org.apache.maven.DefaultMaven.execute(DefaultMaven.java:156)
	at org.apache.maven.cli.MavenCli.execute(MavenCli.java:537)
	at org.apache.maven.cli.MavenCli.doMain(MavenCli.java:196)
	at org.apache.maven.cli.MavenCli.main(MavenCli.java:141)
	at sun.reflect.NativeMethodAccessorImpl.invoke0(Native Method)
	at sun.reflect.NativeMethodAccessorImpl.invoke(NativeMethodAccessorImpl.java:39)
	at sun.reflect.DelegatingMethodAccessorImpl.invoke(DelegatingMethodAccessorImpl.java:25)
	at java.lang.reflect.Method.invoke(Method.java:597)
	at org.codehaus.plexus.classworlds.launcher.Launcher.launchEnhanced(Launcher.java:290)
	at org.codehaus.plexus.classworlds.launcher.Launcher.launch(Launcher.java:230)
	at org.codehaus.plexus.classworlds.launcher.Launcher.mainWithExitCode(Launcher.java:409)
	at org.codehaus.plexus.classworlds.launcher.Launcher.main(Launcher.java:352)
Caused by: org.apache.maven.plugin.MojoFailureException: There are test failures.

Please refer to /x1/jenkins/jenkins-slave/workspace/HBase-0.94-security/trunk/target/surefire-reports
for the individual test results.
	at org.apache.maven.plugin.surefire.SurefireHelper.reportExecution(SurefireHelper.java:87)
	at org.apache.maven.plugin.surefire.SurefirePlugin.writeSummary(SurefirePlugin.java:651)
	at org.apache.maven.plugin.surefire.SurefirePlugin.handleSummary(SurefirePlugin.java:625)
	at org.apache.maven.plugin.surefire.AbstractSurefireMojo.executeAfterPreconditionsChecked(AbstractSurefireMojo.java:137)
	at org.apache.maven.plugin.surefire.AbstractSurefireMojo.execute(AbstractSurefireMojo.java:98)
	at org.apache.maven.plugin.DefaultBuildPluginManager.executeMojo(DefaultBuildPluginManager.java:101)
	at org.apache.maven.lifecycle.internal.MojoExecutor.execute(MojoExecutor.java:209)
	... 23 more
[ERROR] 
[ERROR] 
[ERROR] For more information about the errors and possible solutions, please read the following
articles:
[ERROR] [Help 1] http://cwiki.apache.org/confluence/display/MAVEN/MojoFailureException
Build step 'Invoke top-level Maven targets' marked build as failure
Archiving artifacts
Recording test results

Mime
View raw message