hbase-builds mailing list archives

Site index · List index
Message view « Date » · « Thread »
Top « Date » · « Thread »
From Apache Jenkins Server <jenk...@builds.apache.org>
Subject Build failed in Jenkins: hbase-0.96 #338
Date Tue, 11 Mar 2014 20:08:17 GMT
See <https://builds.apache.org/job/hbase-0.96/338/>

------------------------------------------
[...truncated 4406 lines...]
  org.apache.hadoop.hbase.client.TestSnapshotCloneIndependence: Cannot create directory /home/hudson/jenkins-slave/workspace/hbase-0.96/0.96/hbase-server/target/test-data/e7ff01e0-5a07-4aaf-a30e-8bf73db4db0d/dfscluster_f22ed434-ebb9-4f3d-b123-b91b8d069060/dfs/name1/current
  org.apache.hadoop.hbase.client.TestRestoreSnapshotFromClient: Cannot create directory /home/hudson/jenkins-slave/workspace/hbase-0.96/0.96/hbase-server/target/test-data/a6df3acc-bb21-43bf-91a9-566c3c77ba73/dfscluster_a907332b-cd81-463a-8db6-d4d036f7a970/dfs/name1/current
  testBasicSplit(org.apache.hadoop.hbase.regionserver.TestHRegion)
  testWritesWhileGetting(org.apache.hadoop.hbase.regionserver.TestHRegion): Unable to create
region directory: /home/hudson/jenkins-slave/workspace/hbase-0.96/0.96/hbase-server/target/test-data/49952051-5c0a-4f2c-9b3d-a0b6b2865ca4/data/default/testWritesWhileGetting/ad9ba4d01d9aba754f21d62f96331b5f
  testCheckAndMutate_WithNonEqualCompareOp(org.apache.hadoop.hbase.regionserver.TestHRegion):
Unable to create region directory: /home/hudson/jenkins-slave/workspace/hbase-0.96/0.96/hbase-server/target/test-data/009265c0-2b55-4ddd-9bf8-13430f170681/data/default/testCheckAndMutate_WithNonEqualCompareOp/be3e6e1bb6e35ed3acf80dff81bc3084
  testRegionScanner_Next(org.apache.hadoop.hbase.regionserver.TestHRegion): java.io.IOException:
Failed creating /home/hudson/jenkins-slave/workspace/hbase-0.96/0.96/hbase-server/target/test-data/783bf5cc-a1fc-4e36-a8b1-88ad97b1a47d/data/default/testRegionScanner_Next/c3666b5383d71cfce396cdbc7faeabc3/fam1
  testBatchPutWithTsSlop(org.apache.hadoop.hbase.regionserver.TestHRegion): Unable to create
region directory: /home/hudson/jenkins-slave/workspace/hbase-0.96/0.96/hbase-server/target/test-data/17715346-364a-465d-8e58-bb13e8ffc37e/data/default/testBatchPutWithTsSlop/f13b5d5c4c52e52311858b5c52b95d7a
  testScanner_JoinedScannersWithLimits(org.apache.hadoop.hbase.regionserver.TestHRegion):
Unable to create region directory: /home/hudson/jenkins-slave/workspace/hbase-0.96/0.96/hbase-server/target/test-data/738b143e-c8a6-4ca9-b84e-3ee34e5e3174/data/default/testScanner_JoinedScannersWithLimits/da5e6fc48f72718c79c59c55af4bc29b
  testCheckAndPut_ThatPutWasWritten(org.apache.hadoop.hbase.regionserver.TestHRegion): Unable
to create region directory: /home/hudson/jenkins-slave/workspace/hbase-0.96/0.96/hbase-server/target/test-data/63725b60-ce7b-4237-910f-f22f5e90bb40/data/default/testCheckAndPut_ThatPutWasWritten/893e32d22a8ceada32230b82f1655bfd
  testDelete_CheckTimestampUpdated(org.apache.hadoop.hbase.regionserver.TestHRegion): Unable
to create region directory: /home/hudson/jenkins-slave/workspace/hbase-0.96/0.96/hbase-server/target/test-data/730e4434-0061-4fc9-8066-f0e9d751c55e/data/default/testDelete_CheckTimestampUpdated/76ec487c6ded35116e02c86ffe4283fb
  testScanner_StopRow1542(org.apache.hadoop.hbase.regionserver.TestHRegion): Unable to create
region directory: /home/hudson/jenkins-slave/workspace/hbase-0.96/0.96/hbase-server/target/test-data/32c056a6-3717-47ed-893d-9b80818b5619/data/default/testScanner_StopRow1542/bde0e89cc6f75f9c68eca0d7e61254cd
  testDelete_multiDeleteColumn(org.apache.hadoop.hbase.regionserver.TestHRegion): Unable to
create region directory: /home/hudson/jenkins-slave/workspace/hbase-0.96/0.96/hbase-server/target/test-data/827a885c-2e41-494d-969b-a0622ff87ee2/data/default/testDelete_multiDeleteColumn/07276fd583dbefd597876984210bc6df
  testMerge(org.apache.hadoop.hbase.regionserver.TestHRegion): Unable to create region directory:
/home/hudson/jenkins-slave/workspace/hbase-0.96/0.96/hbase-server/target/test-data/9ec56990-ae46-4d71-8a61-4c064bd7c581/data/default/testMerge/0924e4613bddae30f782caa6f1991031
  testAllColumnsWithBloomFilter(org.apache.hadoop.hbase.regionserver.TestHRegion): Unable
to create region directory: /home/hudson/jenkins-slave/workspace/hbase-0.96/0.96/hbase-server/target/test-data/ffcc2a78-c704-4b17-b56e-24cefc030a92/data/default/testAllColumnsWithBloomFilter/c6877378b01cdbc070c56fc799236e09
  testScanner_Wildcard_FromMemStore_EnforceVersions(org.apache.hadoop.hbase.regionserver.TestHRegion):
Unable to create region directory: /home/hudson/jenkins-slave/workspace/hbase-0.96/0.96/hbase-server/target/test-data/aeebf29e-8da3-4c34-8f89-55c7ebcbcf27/data/default/testScanner_Wildcard_FromMemStore_EnforceVersions/22c082900700ac9a8f077170cc9ac251
  testPutWithTsSlop(org.apache.hadoop.hbase.regionserver.TestHRegion): Unable to create region
directory: /home/hudson/jenkins-slave/workspace/hbase-0.96/0.96/hbase-server/target/test-data/121b104a-443b-4432-83e6-902ef27193f4/data/default/testPutWithTsSlop/968fb8bf8250e2b607ae5ba0833a4dde
  testBatchPut(org.apache.hadoop.hbase.regionserver.TestHRegion): Unable to create region
directory: /home/hudson/jenkins-slave/workspace/hbase-0.96/0.96/hbase-server/target/test-data/38a1430f-d012-4ced-82b8-3f717f2598d2/data/default/testBatchPut/94188c4dd3d1bd7474577c9cf9b94112
  testRecoveredEditsReplayCompaction(org.apache.hadoop.hbase.regionserver.TestHRegion): Unable
to create region directory: /home/hudson/jenkins-slave/workspace/hbase-0.96/0.96/hbase-server/target/test-data/dbb36baa-5029-4260-b2bc-16f60e69d8c1/data/default/testRecoveredEditsReplayCompaction/96f183be6b56826dea53efa8ba01c4af
  testDeleteRowWithFutureTs(org.apache.hadoop.hbase.regionserver.TestHRegion): Unable to create
region directory: /home/hudson/jenkins-slave/workspace/hbase-0.96/0.96/hbase-server/target/test-data/2b2d09db-44a6-4748-a9d2-ae1953c282fd/data/default/testDeleteRowWithFutureTs/ac94ace5aac8a353f161ee92d661c295
  testSkipRecoveredEditsReplayAllIgnored(org.apache.hadoop.hbase.regionserver.TestHRegion):
Unable to create region directory: /home/hudson/jenkins-slave/workspace/hbase-0.96/0.96/hbase-server/target/test-data/ec3b7a63-8e6c-4937-9769-19fd383e3c08/data/default/testSkipRecoveredEditsReplayAllIgnored/c23a92220f06484c22815326dec9d2b6
  testParallelAppendWithMemStoreFlush(org.apache.hadoop.hbase.regionserver.TestHRegion): Unable
to create region directory: /home/hudson/jenkins-slave/workspace/hbase-0.96/0.96/hbase-server/target/test-data/8939c9d8-c386-4a1b-8d75-757de24bb93d/data/default/testParallelAppendWithMemStoreFlush/4fced766959401ca82769d08868d0e03
  testRegionInfoFileCreation(org.apache.hadoop.hbase.regionserver.TestHRegion): Unable to
create region directory: /home/hudson/jenkins-slave/workspace/hbase-0.96/0.96/hbase-server/target/test-data/516f3bb9-38b7-497b-be4a-02b20a75a1e4/TestHRegiontestRegionInfoFileCreation/data/default/testtb/4d88f8451d56619eeb6e8512ee79621e
  testGetScanner_WithOkFamilies(org.apache.hadoop.hbase.regionserver.TestHRegion): Unable
to create region directory: /home/hudson/jenkins-slave/workspace/hbase-0.96/0.96/hbase-server/target/test-data/dcbf0ceb-20db-4fcb-bb18-5e26dc8c91a1/data/default/testGetScanner_WithOkFamilies/0b86e652bdc238f256d20304c8af2244
  testPutWithLatestTS(org.apache.hadoop.hbase.regionserver.TestHRegion): Unable to create
region directory: /home/hudson/jenkins-slave/workspace/hbase-0.96/0.96/hbase-server/target/test-data/b9394486-5b71-40e7-9deb-d8911aba95a9/data/default/testPutWithLatestTS/99a625c2e1ebb53acc5baa56d8e1b42e
  testFamilyWithAndWithoutColon(org.apache.hadoop.hbase.regionserver.TestHRegion): Unable
to create region directory: /home/hudson/jenkins-slave/workspace/hbase-0.96/0.96/hbase-server/target/test-data/9719b8ff-3eb7-4910-918e-f363db0b6ff9/data/default/testFamilyWithAndWithoutColon/5751a539d0b3cdfb8819282e9ab9ee8f
  testBloomFilterSize(org.apache.hadoop.hbase.regionserver.TestHRegion): Unable to create
region directory: /home/hudson/jenkins-slave/workspace/hbase-0.96/0.96/hbase-server/target/test-data/f1476817-bcc2-4b21-bb37-dfde35ebec8c/data/default/testBloomFilterSize/0a90cb8494032e76dd0b7847b55f9ae9
  testGetWhileRegionClose(org.apache.hadoop.hbase.regionserver.TestHRegion): Unable to create
region directory: /home/hudson/jenkins-slave/workspace/hbase-0.96/0.96/hbase-server/target/test-data/f4e17f06-ccac-407b-ae4f-b63f91fe3a03/data/default/testGetWhileRegionClose/7e808375dd3b62a61243754193833916
  testIndexesScanWithOneDeletedRow(org.apache.hadoop.hbase.regionserver.TestHRegion): Unable
to create region directory: /home/hudson/jenkins-slave/workspace/hbase-0.96/0.96/hbase-server/target/test-data/77533d68-8dec-42e6-a489-d09d900bb5d7/data/default/testIndexesScanWithOneDeletedRow/afa233e5639f1c22ed5672bc24fd5f7d
  testDurability(org.apache.hadoop.hbase.regionserver.TestHRegion): Failed to set permissions
of path: /home/hudson/jenkins-slave/workspace/hbase-0.96/0.96/hbase-server/target/test-data/8078ad25-e1b5-4ca7-9002-86003b424d65/TestHRegiontestDurability_SYNC_WAL_SYNC_WAL/log/e8630e2c-57ee-45ca-a872-5dcb8671b9f1
to 0777
  testScanner_Wildcard_FromMemStoreAndFiles_EnforceVersions(org.apache.hadoop.hbase.regionserver.TestHRegion):
Unable to create region directory: /home/hudson/jenkins-slave/workspace/hbase-0.96/0.96/hbase-server/target/test-data/4d1e1ab5-62bb-4bee-a66a-54207e2cf7c6/data/default/testScanner_Wildcard_FromMemStoreAndFiles_EnforceVersions/f4f708fa60a2ab67a887eb56fdf18b44
  testIncrWithReadOnlyTable(org.apache.hadoop.hbase.regionserver.TestHRegion): Unable to create
region directory: /home/hudson/jenkins-slave/workspace/hbase-0.96/0.96/hbase-server/target/test-data/640cd69b-1917-4d7d-8382-ef43ccdd0086/data/default/readOnlyTable/0acb7ff89ea4b2906a59e5f38e19803c
  testHolesInMeta(org.apache.hadoop.hbase.regionserver.TestHRegion): Unable to create region
directory: /home/hudson/jenkins-slave/workspace/hbase-0.96/0.96/hbase-server/target/test-data/c5fa0eff-475a-4179-86c5-f06f0cb86f69/data/default/testHolesInMeta/24041ce6372e64cb541975f73c9b8c8d
  testSkipRecoveredEditsReplaySomeIgnored(org.apache.hadoop.hbase.regionserver.TestHRegion):
Unable to create region directory: /home/hudson/jenkins-slave/workspace/hbase-0.96/0.96/hbase-server/target/test-data/52e44cfa-c73a-42bb-8dc5-24b06ae4496d/data/default/testSkipRecoveredEditsReplaySomeIgnored/e62e3bc741ef7ba80e3f824776169a46
  testSkipRecoveredEditsReplay(org.apache.hadoop.hbase.regionserver.TestHRegion): Unable to
create region directory: /home/hudson/jenkins-slave/workspace/hbase-0.96/0.96/hbase-server/target/test-data/d8163d0e-7932-43bb-80e9-e5a4d7eaa3cf/data/default/testSkipRecoveredEditsReplay/26cc54fbbbb13e720b4fe0ca5e8c7b6a
  testWeirdCacheBehaviour(org.apache.hadoop.hbase.regionserver.TestHRegion): Unable to create
region directory: /home/hudson/jenkins-slave/workspace/hbase-0.96/0.96/hbase-server/target/test-data/c4058c58-e364-4a6d-98e8-b663639560f2/data/default/testWeirdCacheBehaviour/f409eaa44ec4ba9ff7c7f3dd7d237e5f
  testCheckAndMutate_WithCorrectValue(org.apache.hadoop.hbase.regionserver.TestHRegion): Unable
to create region directory: /home/hudson/jenkins-slave/workspace/hbase-0.96/0.96/hbase-server/target/test-data/83c5250c-86cf-41f2-808f-01daeb415477/data/default/testCheckAndMutate_WithCorrectValue/78f55c9fe103a979c8551ba69c5bc634
  testCheckAndMutate_WithEmptyRowValue(org.apache.hadoop.hbase.regionserver.TestHRegion):
Unable to create region directory: /home/hudson/jenkins-slave/workspace/hbase-0.96/0.96/hbase-server/target/test-data/3e5970a8-7bbb-450a-83a5-9afd287cd51f/data/default/testCheckAndMutate_WithEmptyRowValue/2ea75060b0ad38ac6b103480766eca83
  testDelete_mixed(org.apache.hadoop.hbase.regionserver.TestHRegion): Unable to create region
directory: /home/hudson/jenkins-slave/workspace/hbase-0.96/0.96/hbase-server/target/test-data/17ac8607-e863-4cab-b0ee-c8428be1a173/data/default/testDelete_mixed/37eb3a81fcb5e976445deedfae776db3
  testFlushCacheWhileScanning(org.apache.hadoop.hbase.regionserver.TestHRegion): Unable to
create region directory: /home/hudson/jenkins-slave/workspace/hbase-0.96/0.96/hbase-server/target/test-data/2aad7a75-4063-4c0d-9fb6-c5ac6e74c5e2/data/default/testFlushCacheWhileScanning/487bdd4aa3f54cdf8d35a060040f1e26
  testCheckAndPut_wrongRowInPut(org.apache.hadoop.hbase.regionserver.TestHRegion): Unable
to create region directory: /home/hudson/jenkins-slave/workspace/hbase-0.96/0.96/hbase-server/target/test-data/5d433671-fb24-47bc-86a0-37045ef06a00/data/default/testCheckAndPut_wrongRowInPut/6dbce0a84178b8310bfa68ba21f01ec1
  testGetScanner_WithNoFamilies(org.apache.hadoop.hbase.regionserver.TestHRegion): Unable
to create region directory: /home/hudson/jenkins-slave/workspace/hbase-0.96/0.96/hbase-server/target/test-data/0ca74464-bef5-4f57-b393-fcbeb50bf9f1/data/default/testGetScanner_WithNoFamilies/79d001ab5fa75747a7eaa495f3f0703a
  testDeleteFamily_PostInsert(org.apache.hadoop.hbase.regionserver.TestHRegion): Unable to
create region directory: /home/hudson/jenkins-slave/workspace/hbase-0.96/0.96/hbase-server/target/test-data/09770dc5-8a2a-48b1-86e1-356de7043db9/data/default/testDeleteFamily_PostInsert/5b31068747f9e3d0c62958f5f4d6702f
  testGetScanner_WithNotOkFamilies(org.apache.hadoop.hbase.regionserver.TestHRegion): Unable
to create region directory: /home/hudson/jenkins-slave/workspace/hbase-0.96/0.96/hbase-server/target/test-data/e9d802c0-4330-4d70-8ba7-b202c7aba7e5/data/default/testGetScanner_WithNotOkFamilies/d165c2190dbd0a68c0312d15c19d1df2
  testgetHDFSBlocksDistribution(org.apache.hadoop.hbase.regionserver.TestHRegion): Cannot
create directory /home/hudson/jenkins-slave/workspace/hbase-0.96/0.96/hbase-server/target/test-data/ff3969f8-611c-4dca-9660-f9c4069f8462/dfscluster_e181269b-0d06-466a-9421-94fe644a45a8/dfs/name1/current
  testAppendWithReadOnlyTable(org.apache.hadoop.hbase.regionserver.TestHRegion): Unable to
create region directory: /home/hudson/jenkins-slave/workspace/hbase-0.96/0.96/hbase-server/target/test-data/7e23168a-ab36-4c87-ae81-c1a0aedda645/data/default/readOnlyTable/484a1320dab0009c86a703c72805cf7e
  testParallelIncrementWithMemStoreFlush(org.apache.hadoop.hbase.regionserver.TestHRegion):
Unable to create region directory: /home/hudson/jenkins-slave/workspace/hbase-0.96/0.96/hbase-server/target/test-data/5ed2b066-b797-428a-a093-3ac4a1fa5e3b/data/default/testParallelIncrementWithMemStoreFlush/64b5c68656b78d34adc0423334027ba1
  testDeleteColumns_PostInsert(org.apache.hadoop.hbase.regionserver.TestHRegion): Unable to
create region directory: /home/hudson/jenkins-slave/workspace/hbase-0.96/0.96/hbase-server/target/test-data/42d2b7f8-8447-4b22-988e-ed8301c1bcb3/data/default/testDeleteColumns_PostInsert/1b14e50c647aa38436987f6c6bee9660
  testPutWithMemStoreFlush(org.apache.hadoop.hbase.regionserver.TestHRegion): Unable to create
region directory: /home/hudson/jenkins-slave/workspace/hbase-0.96/0.96/hbase-server/target/test-data/61d038b4-a472-45e2-8dc6-23c539c82eac/data/default/testPutWithMemStoreFlush/540a6dbf0bd95ba36cea6962179dee46
  testSplitRegion(org.apache.hadoop.hbase.regionserver.TestHRegion): Unable to create region
directory: /home/hudson/jenkins-slave/workspace/hbase-0.96/0.96/hbase-server/target/test-data/f86c1ef2-aeca-488f-9e6e-48a735f1b12e/data/default/testSplitRegion/abaab55e6344f30ee3b9f15e9214ddc5
  testToShowNPEOnRegionScannerReseek(org.apache.hadoop.hbase.regionserver.TestHRegion): Unable
to create region directory: /home/hudson/jenkins-slave/workspace/hbase-0.96/0.96/hbase-server/target/test-data/ec0d4093-8679-466f-8c1e-876692c31f70/data/default/testToShowNPEOnRegionScannerReseek/02f7c698e770e9b29618cb043648cfd7
  testScanner_ExplicitColumns_FromFilesOnly_EnforceVersions(org.apache.hadoop.hbase.regionserver.TestHRegion):
Unable to create region directory: /home/hudson/jenkins-slave/workspace/hbase-0.96/0.96/hbase-server/target/test-data/17eacc0e-323b-48cf-a0ab-b45f9eb25fc3/data/default/testScanner_ExplicitColumns_FromFilesOnly_EnforceVersions/e7a1fdc0994b8de4df82bacd3e378d66
  testScanner_Wildcard_FromFilesOnly_EnforceVersions(org.apache.hadoop.hbase.regionserver.TestHRegion):
Unable to create region directory: /home/hudson/jenkins-slave/workspace/hbase-0.96/0.96/hbase-server/target/test-data/489b5daa-53b6-4c55-b949-23043b9c1be8/data/default/testScanner_Wildcard_FromFilesOnly_EnforceVersions/5032be8da8eb0d06024ec9bb6a7c4de6
  testCheckAndMutate_WithWrongValue(org.apache.hadoop.hbase.regionserver.TestHRegion): Unable
to create region directory: /home/hudson/jenkins-slave/workspace/hbase-0.96/0.96/hbase-server/target/test-data/9f9a13dc-db01-4c48-afe9-48809d0c54da/data/default/testCheckAndMutate_WithWrongValue/166bb32e99fbcf534886a454a31e2a76
  testGet_FamilyChecker(org.apache.hadoop.hbase.regionserver.TestHRegion): Unable to create
region directory: /home/hudson/jenkins-slave/workspace/hbase-0.96/0.96/hbase-server/target/test-data/ed9fcdfe-663f-4ad8-9bae-bbb560b5ead5/data/default/testGet_FamilyChecker/e432cce2c9e95b82c2fa19ed5a427d25
  testScanner_DeleteOneFamilyNotAnother(org.apache.hadoop.hbase.regionserver.TestHRegion):
Unable to create region directory: /home/hudson/jenkins-slave/workspace/hbase-0.96/0.96/hbase-server/target/test-data/1f6fd672-fb80-4cdd-b03b-1ad10121662c/data/default/testScanner_DeleteOneFamilyNotAnother/e805443c8f0fbbca420bb3bd76df5f5b
  testScanner_ExplicitColumns_FromMemStore_EnforceVersions(org.apache.hadoop.hbase.regionserver.TestHRegion):
Unable to create region directory: /home/hudson/jenkins-slave/workspace/hbase-0.96/0.96/hbase-server/target/test-data/8c51f4cb-62a0-4d68-9fe7-ee96984a9778/data/default/testScanner_ExplicitColumns_FromMemStore_EnforceVersions/0efaede51b6ebc317156582f191905c0
  testGet_Basic(org.apache.hadoop.hbase.regionserver.TestHRegion): Unable to create region
directory: /home/hudson/jenkins-slave/workspace/hbase-0.96/0.96/hbase-server/target/test-data/16072539-a6fc-422b-9b36-6e8bbbcbde9d/data/default/testGet_Basic/26e06447eb5beeac7d5b4b1599b466fe
  testGet_Empty(org.apache.hadoop.hbase.regionserver.TestHRegion): Unable to create region
directory: /home/hudson/jenkins-slave/workspace/hbase-0.96/0.96/hbase-server/target/test-data/eda8c284-8e84-4376-881c-218b683dc254/data/default/testGet_Empty/4c3c88ee333b28c2f6e15991085169e7
  testCompactionAffectedByScanners(org.apache.hadoop.hbase.regionserver.TestHRegion): Unable
to create region directory: /home/hudson/jenkins-slave/workspace/hbase-0.96/0.96/hbase-server/target/test-data/060cad52-d255-45a5-b9ba-c6562c96fde7/data/default/testCompactionAffectedByScanners/b89422f8bee4be0f37b0a038ce3481ed
  testDeleteRowWithBloomFilter(org.apache.hadoop.hbase.regionserver.TestHRegion): Unable to
create region directory: /home/hudson/jenkins-slave/workspace/hbase-0.96/0.96/hbase-server/target/test-data/e90298db-4d13-4635-9634-b14a6017aa20/data/default/testDeleteRowWithBloomFilter/1016067f808b1a231506fca05295aca7
  testScanner_ExplicitColumns_FromMemStoreAndFiles_EnforceVersions(org.apache.hadoop.hbase.regionserver.TestHRegion):
Unable to create region directory: /home/hudson/jenkins-slave/workspace/hbase-0.96/0.96/hbase-server/target/test-data/7d2f9054-6552-44d2-9f47-e69d0a5d48c5/data/default/testScanner_ExplicitColumns_FromMemStoreAndFiles_EnforceVersions/f6049ea148d7f112c2115b90632f32a2
  testScanner_JoinedScanners(org.apache.hadoop.hbase.regionserver.TestHRegion): Unable to
create region directory: /home/hudson/jenkins-slave/workspace/hbase-0.96/0.96/hbase-server/target/test-data/7323d6e3-4f09-41b5-9607-75230861a5e2/data/default/testScanner_JoinedScanners/34ed9d74cf6a84168999d876cd6203c4
  testCheckAndDelete_ThatDeleteWasWritten(org.apache.hadoop.hbase.regionserver.TestHRegion):
Unable to create region directory: /home/hudson/jenkins-slave/workspace/hbase-0.96/0.96/hbase-server/target/test-data/7547a986-1946-4061-9f37-9099926fb1b2/data/default/testCheckAndDelete_ThatDeleteWasWritten/cd5a35f980fc67d6e6e68581ec5b50b3
  org.apache.hadoop.hbase.client.TestClientTimeouts: Cannot create directory /home/hudson/jenkins-slave/workspace/hbase-0.96/0.96/hbase-server/target/test-data/59607a5e-fb59-48ba-8a75-a572aa34784e/dfscluster_6b8c3280-4bcb-4f01-9863-da04cac0fe8e/dfs/name1/current
  org.apache.hadoop.hbase.client.replication.TestReplicationAdmin: Unable to create data directory
/home/hudson/jenkins-slave/workspace/hbase-0.96/0.96/hbase-server/target/test-data/6288f617-d6e7-4808-8512-91a7bb83bdf9/dfscluster_159778cb-7af8-4e9c-bc65-36884626cfb3/zookeeper_0/version-2
  org.apache.hadoop.hbase.client.TestTimestampsFilter: Cannot create directory /home/hudson/jenkins-slave/workspace/hbase-0.96/0.96/hbase-server/target/test-data/9de954b4-45fd-48e9-9ef6-b8611b89e606/dfscluster_84c02fe4-f99f-49ba-8f39-f68bf6914ba5/dfs/name1/current
  org.apache.hadoop.hbase.client.TestMultipleTimestamps: Cannot create directory /home/hudson/jenkins-slave/workspace/hbase-0.96/0.96/hbase-server/target/test-data/b9acd199-5eb5-419c-b5c4-008ebfa297c2/dfscluster_07a772f8-fd47-4d40-8281-af4b0a81bb25/dfs/name1/current
  org.apache.hadoop.hbase.client.TestFromClientSide: Cannot create directory /home/hudson/jenkins-slave/workspace/hbase-0.96/0.96/hbase-server/target/test-data/dd006944-0333-48e1-a6ab-530b35bc7567/dfscluster_febc5d75-cc05-41bf-a40c-1423e2128b4f/dfs/name1/current
  org.apache.hadoop.hbase.client.TestFromClientSideNoCodec: Cannot create directory /home/hudson/jenkins-slave/workspace/hbase-0.96/0.96/hbase-server/target/test-data/88e8d4e1-e3c6-4044-9b82-a37dd74c73c1/dfscluster_9879727f-cb56-4bee-9eda-819d60595184/dfs/name1/current
  testWithMultiRegion(org.apache.hadoop.hbase.client.TestTableSnapshotScanner): Cannot create
directory /home/hudson/jenkins-slave/workspace/hbase-0.96/0.96/hbase-server/target/test-data/8f9884f0-dc05-4593-9c20-757fa4239f56/dfscluster_938f22de-c3d3-4728-b807-d4628d2516db/dfs/name1/current
  testWithSingleRegion(org.apache.hadoop.hbase.client.TestTableSnapshotScanner): Cannot create
directory /home/hudson/jenkins-slave/workspace/hbase-0.96/0.96/hbase-server/target/test-data/cccb60bf-8f32-434c-890b-5352028ef186/dfscluster_4248affd-3fd5-4a5f-bceb-df84405de6da/dfs/name1/current
  testWithOfflineHBaseMultiRegion(org.apache.hadoop.hbase.client.TestTableSnapshotScanner):
Cannot create directory /home/hudson/jenkins-slave/workspace/hbase-0.96/0.96/hbase-server/target/test-data/11bdb81b-e05a-425f-a07e-84af022a7066/dfscluster_1465fb18-ffd2-4abb-9836-953aa525ab58/dfs/name1/current
  org.apache.hadoop.hbase.client.TestHTableMultiplexer: Cannot create directory /home/hudson/jenkins-slave/workspace/hbase-0.96/0.96/hbase-server/target/test-data/2b3d4252-3ea1-4885-a040-cd4d29a7e6ab/dfscluster_83e6c43a-0e5d-45ff-ba61-d2aa90869fac/dfs/name1/current
  org.apache.hadoop.hbase.client.TestHCM: Cannot create directory /home/hudson/jenkins-slave/workspace/hbase-0.96/0.96/hbase-server/target/test-data/451546ed-47dd-46b9-a371-4033c4df8664/dfscluster_9baa74ed-41be-444b-a314-17af749f606a/dfs/name1/current
  org.apache.hadoop.hbase.client.TestFromClientSide3: Cannot create directory /home/hudson/jenkins-slave/workspace/hbase-0.96/0.96/hbase-server/target/test-data/683d1728-804b-4bb1-863e-da8814011877/dfscluster_c1e4c875-9ebc-4dd4-a2f4-77088145783a/dfs/name1/current
  org.apache.hadoop.hbase.client.TestHTablePool$TestHTableThreadLocalPool: Cannot create directory
/home/hudson/jenkins-slave/workspace/hbase-0.96/0.96/hbase-server/target/test-data/0fc6ca56-a4f4-4f61-aabf-b1e891d8fbc4/dfscluster_91bc519e-08ca-428a-bc7f-2096e037fb25/dfs/name1/current
  org.apache.hadoop.hbase.client.TestHTablePool$TestHTableReusablePool: Cannot create directory
/home/hudson/jenkins-slave/workspace/hbase-0.96/0.96/hbase-server/target/test-data/0fc6ca56-a4f4-4f61-aabf-b1e891d8fbc4/dfscluster_91bc519e-08ca-428a-bc7f-2096e037fb25/dfs/name1/current
  org.apache.hadoop.hbase.client.TestHTableUtil: Cannot create directory /home/hudson/jenkins-slave/workspace/hbase-0.96/0.96/hbase-server/target/test-data/2ab82d63-0f3f-4209-97d8-6c4d1c3feb47/dfscluster_89925bb6-d246-4f52-af12-ef5ca1203fc5/dfs/name1/current
  org.apache.hadoop.hbase.client.TestAdmin: Cannot create directory /home/hudson/jenkins-slave/workspace/hbase-0.96/0.96/hbase-server/target/test-data/ea61fa05-4dc8-4130-a79b-b3b23cac3ba1/dfscluster_cd19e9d2-831a-4c38-b8db-3841df377183/dfs/name1/current
  org.apache.hadoop.hbase.client.TestSnapshotFromClient: Cannot create directory /home/hudson/jenkins-slave/workspace/hbase-0.96/0.96/hbase-server/target/test-data/11eeaf7a-b1bb-42df-bc28-8b0d8b6a41c0/dfscluster_9039113b-bd8b-474d-bd7d-069583c57590/dfs/name1/current
  org.apache.hadoop.hbase.client.TestScannerTimeout: Cannot create directory /home/hudson/jenkins-slave/workspace/hbase-0.96/0.96/hbase-server/target/test-data/b95bad53-ba28-47e4-987e-fa66f483fb15/dfscluster_cf839875-ea00-48d7-b519-c69e36a49a31/dfs/name1/current
  testConcurrentMetaScannerAndCatalogJanitor(org.apache.hadoop.hbase.client.TestMetaScanner):
Cannot create directory /home/hudson/jenkins-slave/workspace/hbase-0.96/0.96/hbase-server/target/test-data/a3ddc0af-63d7-4b99-9caa-f7f8dd0d893c/dfscluster_90ebad2d-77f4-4af7-b64f-c5b4e79af35a/dfs/name1/current
  testMetaScanner(org.apache.hadoop.hbase.client.TestMetaScanner): Cannot create directory
/home/hudson/jenkins-slave/workspace/hbase-0.96/0.96/hbase-server/target/test-data/a3ddc0af-63d7-4b99-9caa-f7f8dd0d893c/dfscluster_90ebad2d-77f4-4af7-b64f-c5b4e79af35a/dfs/name1/image
  org.apache.hadoop.hbase.client.TestCloneSnapshotFromClient: Cannot create directory /home/hudson/jenkins-slave/workspace/hbase-0.96/0.96/hbase-server/target/test-data/26f91a46-ba9c-40ea-9a98-87b99f7cea71/dfscluster_ed8e1fef-0660-43fe-b71a-1541b47b59bc/dfs/name1/current
  org.apache.hadoop.hbase.client.TestScannersFromClientSide: Cannot create directory /home/hudson/jenkins-slave/workspace/hbase-0.96/0.96/hbase-server/target/test-data/9fe7bc4d-fc2e-4836-83f5-a69983e53bdc/dfscluster_37beec5d-9f3e-401d-b301-04b2d2b00ada/dfs/name1/current
  org.apache.hadoop.hbase.client.TestMultiParallel: Cannot create directory /home/hudson/jenkins-slave/workspace/hbase-0.96/0.96/hbase-server/target/test-data/c46c3040-5d12-42bf-8d74-73d1fda0aa0c/dfscluster_a93c42cd-007d-47a3-bbd2-a9b5fc67f1bd/dfs/name1/current
  org.apache.hadoop.hbase.TestMultiVersions: Cannot create directory /home/hudson/jenkins-slave/workspace/hbase-0.96/0.96/hbase-server/target/test-data/c5b36c3d-5e6c-4229-aca9-9b4582c317e3/dfscluster_2502a847-f79e-4cc4-98a9-5aa0fe6dcea4/dfs/name1/current
  testBasicRollingRestart(org.apache.hadoop.hbase.master.TestRollingRestart): Cannot create
directory /home/hudson/jenkins-slave/workspace/hbase-0.96/0.96/hbase-server/target/test-data/3e8f3c23-103a-4c6e-9f50-b72a447bdc82/dfscluster_852d20b1-eb3f-408a-b776-dbd04d677122/dfs/name1/current
  org.apache.hadoop.hbase.master.TestActiveMasterManager: Unable to create data directory
/home/hudson/jenkins-slave/workspace/hbase-0.96/0.96/hbase-server/target/test-data/e0f35de3-2db3-4551-9898-08decc84e587/dfscluster_c1564212-0a8c-4584-b95b-48caee7c65a4/zookeeper_0/version-2
  org.apache.hadoop.hbase.master.TestRegionPlacement: Cannot create directory /home/hudson/jenkins-slave/workspace/hbase-0.96/0.96/hbase-server/target/test-data/0a7a5570-4134-48f3-a8e0-91957c8566a1/dfscluster_53ff724e-ae41-4fcf-846d-82e89c783eaa/dfs/name1/current
  org.apache.hadoop.hbase.master.TestMasterNoCluster: Unable to create data directory /home/hudson/jenkins-slave/workspace/hbase-0.96/0.96/hbase-server/target/test-data/823f020f-8182-4ff8-b635-107820bd52bf/dfscluster_9977d556-e84d-4119-bb14-3e5e4dced8d7/zookeeper_0/version-2
  org.apache.hadoop.hbase.master.TestMasterMetrics: Cannot create directory /home/hudson/jenkins-slave/workspace/hbase-0.96/0.96/hbase-server/target/test-data/b177c5fe-2250-4374-b9d6-d088e46943f5/dfscluster_d769d4fb-20ba-4dd5-9f63-9118702261ab/dfs/name1/current
  org.apache.hadoop.hbase.master.TestZKBasedOpenCloseRegion: Cannot create directory /home/hudson/jenkins-slave/workspace/hbase-0.96/0.96/hbase-server/target/test-data/97a77c30-6023-4a9a-b7cb-473669c1571c/dfscluster_c48180c9-a51e-4744-907c-b7a2f27bc7d7/dfs/name1/current
  org.apache.hadoop.hbase.master.TestMasterFileSystem: Cannot create directory /home/hudson/jenkins-slave/workspace/hbase-0.96/0.96/hbase-server/target/test-data/e7f18583-558c-4fc7-b4f3-15785c275f2a/dfscluster_ac50a1ef-f0cd-47a9-a87c-f81b6ff7c117/dfs/name1/current
  testCreateTableWithSplitRegion(org.apache.hadoop.hbase.master.handler.TestCreateTableHandler):
Cannot create directory /home/hudson/jenkins-slave/workspace/hbase-0.96/0.96/hbase-server/target/test-data/9d3b0934-280d-48f8-b647-ec68f4fe8b3c/dfscluster_f01cabca-09b4-4178-9e1a-16880646801d/dfs/name1/current
  testMasterRestartAfterEnablingNodeIsCreated(org.apache.hadoop.hbase.master.handler.TestCreateTableHandler):
Cannot create directory /home/hudson/jenkins-slave/workspace/hbase-0.96/0.96/hbase-server/target/test-data/9d3b0934-280d-48f8-b647-ec68f4fe8b3c/dfscluster_f01cabca-09b4-4178-9e1a-16880646801d/dfs/name1/current
  testCreateTableCalledTwiceAndFirstOneInProgress(org.apache.hadoop.hbase.master.handler.TestCreateTableHandler):
Cannot create directory /home/hudson/jenkins-slave/workspace/hbase-0.96/0.96/hbase-server/target/test-data/9d3b0934-280d-48f8-b647-ec68f4fe8b3c/dfscluster_f01cabca-09b4-4178-9e1a-16880646801d/dfs/name1/current
  org.apache.hadoop.hbase.master.handler.TestTableDescriptorModification: Cannot create directory
/home/hudson/jenkins-slave/workspace/hbase-0.96/0.96/hbase-server/target/test-data/73de6b5e-14ba-4a66-a6a9-45809c12a786/dfscluster_0eaa2267-4f1c-4c30-aff4-021f50e10b06/dfs/name1/current
  org.apache.hadoop.hbase.master.TestMaster: Cannot create directory /home/hudson/jenkins-slave/workspace/hbase-0.96/0.96/hbase-server/target/test-data/aa52f610-23b4-43ba-a2b7-39a12c4ec73d/dfscluster_3844b5a5-504f-42b9-98e4-54d2c18511db/dfs/name1/current
  org.apache.hadoop.hbase.master.TestMasterTransitions: Cannot create directory /home/hudson/jenkins-slave/workspace/hbase-0.96/0.96/hbase-server/target/test-data/65a7854f-ac1c-422b-8ecd-b1df2ca081e6/dfscluster_5866480b-f632-48f1-a8c0-e078c6e7f22f/dfs/name1/current
  testShouldNotCompeleteOpenedRegionSuccessfullyIfVersionMismatches(org.apache.hadoop.hbase.master.TestOpenedRegionHandler):
Unable to create data directory /home/hudson/jenkins-slave/workspace/hbase-0.96/0.96/hbase-server/target/test-data/7a96a473-e677-435a-9af4-0eaca710293a/dfscluster_cd7bfca2-ef87-41aa-a6d5-252aecc3de36/zookeeper_0/version-2
  testOpenedRegionHandlerOnMasterRestart(org.apache.hadoop.hbase.master.TestOpenedRegionHandler):
Cannot create directory /home/hudson/jenkins-slave/workspace/hbase-0.96/0.96/hbase-server/target/test-data/6906f541-50a6-43bc-89c2-0e9ba90f22b6/dfscluster_e2e3e2e3-4601-456a-b774-efa41cb217ca/dfs/name1/current
  org.apache.hadoop.hbase.master.snapshot.TestSnapshotFileCache: Cannot create directory /home/hudson/jenkins-slave/workspace/hbase-0.96/0.96/hbase-server/target/test-data/f3b8bb49-44c8-4df3-91d6-908aad60e306/dfscluster_9d60c97f-ae13-433e-9457-f3cd7158afd2/dfs/name1/current
  testTaskErr(org.apache.hadoop.hbase.master.TestSplitLogManager)
  testMultipleResubmits(org.apache.hadoop.hbase.master.TestSplitLogManager)
  testTaskResigned(org.apache.hadoop.hbase.master.TestSplitLogManager)
  testVanishingTaskZNode(org.apache.hadoop.hbase.master.TestSplitLogManager)
  testUnassignedOrphan(org.apache.hadoop.hbase.master.TestSplitLogManager)
  testRecoveryRegionRemovedFromZK(org.apache.hadoop.hbase.master.TestSplitLogManager)
  testWorkerCrash(org.apache.hadoop.hbase.master.TestSplitLogManager)
  testTaskDone(org.apache.hadoop.hbase.master.TestSplitLogManager)
  testEmptyLogDir(org.apache.hadoop.hbase.master.TestSplitLogManager)
  testOrphanTaskAcquisition(org.apache.hadoop.hbase.master.TestSplitLogManager)
  testUnassignedTimeout(org.apache.hadoop.hbase.master.TestSplitLogManager)
  testTaskCreation(org.apache.hadoop.hbase.master.TestSplitLogManager)
  testDeadWorker(org.apache.hadoop.hbase.master.TestSplitLogManager)
  testRescanCleanup(org.apache.hadoop.hbase.master.TestSplitLogManager)
  org.apache.hadoop.hbase.master.TestAssignmentManagerOnCluster: Cannot create directory /home/hudson/jenkins-slave/workspace/hbase-0.96/0.96/hbase-server/target/test-data/27a3c35f-fabf-436e-8403-f96b43e00131/dfscluster_5acd938c-114a-4091-b386-e00fb6dd0369/dfs/name1/current
  org.apache.hadoop.hbase.master.TestMasterMetricsWrapper: Cannot create directory /home/hudson/jenkins-slave/workspace/hbase-0.96/0.96/hbase-server/target/test-data/988aa8bf-8a39-4a53-b863-50e245fc3b1b/dfscluster_59d512d5-d63d-4d1d-81eb-3d38d8b4bd1f/dfs/name1/current
  testForCheckingIfEnableAndDisableWorksFineAfterSwitch(org.apache.hadoop.hbase.master.TestMasterRestartAfterDisablingTable):
Cannot create directory /home/hudson/jenkins-slave/workspace/hbase-0.96/0.96/hbase-server/target/test-data/93dbed36-4364-4040-b604-fb303fc0d7df/dfscluster_7026c570-93a9-4dc9-af09-58a8ac66b2ef/dfs/name1/current
  testTableReadLock(org.apache.hadoop.hbase.master.TestTableLockManager): Cannot create directory
/home/hudson/jenkins-slave/workspace/hbase-0.96/0.96/hbase-server/target/test-data/cdf48db0-f06b-437d-87ac-1f1b3ae41747/dfscluster_c3870758-c7f4-440c-ab5c-2795a7c86afa/dfs/name1/current
  testAlterAndDisable(org.apache.hadoop.hbase.master.TestTableLockManager): Cannot create
directory /home/hudson/jenkins-slave/workspace/hbase-0.96/0.96/hbase-server/target/test-data/00550180-7602-4eaa-877e-f81d4a2c5477/dfscluster_b080c1a8-0855-48ea-9a90-1df999d948b0/dfs/name1/current
  testReapAllTableLocks(org.apache.hadoop.hbase.master.TestTableLockManager): Unable to create
data directory /home/hudson/jenkins-slave/workspace/hbase-0.96/0.96/hbase-server/target/test-data/d8d89f47-1fc7-4690-ab3d-de20170f081d/dfscluster_803036a9-5897-4421-ba06-8d4d96791772/zookeeper_0/version-2
  testDelete(org.apache.hadoop.hbase.master.TestTableLockManager): Cannot create directory
/home/hudson/jenkins-slave/workspace/hbase-0.96/0.96/hbase-server/target/test-data/223e3d88-f800-4c45-ab33-0b60860f9b65/dfscluster_d4aff6eb-4c19-4d39-8336-3df2dded3ee6/dfs/name1/current
  testLockTimeoutException(org.apache.hadoop.hbase.master.TestTableLockManager): Cannot create
directory /home/hudson/jenkins-slave/workspace/hbase-0.96/0.96/hbase-server/target/test-data/043dfb19-69c1-43d8-a806-fd93659cc85a/dfscluster_bf663522-d9a5-4987-9757-d75ed9537793/dfs/name1/current
  org.apache.hadoop.hbase.master.TestAssignmentManager: Unable to create data directory /home/hudson/jenkins-slave/workspace/hbase-0.96/0.96/hbase-server/target/test-data/d475313d-9607-4c18-9b31-4c7dac9d5136/dfscluster_59338152-e68d-499a-9a45-6b31cf1079dd/zookeeper_0/version-2
  org.apache.hadoop.hbase.master.TestDistributedLogSplitting: Cannot create directory /home/hudson/jenkins-slave/workspace/hbase-0.96/0.96/hbase-server/target/test-data/cd789cab-eb13-456c-aa45-a4aef4deba6c/dfscluster_1605d9d4-ba4e-4abe-bc91-ef5badc39478/dfs/name1/current
  testRPCException(org.apache.hadoop.hbase.master.TestHMasterRPCException): Unable to create
data directory /home/hudson/jenkins-slave/workspace/hbase-0.96/0.96/hbase-server/target/test-data/5d832c1a-a14b-4257-9ccb-ddbd1f4cac4c/dfscluster_dec3998e-250b-4310-8968-1938b3286083/zookeeper_0/version-2
  testOfflineRegionReAssginedAfterMasterRestart(org.apache.hadoop.hbase.master.TestMasterFailover):
Cannot create directory /home/hudson/jenkins-slave/workspace/hbase-0.96/0.96/hbase-server/target/test-data/4d777643-e0dc-43a6-a2d4-caa656a66a55/dfscluster_7c6d7431-4891-4256-820a-e752e619c30d/dfs/name1/current
  testMasterFailoverWithMockedRITOnDeadRS(org.apache.hadoop.hbase.master.TestMasterFailover):
Cannot create directory /home/hudson/jenkins-slave/workspace/hbase-0.96/0.96/hbase-server/target/test-data/2ee6d5df-0472-4c82-aaa6-4cae9ad07231/dfscluster_af43dc00-7041-4673-97fb-48efc059d15f/dfs/name1/current
  testMasterFailoverWithMockedRIT(org.apache.hadoop.hbase.master.TestMasterFailover): Cannot
create directory /home/hudson/jenkins-slave/workspace/hbase-0.96/0.96/hbase-server/target/test-data/20b14179-43ad-47ca-b305-6bffb1589b93/dfscluster_59a4c2e2-3a21-4508-9221-893ad7fc1f19/dfs/name1/current
  testShouldCheckMasterFailOverWhenMETAIsInOpenedState(org.apache.hadoop.hbase.master.TestMasterFailover):
Cannot create directory /home/hudson/jenkins-slave/workspace/hbase-0.96/0.96/hbase-server/target/test-data/b1199feb-310c-457d-8383-ffc0284a979f/dfscluster_8761012e-6ca3-4a61-b423-db7038ad8f05/dfs/name1/current
  testSimpleMasterFailover(org.apache.hadoop.hbase.master.TestMasterFailover): Cannot create
directory /home/hudson/jenkins-slave/workspace/hbase-0.96/0.96/hbase-server/target/test-data/c75681cf-47a3-4fb5-8f0e-70be799c3f11/dfscluster_d784d784-c0cf-44d5-9979-00a2a26e7261/dfs/name1/current
  testMasterShutdown(org.apache.hadoop.hbase.master.TestMasterShutdown): Cannot create directory
/home/hudson/jenkins-slave/workspace/hbase-0.96/0.96/hbase-server/target/test-data/8d163cca-fef2-4454-8a8f-cf1715ed8661/dfscluster_5ba3c975-1969-4312-b3c8-993a8a622e37/dfs/name1/current
  testMasterShutdownBeforeStartingAnyRegionServer(org.apache.hadoop.hbase.master.TestMasterShutdown):
Cannot create directory /home/hudson/jenkins-slave/workspace/hbase-0.96/0.96/hbase-server/target/test-data/48f44583-5a22-4a74-8ab5-d7320200317b/dfscluster_7fc4b163-dc59-43c0-9a06-6648a77a0af1/dfs/name1/current
  org.apache.hadoop.hbase.master.cleaner.TestHFileCleaner: Cannot create directory /home/hudson/jenkins-slave/workspace/hbase-0.96/0.96/hbase-server/target/test-data/1ab00693-e28d-485f-bf71-408a884feb47/dfscluster_1545a6ef-a640-4134-8d85-9f909b54f270/dfs/name1/current
  org.apache.hadoop.hbase.master.cleaner.TestLogsCleaner: Unable to create data directory
/home/hudson/jenkins-slave/workspace/hbase-0.96/0.96/hbase-server/target/test-data/74600315-a9eb-4ae5-bbbb-036ac656c047/dfscluster_1bf44de9-829f-4ebb-94df-9a3351afd37c/zookeeper_0/version-2
  org.apache.hadoop.hbase.master.cleaner.TestSnapshotFromMaster: Cannot create directory /home/hudson/jenkins-slave/workspace/hbase-0.96/0.96/hbase-server/target/test-data/6e4cf3c6-81cc-4936-ab18-b5893a371b36/dfscluster_e37a56f7-14a9-4049-a582-6799289e13b6/dfs/name1/current
  testMasterFailoverBalancerPersistence(org.apache.hadoop.hbase.master.TestMasterFailoverBalancerPersistence):
Cannot create directory /home/hudson/jenkins-slave/workspace/hbase-0.96/0.96/hbase-server/target/test-data/58a7b3fa-0aed-43ba-8b75-377b22285ca0/dfscluster_96d09962-8b3b-4a12-96fa-537c98036dc3/dfs/name1/current
  testRestartClusterAfterKill(org.apache.hadoop.hbase.master.TestRestartCluster): Unable to
create data directory /home/hudson/jenkins-slave/workspace/hbase-0.96/0.96/hbase-server/target/test-data/f5205179-227a-42f4-ad07-9065ea86d687/dfscluster_1cafa070-e1ef-4d9a-8f36-51f508798eec/zookeeper_0/version-2
  testClusterRestart(org.apache.hadoop.hbase.master.TestRestartCluster): Cannot create directory
/home/hudson/jenkins-slave/workspace/hbase-0.96/0.96/hbase-server/target/test-data/737aafa8-c161-4d77-b794-7c97fab4a2a9/dfscluster_7942b905-d065-48c8-be82-315f469417f0/dfs/name1/current
  org.apache.hadoop.hbase.migration.TestNamespaceUpgrade: Unable to create data directory
/home/hudson/jenkins-slave/workspace/hbase-0.96/0.96/hbase-server/target/test-data/58710ed8-0e7a-4580-9a1a-b8dcdb620a26/dfscluster_cccfd1bc-8f92-4f90-aab3-d6c1d6d9faf5/zookeeper_0/version-2
  org.apache.hadoop.hbase.migration.TestUpgradeTo96: Unable to create data directory /home/hudson/jenkins-slave/workspace/hbase-0.96/0.96/hbase-server/target/test-data/a307b689-160b-4904-a006-defe38e352b3/dfscluster_24fd65dd-7330-4ab6-8d2f-c3127f767d32/zookeeper_0/version-2
  testRebalanceOnRegionServerNumberChange[0](org.apache.hadoop.hbase.TestRegionRebalancing):
Cannot create directory /home/hudson/jenkins-slave/workspace/hbase-0.96/0.96/hbase-server/target/test-data/e5148209-a22a-42d4-aa8a-7eb29c5dc82e/dfscluster_21debded-f865-4c29-b347-377a2eae89ee/dfs/name1/current
  testRebalanceOnRegionServerNumberChange[1](org.apache.hadoop.hbase.TestRegionRebalancing):
Cannot create directory /home/hudson/jenkins-slave/workspace/hbase-0.96/0.96/hbase-server/target/test-data/18dcac78-e815-44dd-b995-e8edae1b6a1b/dfscluster_26cf8069-863e-40bf-aa05-61b3db250aa0/dfs/name1/current
  testMixedAtomicity(org.apache.hadoop.hbase.TestAcidGuarantees): Cannot create directory
/home/hudson/jenkins-slave/workspace/hbase-0.96/0.96/hbase-server/target/test-data/04d5eac0-d3dc-45cf-b5ea-80050de539d6/dfscluster_80cbcd77-37a2-46d2-8c0c-5dbf83f251a2/dfs/name1/current
  testGetAtomicity(org.apache.hadoop.hbase.TestAcidGuarantees): Cannot create directory /home/hudson/jenkins-slave/workspace/hbase-0.96/0.96/hbase-server/target/test-data/51a02971-cec4-40ae-a350-1dd44a83ba88/dfscluster_748531a5-2c29-41f4-b36f-b81695ace1c7/dfs/name1/current
  testScanAtomicity(org.apache.hadoop.hbase.TestAcidGuarantees): Cannot create directory /home/hudson/jenkins-slave/workspace/hbase-0.96/0.96/hbase-server/target/test-data/8392fbfe-6340-4609-a9db-cb8aaf0b07fe/dfscluster_be060aab-6761-4f9d-bc46-60dfc0b44560/dfs/name1/current
  org.apache.hadoop.hbase.TestZooKeeper: Cannot create directory /home/hudson/jenkins-slave/workspace/hbase-0.96/0.96/hbase-server/target/test-data/297aa35f-ab92-47a2-8460-3934ddc93c59/dfscluster_6d427e2e-743d-43d8-81c2-14215bb327d7/dfs/name1/current
  org.apache.hadoop.hbase.TestInfoServers: Cannot create directory /home/hudson/jenkins-slave/workspace/hbase-0.96/0.96/hbase-server/target/test-data/59c1a27d-a3bb-4a1e-ac0a-ad6560d5686e/dfscluster_7a5802fe-490e-4217-8423-abefdbcf8116/dfs/name1/current
  testFencingAroundCompaction(org.apache.hadoop.hbase.TestIOFencing): Cannot create directory
/home/hudson/jenkins-slave/workspace/hbase-0.96/0.96/hbase-server/target/test-data/b6cf7d01-0c98-4166-86c2-8774f8304327/dfscluster_521771a6-8a92-48af-a185-8650d5a2fd9f/dfs/name1/current
  testFencingAroundCompactionAfterWALSync(org.apache.hadoop.hbase.TestIOFencing): A mini-cluster
is already running
  org.apache.hadoop.hbase.procedure.TestZKProcedureControllers: Unable to create data directory
/home/hudson/jenkins-slave/workspace/hbase-0.96/0.96/hbase-server/target/test-data/8e82793d-fcec-4e45-98a4-d747cfa09ba1/dfscluster_7e042e38-1ee9-4453-b99f-5369a8d5d8ef/zookeeper_0/version-2
  org.apache.hadoop.hbase.procedure.TestZKProcedure: Unable to create data directory /home/hudson/jenkins-slave/workspace/hbase-0.96/0.96/hbase-server/target/test-data/afe0b2a3-52b1-4503-be27-03af86446f51/dfscluster_91b6172f-5738-475b-aa69-5cff02f84dc4/zookeeper_0/version-2

Tests run: 1144, Failures: 16, Errors: 176, Skipped: 9

[INFO] ------------------------------------------------------------------------
[INFO] Reactor Summary:
[INFO] 
[INFO] HBase ............................................. SUCCESS [20.138s]
[INFO] HBase - Common .................................... SUCCESS [34.873s]
[INFO] HBase - Protocol .................................. SUCCESS [10.775s]
[INFO] HBase - Client .................................... SUCCESS [40.111s]
[INFO] HBase - Hadoop Compatibility ...................... SUCCESS [6.420s]
[INFO] HBase - Hadoop One Compatibility .................. SUCCESS [1.963s]
[INFO] HBase - Prefix Tree ............................... SUCCESS [3.204s]
[INFO] HBase - Server .................................... FAILURE [2:44:20.406s]
[INFO] HBase - Testing Util .............................. SKIPPED
[INFO] HBase - Thrift .................................... SKIPPED
[INFO] HBase - Shell ..................................... SKIPPED
[INFO] HBase - Integration Tests ......................... SKIPPED
[INFO] HBase - Examples .................................. SKIPPED
[INFO] HBase - Assembly .................................. SKIPPED
[INFO] ------------------------------------------------------------------------
[INFO] BUILD FAILURE
[INFO] ------------------------------------------------------------------------
[INFO] Total time: 2:46:18.966s
[INFO] Finished at: Tue Mar 11 20:06:27 UTC 2014
[INFO] Final Memory: 66M/475M
[INFO] ------------------------------------------------------------------------
[ERROR] Failed to execute goal org.apache.maven.plugins:maven-surefire-plugin:2.12-TRUNK-HBASE-2:test
(secondPartTestsExecution) on project hbase-server: Failure or timeout -> [Help 1]
[ERROR] 
[ERROR] To see the full stack trace of the errors, re-run Maven with the -e switch.
[ERROR] Re-run Maven using the -X switch to enable full debug logging.
[ERROR] 
[ERROR] For more information about the errors and possible solutions, please read the following
articles:
[ERROR] [Help 1] http://cwiki.apache.org/confluence/display/MAVEN/MojoExecutionException
[ERROR] 
[ERROR] After correcting the problems, you can resume the build with the command
[ERROR]   mvn <goals> -rf :hbase-server
Build step 'Invoke top-level Maven targets' marked build as failure
Performing Post build task...
Match found for :.* : True
Logical operation result is TRUE
Running script  :   ZOMBIE_TESTS_COUNT=`jps | grep surefirebooter | wc -l`
  if [[ $ZOMBIE_TESTS_COUNT != 0 ]] ; then
    #It seems sometimes the tests are not dying immediately. Let's give them 10s
    echo "Suspicious java process found - waiting 10s to see if there are just slow to stop"
    sleep 10
    ZOMBIE_TESTS_COUNT=`jps | grep surefirebooter | wc -l`
    if [[ $ZOMBIE_TESTS_COUNT != 0 ]] ; then
      echo "There are $ZOMBIE_TESTS_COUNT zombie tests, they should have been killed by surefire
but survived"
      echo "************ BEGIN zombies jstack extract"
      ZB_STACK=`jps | grep surefirebooter | cut -d ' ' -f 1 | xargs -n 1 jstack | grep ".test"
| grep "\.java"`
      jps | grep surefirebooter | cut -d ' ' -f 1 | xargs -n 1 jstack
      echo "************ END  zombies jstack extract"
      JIRA_COMMENT="$JIRA_COMMENT

     {color:red}-1 core zombie tests{color}.  There are ${ZOMBIE_TESTS_COUNT} zombie test(s):
${ZB_STACK}"
      BAD=1
      jps | grep surefirebooter | cut -d ' ' -f 1 | xargs kill -9
    else
      echo "We're ok: there is no zombie test, but some tests took some time to stop"
    fi
  else
    echo "We're ok: there is no zombie test"
  fi
[hbase-0.96] $ /bin/bash -xe /tmp/hudson5902464114017797923.sh
++ jps
++ grep surefirebooter
++ wc -l
+ ZOMBIE_TESTS_COUNT=4
+ [[ 4 != 0 ]]
+ echo 'Suspicious java process found - waiting 10s to see if there are just slow to stop'
Suspicious java process found - waiting 10s to see if there are just slow to stop
+ sleep 10
++ jps
++ grep surefirebooter
++ wc -l
+ ZOMBIE_TESTS_COUNT=2
+ [[ 2 != 0 ]]
+ echo 'There are 2 zombie tests, they should have been killed by surefire but survived'
There are 2 zombie tests, they should have been killed by surefire but survived
+ echo '************ BEGIN zombies jstack extract'
************ BEGIN zombies jstack extract
++ jps
++ grep surefirebooter
++ cut -d ' ' -f 1
++ xargs -n 1 jstack
++ grep .test
++ grep '\.java'
1906: Unable to open socket file: target process not responding or HotSpot VM not loaded
The -F option can be used when the target process is not responding
+ ZB_STACK=
POST BUILD TASK : FAILURE
END OF POST BUILD TASK : 0
Archiving artifacts
Recording test results

Mime
View raw message