hbase-builds mailing list archives

Site index · List index
Message view « Date » · « Thread »
Top « Date » · « Thread »
From Apache Jenkins Server <jenk...@builds.apache.org>
Subject Build failed in Jenkins: HBase-0.94-security #445
Date Fri, 14 Mar 2014 21:26:43 GMT
See <https://builds.apache.org/job/HBase-0.94-security/445/changes>

Changes:

[stack] HBASE-19751 TestHRegion testWritesWhileScanning occasional fail since HBASE-10514 went in

[stack] HBASE-10514 Forward port HBASE-10466, possible data loss when failed flushes

------------------------------------------
[...truncated 19393 lines...]
[DEBUG] file DEPENDENCIES has a filtered file extension
[DEBUG] copy <https://builds.apache.org/job/HBase-0.94-security/ws/trunk/target/maven-shared-archive-resources/META-INF/DEPENDENCIES> to <https://builds.apache.org/job/HBase-0.94-security/ws/trunk/target/test-classes/META-INF/DEPENDENCIES>
[DEBUG] file LICENSE has a filtered file extension
[DEBUG] copy <https://builds.apache.org/job/HBase-0.94-security/ws/trunk/target/maven-shared-archive-resources/META-INF/LICENSE> to <https://builds.apache.org/job/HBase-0.94-security/ws/trunk/target/test-classes/META-INF/LICENSE>
[DEBUG] resource with targetPath null
directory <https://builds.apache.org/job/HBase-0.94-security/ws/trunk/security/src/test/resources>
excludes []
includes [hbase-site.xml]
[INFO] Copying 1 resource
[DEBUG] file hbase-site.xml has a filtered file extension
[DEBUG] copy <https://builds.apache.org/job/HBase-0.94-security/ws/trunk/security/src/test/resources/hbase-site.xml> to <https://builds.apache.org/job/HBase-0.94-security/ws/trunk/target/test-classes/hbase-site.xml>
[INFO] 
[INFO] --- maven-compiler-plugin:2.5.1:testCompile (default-testCompile) @ hbase ---
[DEBUG] Configuring mojo org.apache.maven.plugins:maven-compiler-plugin:2.5.1:testCompile from plugin realm ClassRealm[plugin>org.apache.maven.plugins:maven-compiler-plugin:2.5.1, parent: sun.misc.Launcher$AppClassLoader@5224ee]
[DEBUG] Configuring mojo 'org.apache.maven.plugins:maven-compiler-plugin:2.5.1:testCompile' with basic configurator -->
[DEBUG]   (f) basedir = <https://builds.apache.org/job/HBase-0.94-security/ws/trunk>
[DEBUG]   (f) buildDirectory = <https://builds.apache.org/job/HBase-0.94-security/ws/trunk/target>
[DEBUG]   (f) classpathElements = [<https://builds.apache.org/job/HBase-0.94-security/ws/trunk/target/test-classes,> <https://builds.apache.org/job/HBase-0.94-security/ws/trunk/target/classes,> /home/jenkins/.m2/repository/com/yammer/metrics/metrics-core/2.1.2/metrics-core-2.1.2.jar, /home/jenkins/.m2/repository/com/google/guava/guava/11.0.2/guava-11.0.2.jar, /home/jenkins/.m2/repository/com/google/code/findbugs/jsr305/1.3.9/jsr305-1.3.9.jar, /home/jenkins/.m2/repository/commons-cli/commons-cli/1.2/commons-cli-1.2.jar, /home/jenkins/.m2/repository/commons-configuration/commons-configuration/1.6/commons-configuration-1.6.jar, /home/jenkins/.m2/repository/commons-collections/commons-collections/3.2.1/commons-collections-3.2.1.jar, /home/jenkins/.m2/repository/commons-digester/commons-digester/1.8/commons-digester-1.8.jar, /home/jenkins/.m2/repository/commons-beanutils/commons-beanutils/1.7.0/commons-beanutils-1.7.0.jar, /home/jenkins/.m2/repository/commons-beanutils/commons-beanutils-core/1.8.0/commons-beanutils-core-1.8.0.jar, /home/jenkins/.m2/repository/com/github/stephenc/high-scale-lib/high-scale-lib/1.1.1/high-scale-lib-1.1.1.jar, /home/jenkins/.m2/repository/commons-codec/commons-codec/1.4/commons-codec-1.4.jar, /home/jenkins/.m2/repository/commons-httpclient/commons-httpclient/3.1/commons-httpclient-3.1.jar, /home/jenkins/.m2/repository/commons-io/commons-io/2.1/commons-io-2.1.jar, /home/jenkins/.m2/repository/commons-lang/commons-lang/2.5/commons-lang-2.5.jar, /home/jenkins/.m2/repository/commons-logging/commons-logging/1.1.1/commons-logging-1.1.1.jar, /home/jenkins/.m2/repository/log4j/log4j/1.2.16/log4j-1.2.16.jar, /home/jenkins/.m2/repository/org/apache/avro/avro/1.5.3/avro-1.5.3.jar, /home/jenkins/.m2/repository/org/xerial/snappy/snappy-java/1.0.3.2/snappy-java-1.0.3.2.jar, /home/jenkins/.m2/repository/org/apache/avro/avro-ipc/1.5.3/avro-ipc-1.5.3.jar, /home/jenkins/.m2/repository/org/jboss/netty/netty/3.2.4.Final/netty-3.2.4.Final.jar, /home/jenkins/.m2/repository/org/apache/velocity/velocity/1.7/velocity-1.7.jar, /home/jenkins/.m2/repository/org/apache/zookeeper/zookeeper/3.4.5/zookeeper-3.4.5.jar, /home/jenkins/.m2/repository/org/apache/thrift/libthrift/0.8.0/libthrift-0.8.0.jar, /home/jenkins/.m2/repository/org/apache/httpcomponents/httpclient/4.1.2/httpclient-4.1.2.jar, /home/jenkins/.m2/repository/org/apache/httpcomponents/httpcore/4.1.3/httpcore-4.1.3.jar, /home/jenkins/.m2/repository/org/jruby/jruby-complete/1.6.5/jruby-complete-1.6.5.jar, /home/jenkins/.m2/repository/org/mortbay/jetty/jetty/6.1.26/jetty-6.1.26.jar, /home/jenkins/.m2/repository/org/mortbay/jetty/jetty-util/6.1.26/jetty-util-6.1.26.jar, /home/jenkins/.m2/repository/org/mortbay/jetty/jsp-2.1/6.1.14/jsp-2.1-6.1.14.jar, /home/jenkins/.m2/repository/org/eclipse/jdt/core/3.1.1/core-3.1.1.jar, /home/jenkins/.m2/repository/org/mortbay/jetty/jsp-api-2.1/6.1.14/jsp-api-2.1-6.1.14.jar, /home/jenkins/.m2/repository/org/mortbay/jetty/servlet-api-2.5/6.1.14/servlet-api-2.5-6.1.14.jar, /home/jenkins/.m2/repository/org/codehaus/jackson/jackson-core-asl/1.8.8/jackson-core-asl-1.8.8.jar, /home/jenkins/.m2/repository/org/codehaus/jackson/jackson-mapper-asl/1.8.8/jackson-mapper-asl-1.8.8.jar, /home/jenkins/.m2/repository/org/codehaus/jackson/jackson-jaxrs/1.8.8/jackson-jaxrs-1.8.8.jar, /home/jenkins/.m2/repository/org/codehaus/jackson/jackson-xc/1.8.8/jackson-xc-1.8.8.jar, /home/jenkins/.m2/repository/org/slf4j/slf4j-api/1.4.3/slf4j-api-1.4.3.jar, /home/jenkins/.m2/repository/org/slf4j/slf4j-log4j12/1.4.3/slf4j-log4j12-1.4.3.jar, /home/jenkins/.m2/repository/tomcat/jasper-compiler/5.5.23/jasper-compiler-5.5.23.jar, /home/jenkins/.m2/repository/tomcat/jasper-runtime/5.5.23/jasper-runtime-5.5.23.jar, /home/jenkins/.m2/repository/commons-el/commons-el/1.0/commons-el-1.0.jar, /home/jenkins/.m2/repository/org/jamon/jamon-runtime/2.3.1/jamon-runtime-2.3.1.jar, /home/jenkins/.m2/repository/com/google/protobuf/protobuf-java/2.4.0a/protobuf-java-2.4.0a.jar, /home/jenkins/.m2/repository/com/sun/jersey/jersey-core/1.8/jersey-core-1.8.jar, /home/jenkins/.m2/repository/com/sun/jersey/jersey-json/1.8/jersey-json-1.8.jar, /home/jenkins/.m2/repository/org/codehaus/jettison/jettison/1.1/jettison-1.1.jar, /home/jenkins/.m2/repository/com/sun/xml/bind/jaxb-impl/2.2.3-1/jaxb-impl-2.2.3-1.jar, /home/jenkins/.m2/repository/com/sun/jersey/jersey-server/1.8/jersey-server-1.8.jar, /home/jenkins/.m2/repository/asm/asm/3.1/asm-3.1.jar, /home/jenkins/.m2/repository/javax/xml/bind/jaxb-api/2.1/jaxb-api-2.1.jar, /home/jenkins/.m2/repository/javax/activation/activation/1.1/activation-1.1.jar, /home/jenkins/.m2/repository/stax/stax-api/1.0.1/stax-api-1.0.1.jar, /home/jenkins/.m2/repository/junit/junit/4.11/junit-4.11.jar, /home/jenkins/.m2/repository/org/hamcrest/hamcrest-core/1.3/hamcrest-core-1.3.jar, /home/jenkins/.m2/repository/org/mockito/mockito-all/1.8.5/mockito-all-1.8.5.jar, /home/jenkins/.m2/repository/org/apache/commons/commons-math/2.1/commons-math-2.1.jar, /home/jenkins/.m2/repository/org/apache/hadoop/hadoop-core/1.0.4/hadoop-core-1.0.4.jar, /home/jenkins/.m2/repository/xmlenc/xmlenc/0.52/xmlenc-0.52.jar, /home/jenkins/.m2/repository/commons-net/commons-net/1.4.1/commons-net-1.4.1.jar, /home/jenkins/.m2/repository/org/apache/hadoop/hadoop-test/1.0.4/hadoop-test-1.0.4.jar, /home/jenkins/.m2/repository/org/apache/ftpserver/ftplet-api/1.0.0/ftplet-api-1.0.0.jar, /home/jenkins/.m2/repository/org/apache/mina/mina-core/2.0.0-M5/mina-core-2.0.0-M5.jar, /home/jenkins/.m2/repository/org/apache/ftpserver/ftpserver-core/1.0.0/ftpserver-core-1.0.0.jar, /home/jenkins/.m2/repository/org/apache/ftpserver/ftpserver-deprecated/1.0.0-M2/ftpserver-deprecated-1.0.0-M2.jar]
[DEBUG]   (f) compileSourceRoots = [<https://builds.apache.org/job/HBase-0.94-security/ws/trunk/src/test/java,> <https://builds.apache.org/job/HBase-0.94-security/ws/trunk/security/src/test/java]>
[DEBUG]   (f) compilerArgument = -Xlint:-options
[DEBUG]   (f) compilerId = javac
[DEBUG]   (f) debug = true
[DEBUG]   (f) encoding = UTF-8
[DEBUG]   (f) failOnError = true
[DEBUG]   (f) fork = false
[DEBUG]   (f) generatedTestSourcesDirectory = <https://builds.apache.org/job/HBase-0.94-security/ws/trunk/target/generated-test-sources/test-annotations>
[DEBUG]   (f) optimize = false
[DEBUG]   (f) outputDirectory = <https://builds.apache.org/job/HBase-0.94-security/ws/trunk/target/test-classes>
[DEBUG]   (f) outputFileName = hbase-0.94.17-security
[DEBUG]   (f) session = org.apache.maven.execution.MavenSession@c3507d
[DEBUG]   (f) showDeprecation = false
[DEBUG]   (f) showWarnings = true
[DEBUG]   (f) source = 1.6
[DEBUG]   (f) staleMillis = 0
[DEBUG]   (f) target = 1.6
[DEBUG]   (f) verbose = false
[DEBUG] -- end configuration --
[DEBUG] Using compiler 'javac'.
[DEBUG] Source directories: [<https://builds.apache.org/job/HBase-0.94-security/ws/trunk/src/test/java>
 <https://builds.apache.org/job/HBase-0.94-security/ws/trunk/security/src/test/java]>
[DEBUG] Classpath: [<https://builds.apache.org/job/HBase-0.94-security/ws/trunk/target/test-classes>
 <https://builds.apache.org/job/HBase-0.94-security/ws/trunk/target/classes>
 /home/jenkins/.m2/repository/com/yammer/metrics/metrics-core/2.1.2/metrics-core-2.1.2.jar
 /home/jenkins/.m2/repository/com/google/guava/guava/11.0.2/guava-11.0.2.jar
 /home/jenkins/.m2/repository/com/google/code/findbugs/jsr305/1.3.9/jsr305-1.3.9.jar
 /home/jenkins/.m2/repository/commons-cli/commons-cli/1.2/commons-cli-1.2.jar
 /home/jenkins/.m2/repository/commons-configuration/commons-configuration/1.6/commons-configuration-1.6.jar
 /home/jenkins/.m2/repository/commons-collections/commons-collections/3.2.1/commons-collections-3.2.1.jar
 /home/jenkins/.m2/repository/commons-digester/commons-digester/1.8/commons-digester-1.8.jar
 /home/jenkins/.m2/repository/commons-beanutils/commons-beanutils/1.7.0/commons-beanutils-1.7.0.jar
 /home/jenkins/.m2/repository/commons-beanutils/commons-beanutils-core/1.8.0/commons-beanutils-core-1.8.0.jar
 /home/jenkins/.m2/repository/com/github/stephenc/high-scale-lib/high-scale-lib/1.1.1/high-scale-lib-1.1.1.jar
 /home/jenkins/.m2/repository/commons-codec/commons-codec/1.4/commons-codec-1.4.jar
 /home/jenkins/.m2/repository/commons-httpclient/commons-httpclient/3.1/commons-httpclient-3.1.jar
 /home/jenkins/.m2/repository/commons-io/commons-io/2.1/commons-io-2.1.jar
 /home/jenkins/.m2/repository/commons-lang/commons-lang/2.5/commons-lang-2.5.jar
 /home/jenkins/.m2/repository/commons-logging/commons-logging/1.1.1/commons-logging-1.1.1.jar
 /home/jenkins/.m2/repository/log4j/log4j/1.2.16/log4j-1.2.16.jar
 /home/jenkins/.m2/repository/org/apache/avro/avro/1.5.3/avro-1.5.3.jar
 /home/jenkins/.m2/repository/org/xerial/snappy/snappy-java/1.0.3.2/snappy-java-1.0.3.2.jar
 /home/jenkins/.m2/repository/org/apache/avro/avro-ipc/1.5.3/avro-ipc-1.5.3.jar
 /home/jenkins/.m2/repository/org/jboss/netty/netty/3.2.4.Final/netty-3.2.4.Final.jar
 /home/jenkins/.m2/repository/org/apache/velocity/velocity/1.7/velocity-1.7.jar
 /home/jenkins/.m2/repository/org/apache/zookeeper/zookeeper/3.4.5/zookeeper-3.4.5.jar
 /home/jenkins/.m2/repository/org/apache/thrift/libthrift/0.8.0/libthrift-0.8.0.jar
 /home/jenkins/.m2/repository/org/apache/httpcomponents/httpclient/4.1.2/httpclient-4.1.2.jar
 /home/jenkins/.m2/repository/org/apache/httpcomponents/httpcore/4.1.3/httpcore-4.1.3.jar
 /home/jenkins/.m2/repository/org/jruby/jruby-complete/1.6.5/jruby-complete-1.6.5.jar
 /home/jenkins/.m2/repository/org/mortbay/jetty/jetty/6.1.26/jetty-6.1.26.jar
 /home/jenkins/.m2/repository/org/mortbay/jetty/jetty-util/6.1.26/jetty-util-6.1.26.jar
 /home/jenkins/.m2/repository/org/mortbay/jetty/jsp-2.1/6.1.14/jsp-2.1-6.1.14.jar
 /home/jenkins/.m2/repository/org/eclipse/jdt/core/3.1.1/core-3.1.1.jar
 /home/jenkins/.m2/repository/org/mortbay/jetty/jsp-api-2.1/6.1.14/jsp-api-2.1-6.1.14.jar
 /home/jenkins/.m2/repository/org/mortbay/jetty/servlet-api-2.5/6.1.14/servlet-api-2.5-6.1.14.jar
 /home/jenkins/.m2/repository/org/codehaus/jackson/jackson-core-asl/1.8.8/jackson-core-asl-1.8.8.jar
 /home/jenkins/.m2/repository/org/codehaus/jackson/jackson-mapper-asl/1.8.8/jackson-mapper-asl-1.8.8.jar
 /home/jenkins/.m2/repository/org/codehaus/jackson/jackson-jaxrs/1.8.8/jackson-jaxrs-1.8.8.jar
 /home/jenkins/.m2/repository/org/codehaus/jackson/jackson-xc/1.8.8/jackson-xc-1.8.8.jar
 /home/jenkins/.m2/repository/org/slf4j/slf4j-api/1.4.3/slf4j-api-1.4.3.jar
 /home/jenkins/.m2/repository/org/slf4j/slf4j-log4j12/1.4.3/slf4j-log4j12-1.4.3.jar
 /home/jenkins/.m2/repository/tomcat/jasper-compiler/5.5.23/jasper-compiler-5.5.23.jar
 /home/jenkins/.m2/repository/tomcat/jasper-runtime/5.5.23/jasper-runtime-5.5.23.jar
 /home/jenkins/.m2/repository/commons-el/commons-el/1.0/commons-el-1.0.jar
 /home/jenkins/.m2/repository/org/jamon/jamon-runtime/2.3.1/jamon-runtime-2.3.1.jar
 /home/jenkins/.m2/repository/com/google/protobuf/protobuf-java/2.4.0a/protobuf-java-2.4.0a.jar
 /home/jenkins/.m2/repository/com/sun/jersey/jersey-core/1.8/jersey-core-1.8.jar
 /home/jenkins/.m2/repository/com/sun/jersey/jersey-json/1.8/jersey-json-1.8.jar
 /home/jenkins/.m2/repository/org/codehaus/jettison/jettison/1.1/jettison-1.1.jar
 /home/jenkins/.m2/repository/com/sun/xml/bind/jaxb-impl/2.2.3-1/jaxb-impl-2.2.3-1.jar
 /home/jenkins/.m2/repository/com/sun/jersey/jersey-server/1.8/jersey-server-1.8.jar
 /home/jenkins/.m2/repository/asm/asm/3.1/asm-3.1.jar
 /home/jenkins/.m2/repository/javax/xml/bind/jaxb-api/2.1/jaxb-api-2.1.jar
 /home/jenkins/.m2/repository/javax/activation/activation/1.1/activation-1.1.jar
 /home/jenkins/.m2/repository/stax/stax-api/1.0.1/stax-api-1.0.1.jar
 /home/jenkins/.m2/repository/junit/junit/4.11/junit-4.11.jar
 /home/jenkins/.m2/repository/org/hamcrest/hamcrest-core/1.3/hamcrest-core-1.3.jar
 /home/jenkins/.m2/repository/org/mockito/mockito-all/1.8.5/mockito-all-1.8.5.jar
 /home/jenkins/.m2/repository/org/apache/commons/commons-math/2.1/commons-math-2.1.jar
 /home/jenkins/.m2/repository/org/apache/hadoop/hadoop-core/1.0.4/hadoop-core-1.0.4.jar
 /home/jenkins/.m2/repository/xmlenc/xmlenc/0.52/xmlenc-0.52.jar
 /home/jenkins/.m2/repository/commons-net/commons-net/1.4.1/commons-net-1.4.1.jar
 /home/jenkins/.m2/repository/org/apache/hadoop/hadoop-test/1.0.4/hadoop-test-1.0.4.jar
 /home/jenkins/.m2/repository/org/apache/ftpserver/ftplet-api/1.0.0/ftplet-api-1.0.0.jar
 /home/jenkins/.m2/repository/org/apache/mina/mina-core/2.0.0-M5/mina-core-2.0.0-M5.jar
 /home/jenkins/.m2/repository/org/apache/ftpserver/ftpserver-core/1.0.0/ftpserver-core-1.0.0.jar
 /home/jenkins/.m2/repository/org/apache/ftpserver/ftpserver-deprecated/1.0.0-M2/ftpserver-deprecated-1.0.0-M2.jar]
[DEBUG] Output directory: <https://builds.apache.org/job/HBase-0.94-security/ws/trunk/target/test-classes>
[DEBUG] CompilerReuseStrategy: reuseCreated
[DEBUG] Classpath:
[DEBUG]  <https://builds.apache.org/job/HBase-0.94-security/ws/trunk/target/test-classes>
[DEBUG]  <https://builds.apache.org/job/HBase-0.94-security/ws/trunk/target/classes>
[DEBUG]  /home/jenkins/.m2/repository/com/yammer/metrics/metrics-core/2.1.2/metrics-core-2.1.2.jar
[DEBUG]  /home/jenkins/.m2/repository/com/google/guava/guava/11.0.2/guava-11.0.2.jar
[DEBUG]  /home/jenkins/.m2/repository/com/google/code/findbugs/jsr305/1.3.9/jsr305-1.3.9.jar
[DEBUG]  /home/jenkins/.m2/repository/commons-cli/commons-cli/1.2/commons-cli-1.2.jar
[DEBUG]  /home/jenkins/.m2/repository/commons-configuration/commons-configuration/1.6/commons-configuration-1.6.jar
[DEBUG]  /home/jenkins/.m2/repository/commons-collections/commons-collections/3.2.1/commons-collections-3.2.1.jar
[DEBUG]  /home/jenkins/.m2/repository/commons-digester/commons-digester/1.8/commons-digester-1.8.jar
[DEBUG]  /home/jenkins/.m2/repository/commons-beanutils/commons-beanutils/1.7.0/commons-beanutils-1.7.0.jar
[DEBUG]  /home/jenkins/.m2/repository/commons-beanutils/commons-beanutils-core/1.8.0/commons-beanutils-core-1.8.0.jar
[DEBUG]  /home/jenkins/.m2/repository/com/github/stephenc/high-scale-lib/high-scale-lib/1.1.1/high-scale-lib-1.1.1.jar
[DEBUG]  /home/jenkins/.m2/repository/commons-codec/commons-codec/1.4/commons-codec-1.4.jar
[DEBUG]  /home/jenkins/.m2/repository/commons-httpclient/commons-httpclient/3.1/commons-httpclient-3.1.jar
[DEBUG]  /home/jenkins/.m2/repository/commons-io/commons-io/2.1/commons-io-2.1.jar
[DEBUG]  /home/jenkins/.m2/repository/commons-lang/commons-lang/2.5/commons-lang-2.5.jar
[DEBUG]  /home/jenkins/.m2/repository/commons-logging/commons-logging/1.1.1/commons-logging-1.1.1.jar
[DEBUG]  /home/jenkins/.m2/repository/log4j/log4j/1.2.16/log4j-1.2.16.jar
[DEBUG]  /home/jenkins/.m2/repository/org/apache/avro/avro/1.5.3/avro-1.5.3.jar
[DEBUG]  /home/jenkins/.m2/repository/org/xerial/snappy/snappy-java/1.0.3.2/snappy-java-1.0.3.2.jar
[DEBUG]  /home/jenkins/.m2/repository/org/apache/avro/avro-ipc/1.5.3/avro-ipc-1.5.3.jar
[DEBUG]  /home/jenkins/.m2/repository/org/jboss/netty/netty/3.2.4.Final/netty-3.2.4.Final.jar
[DEBUG]  /home/jenkins/.m2/repository/org/apache/velocity/velocity/1.7/velocity-1.7.jar
[DEBUG]  /home/jenkins/.m2/repository/org/apache/zookeeper/zookeeper/3.4.5/zookeeper-3.4.5.jar
[DEBUG]  /home/jenkins/.m2/repository/org/apache/thrift/libthrift/0.8.0/libthrift-0.8.0.jar
[DEBUG]  /home/jenkins/.m2/repository/org/apache/httpcomponents/httpclient/4.1.2/httpclient-4.1.2.jar
[DEBUG]  /home/jenkins/.m2/repository/org/apache/httpcomponents/httpcore/4.1.3/httpcore-4.1.3.jar
[DEBUG]  /home/jenkins/.m2/repository/org/jruby/jruby-complete/1.6.5/jruby-complete-1.6.5.jar
[DEBUG]  /home/jenkins/.m2/repository/org/mortbay/jetty/jetty/6.1.26/jetty-6.1.26.jar
[DEBUG]  /home/jenkins/.m2/repository/org/mortbay/jetty/jetty-util/6.1.26/jetty-util-6.1.26.jar
[DEBUG]  /home/jenkins/.m2/repository/org/mortbay/jetty/jsp-2.1/6.1.14/jsp-2.1-6.1.14.jar
[DEBUG]  /home/jenkins/.m2/repository/org/eclipse/jdt/core/3.1.1/core-3.1.1.jar
[DEBUG]  /home/jenkins/.m2/repository/org/mortbay/jetty/jsp-api-2.1/6.1.14/jsp-api-2.1-6.1.14.jar
[DEBUG]  /home/jenkins/.m2/repository/org/mortbay/jetty/servlet-api-2.5/6.1.14/servlet-api-2.5-6.1.14.jar
[DEBUG]  /home/jenkins/.m2/repository/org/codehaus/jackson/jackson-core-asl/1.8.8/jackson-core-asl-1.8.8.jar
[DEBUG]  /home/jenkins/.m2/repository/org/codehaus/jackson/jackson-mapper-asl/1.8.8/jackson-mapper-asl-1.8.8.jar
[DEBUG]  /home/jenkins/.m2/repository/org/codehaus/jackson/jackson-jaxrs/1.8.8/jackson-jaxrs-1.8.8.jar
[DEBUG]  /home/jenkins/.m2/repository/org/codehaus/jackson/jackson-xc/1.8.8/jackson-xc-1.8.8.jar
[DEBUG]  /home/jenkins/.m2/repository/org/slf4j/slf4j-api/1.4.3/slf4j-api-1.4.3.jar
[DEBUG]  /home/jenkins/.m2/repository/org/slf4j/slf4j-log4j12/1.4.3/slf4j-log4j12-1.4.3.jar
[DEBUG]  /home/jenkins/.m2/repository/tomcat/jasper-compiler/5.5.23/jasper-compiler-5.5.23.jar
[DEBUG]  /home/jenkins/.m2/repository/tomcat/jasper-runtime/5.5.23/jasper-runtime-5.5.23.jar
[DEBUG]  /home/jenkins/.m2/repository/commons-el/commons-el/1.0/commons-el-1.0.jar
[DEBUG]  /home/jenkins/.m2/repository/org/jamon/jamon-runtime/2.3.1/jamon-runtime-2.3.1.jar
[DEBUG]  /home/jenkins/.m2/repository/com/google/protobuf/protobuf-java/2.4.0a/protobuf-java-2.4.0a.jar
[DEBUG]  /home/jenkins/.m2/repository/com/sun/jersey/jersey-core/1.8/jersey-core-1.8.jar
[DEBUG]  /home/jenkins/.m2/repository/com/sun/jersey/jersey-json/1.8/jersey-json-1.8.jar
[DEBUG]  /home/jenkins/.m2/repository/org/codehaus/jettison/jettison/1.1/jettison-1.1.jar
[DEBUG]  /home/jenkins/.m2/repository/com/sun/xml/bind/jaxb-impl/2.2.3-1/jaxb-impl-2.2.3-1.jar
[DEBUG]  /home/jenkins/.m2/repository/com/sun/jersey/jersey-server/1.8/jersey-server-1.8.jar
[DEBUG]  /home/jenkins/.m2/repository/asm/asm/3.1/asm-3.1.jar
[DEBUG]  /home/jenkins/.m2/repository/javax/xml/bind/jaxb-api/2.1/jaxb-api-2.1.jar
[DEBUG]  /home/jenkins/.m2/repository/javax/activation/activation/1.1/activation-1.1.jar
[DEBUG]  /home/jenkins/.m2/repository/stax/stax-api/1.0.1/stax-api-1.0.1.jar
[DEBUG]  /home/jenkins/.m2/repository/junit/junit/4.11/junit-4.11.jar
[DEBUG]  /home/jenkins/.m2/repository/org/hamcrest/hamcrest-core/1.3/hamcrest-core-1.3.jar
[DEBUG]  /home/jenkins/.m2/repository/org/mockito/mockito-all/1.8.5/mockito-all-1.8.5.jar
[DEBUG]  /home/jenkins/.m2/repository/org/apache/commons/commons-math/2.1/commons-math-2.1.jar
[DEBUG]  /home/jenkins/.m2/repository/org/apache/hadoop/hadoop-core/1.0.4/hadoop-core-1.0.4.jar
[DEBUG]  /home/jenkins/.m2/repository/xmlenc/xmlenc/0.52/xmlenc-0.52.jar
[DEBUG]  /home/jenkins/.m2/repository/commons-net/commons-net/1.4.1/commons-net-1.4.1.jar
[DEBUG]  /home/jenkins/.m2/repository/org/apache/hadoop/hadoop-test/1.0.4/hadoop-test-1.0.4.jar
[DEBUG]  /home/jenkins/.m2/repository/org/apache/ftpserver/ftplet-api/1.0.0/ftplet-api-1.0.0.jar
[DEBUG]  /home/jenkins/.m2/repository/org/apache/mina/mina-core/2.0.0-M5/mina-core-2.0.0-M5.jar
[DEBUG]  /home/jenkins/.m2/repository/org/apache/ftpserver/ftpserver-core/1.0.0/ftpserver-core-1.0.0.jar
[DEBUG]  /home/jenkins/.m2/repository/org/apache/ftpserver/ftpserver-deprecated/1.0.0-M2/ftpserver-deprecated-1.0.0-M2.jar
[DEBUG] Source roots:
[DEBUG]  <https://builds.apache.org/job/HBase-0.94-security/ws/trunk/src/test/java>
[DEBUG]  <https://builds.apache.org/job/HBase-0.94-security/ws/trunk/security/src/test/java>
[DEBUG] Command line options:
[DEBUG] -d <https://builds.apache.org/job/HBase-0.94-security/ws/trunk/target/test-classes> -classpath <https://builds.apache.org/job/HBase-0.94-security/ws/trunk/target/test-classes>:<https://builds.apache.org/job/HBase-0.94-security/ws/trunk/target/classes>:/home/jenkins/.m2/repository/com/yammer/metrics/metrics-core/2.1.2/metrics-core-2.1.2.jar:/home/jenkins/.m2/repository/com/google/guava/guava/11.0.2/guava-11.0.2.jar:/home/jenkins/.m2/repository/com/google/code/findbugs/jsr305/1.3.9/jsr305-1.3.9.jar:/home/jenkins/.m2/repository/commons-cli/commons-cli/1.2/commons-cli-1.2.jar:/home/jenkins/.m2/repository/commons-configuration/commons-configuration/1.6/commons-configuration-1.6.jar:/home/jenkins/.m2/repository/commons-collections/commons-collections/3.2.1/commons-collections-3.2.1.jar:/home/jenkins/.m2/repository/commons-digester/commons-digester/1.8/commons-digester-1.8.jar:/home/jenkins/.m2/repository/commons-beanutils/commons-beanutils/1.7.0/commons-beanutils-1.7.0.jar:/home/jenkins/.m2/repository/commons-beanutils/commons-beanutils-core/1.8.0/commons-beanutils-core-1.8.0.jar:/home/jenkins/.m2/repository/com/github/stephenc/high-scale-lib/high-scale-lib/1.1.1/high-scale-lib-1.1.1.jar:/home/jenkins/.m2/repository/commons-codec/commons-codec/1.4/commons-codec-1.4.jar:/home/jenkins/.m2/repository/commons-httpclient/commons-httpclient/3.1/commons-httpclient-3.1.jar:/home/jenkins/.m2/repository/commons-io/commons-io/2.1/commons-io-2.1.jar:/home/jenkins/.m2/repository/commons-lang/commons-lang/2.5/commons-lang-2.5.jar:/home/jenkins/.m2/repository/commons-logging/commons-logging/1.1.1/commons-logging-1.1.1.jar:/home/jenkins/.m2/repository/log4j/log4j/1.2.16/log4j-1.2.16.jar:/home/jenkins/.m2/repository/org/apache/avro/avro/1.5.3/avro-1.5.3.jar:/home/jenkins/.m2/repository/org/xerial/snappy/snappy-java/1.0.3.2/snappy-java-1.0.3.2.jar:/home/jenkins/.m2/repository/org/apache/avro/avro-ipc/1.5.3/avro-ipc-1.5.3.jar:/home/jenkins/.m2/repository/org/jboss/netty/netty/3.2.4.Final/netty-3.2.4.Final.jar:/home/jenkins/.m2/repository/org/apache/velocity/velocity/1.7/velocity-1.7.jar:/home/jenkins/.m2/repository/org/apache/zookeeper/zookeeper/3.4.5/zookeeper-3.4.5.jar:/home/jenkins/.m2/repository/org/apache/thrift/libthrift/0.8.0/libthrift-0.8.0.jar:/home/jenkins/.m2/repository/org/apache/httpcomponents/httpclient/4.1.2/httpclient-4.1.2.jar:/home/jenkins/.m2/repository/org/apache/httpcomponents/httpcore/4.1.3/httpcore-4.1.3.jar:/home/jenkins/.m2/repository/org/jruby/jruby-complete/1.6.5/jruby-complete-1.6.5.jar:/home/jenkins/.m2/repository/org/mortbay/jetty/jetty/6.1.26/jetty-6.1.26.jar:/home/jenkins/.m2/repository/org/mortbay/jetty/jetty-util/6.1.26/jetty-util-6.1.26.jar:/home/jenkins/.m2/repository/org/mortbay/jetty/jsp-2.1/6.1.14/jsp-2.1-6.1.14.jar:/home/jenkins/.m2/repository/org/eclipse/jdt/core/3.1.1/core-3.1.1.jar:/home/jenkins/.m2/repository/org/mortbay/jetty/jsp-api-2.1/6.1.14/jsp-api-2.1-6.1.14.jar:/home/jenkins/.m2/repository/org/mortbay/jetty/servlet-api-2.5/6.1.14/servlet-api-2.5-6.1.14.jar:/home/jenkins/.m2/repository/org/codehaus/jackson/jackson-core-asl/1.8.8/jackson-core-asl-1.8.8.jar:/home/jenkins/.m2/repository/org/codehaus/jackson/jackson-mapper-asl/1.8.8/jackson-mapper-asl-1.8.8.jar:/home/jenkins/.m2/repository/org/codehaus/jackson/jackson-jaxrs/1.8.8/jackson-jaxrs-1.8.8.jar:/home/jenkins/.m2/repository/org/codehaus/jackson/jackson-xc/1.8.8/jackson-xc-1.8.8.jar:/home/jenkins/.m2/repository/org/slf4j/slf4j-api/1.4.3/slf4j-api-1.4.3.jar:/home/jenkins/.m2/repository/org/slf4j/slf4j-log4j12/1.4.3/slf4j-log4j12-1.4.3.jar:/home/jenkins/.m2/repository/tomcat/jasper-compiler/5.5.23/jasper-compiler-5.5.23.jar:/home/jenkins/.m2/repository/tomcat/jasper-runtime/5.5.23/jasper-runtime-5.5.23.jar:/home/jenkins/.m2/repository/commons-el/commons-el/1.0/commons-el-1.0.jar:/home/jenkins/.m2/repository/org/jamon/jamon-runtime/2.3.1/jamon-runtime-2.3.1.jar:/home/jenkins/.m2/repository/com/google/protobuf/protobuf-java/2.4.0a/protobuf-java-2.4.0a.jar:/home/jenkins/.m2/repository/com/sun/jersey/jersey-core/1.8/jersey-core-1.8.jar:/home/jenkins/.m2/repository/com/sun/jersey/jersey-json/1.8/jersey-json-1.8.jar:/home/jenkins/.m2/repository/org/codehaus/jettison/jettison/1.1/jettison-1.1.jar:/home/jenkins/.m2/repository/com/sun/xml/bind/jaxb-impl/2.2.3-1/jaxb-impl-2.2.3-1.jar:/home/jenkins/.m2/repository/com/sun/jersey/jersey-server/1.8/jersey-server-1.8.jar:/home/jenkins/.m2/repository/asm/asm/3.1/asm-3.1.jar:/home/jenkins/.m2/repository/javax/xml/bind/jaxb-api/2.1/jaxb-api-2.1.jar:/home/jenkins/.m2/repository/javax/activation/activation/1.1/activation-1.1.jar:/home/jenkins/.m2/repository/stax/stax-api/1.0.1/stax-api-1.0.1.jar:/home/jenkins/.m2/repository/junit/junit/4.11/junit-4.11.jar:/home/jenkins/.m2/repository/org/hamcrest/hamcrest-core/1.3/hamcrest-core-1.3.jar:/home/jenkins/.m2/repository/org/mockito/mockito-all/1.8.5/mockito-all-1.8.5.jar:/home/jenkins/.m2/repository/org/apache/commons/commons-math/2.1/commons-math-2.1.jar:/home/jenkins/.m2/repository/org/apache/hadoop/hadoop-core/1.0.4/hadoop-core-1.0.4.jar:/home/jenkins/.m2/repository/xmlenc/xmlenc/0.52/xmlenc-0.52.jar:/home/jenkins/.m2/repository/commons-net/commons-net/1.4.1/commons-net-1.4.1.jar:/home/jenkins/.m2/repository/org/apache/hadoop/hadoop-test/1.0.4/hadoop-test-1.0.4.jar:/home/jenkins/.m2/repository/org/apache/ftpserver/ftplet-api/1.0.0/ftplet-api-1.0.0.jar:/home/jenkins/.m2/repository/org/apache/mina/mina-core/2.0.0-M5/mina-core-2.0.0-M5.jar:/home/jenkins/.m2/repository/org/apache/ftpserver/ftpserver-core/1.0.0/ftpserver-core-1.0.0.jar:/home/jenkins/.m2/repository/org/apache/ftpserver/ftpserver-deprecated/1.0.0-M2/ftpserver-deprecated-1.0.0-M2.jar: -sourcepath <https://builds.apache.org/job/HBase-0.94-security/ws/trunk/src/test/java>:<https://builds.apache.org/job/HBase-0.94-security/ws/trunk/security/src/test/java>: <https://builds.apache.org/job/HBase-0.94-security/ws/trunk/src/test/java/org/apache/hadoop/hbase/regionserver/wal/TestKeyValueCompression.java> <https://builds.apache.org/job/HBase-0.94-security/ws/trunk/src/test/java/org/apache/hadoop/hbase/util/TestEnvironmentEdgeManager.java> <https://builds.apache.org/job/HBase-0.94-security/ws/trunk/src/test/java/org/apache/hadoop/hbase/regionserver/CreateRandomStoreFile.java> <https://builds.apache.org/job/HBase-0.94-security/ws/trunk/src/test/java/org/apache/hadoop/hbase/regionserver/TestHBase7051.java> <https://builds.apache.org/job/HBase-0.94-security/ws/trunk/src/test/java/org/apache/hadoop/hbase/filter/TestFilter.java> <https://builds.apache.org/job/HBase-0.94-security/ws/trunk/src/test/java/org/apache/hadoop/hbase/mapreduce/NMapInputFormat.java> <https://builds.apache.org/job/HBase-0.94-security/ws/trunk/src/test/java/org/apache/hadoop/hbase/IntegrationTestDataIngestSlowDeterministic.java> <https://builds.apache.org/job/HBase-0.94-security/ws/trunk/src/test/java/org/apache/hadoop/hbase/zookeeper/TestZooKeeperNodeTracker.java> <https://builds.apache.org/job/HBase-0.94-security/ws/trunk/src/test/java/org/apache/hadoop/hbase/TestDrainingServer.java> <https://builds.apache.org/job/HBase-0.94-security/ws/trunk/src/test/java/org/apache/hadoop/hbase/errorhandling/TestTimeoutExceptionInjector.java> <https://builds.apache.org/job/HBase-0.94-security/ws/trunk/src/test/java/org/apache/hadoop/hbase/filter/TestFuzzyRowFilter.java> <https://builds.apache.org/job/HBase-0.94-security/ws/trunk/src/test/java/org/apache/hadoop/hbase/HBaseTestingUtility.java> <https://builds.apache.org/job/HBase-0.94-security/ws/trunk/src/test/java/org/apache/hadoop/hbase/coprocessor/TestHTableWrapper.java> <https://builds.apache.org/job/HBase-0.94-security/ws/trunk/src/test/java/org/apache/hadoop/hbase/TestCompare.java> <https://builds.apache.org/job/HBase-0.94-security/ws/trunk/src/test/java/org/apache/hadoop/hbase/master/cleaner/TestHFileCleaner.java> <https://builds.apache.org/job/HBase-0.94-security/ws/trunk/src/test/java/org/apache/hadoop/hbase/io/TestFileLink.java> <https://builds.apache.org/job/HBase-0.94-security/ws/trunk/src/test/java/org/apache/hadoop/hbase/filter/TestInclusiveStopFilter.java> <https://builds.apache.org/job/HBase-0.94-security/ws/trunk/src/test/java/org/apache/hadoop/hbase/regionserver/TestCompaction.java> <https://builds.apache.org/job/HBase-0.94-security/ws/trunk/src/test/java/org/apache/hadoop/hbase/regionserver/TestStore.java> <https://builds.apache.org/job/HBase-0.94-security/ws/trunk/src/test/java/org/apache/hadoop/hbase/TestHServerAddress.java> <https://builds.apache.org/job/HBase-0.94-security/ws/trunk/src/test/java/org/apache/hadoop/hbase/master/TestHMasterRPCException.java> <https://builds.apache.org/job/HBase-0.94-security/ws/trunk/src/test/java/org/apache/hadoop/hbase/client/TestScannerTimeout.java> <https://builds.apache.org/job/HBase-0.94-security/ws/trunk/src/test/java/org/apache/hadoop/hbase/regionserver/TestCompoundBloomFilter.java> <https://builds.apache.org/job/HBase-0.94-security/ws/trunk/src/test/java/org/apache/hadoop/hbase/DistributedHBaseCluster.java> <https://builds.apache.org/job/HBase-0.94-security/ws/trunk/src/test/java/org/apache/hadoop/hbase/TimestampTestBase.java> <https://builds.apache.org/job/HBase-0.94-security/ws/trunk/src/test/java/org/apache/hadoop/hbase/snapshot/SnapshotTestingUtils.java> <https://builds.apache.org/job/HBase-0.94-security/ws/trunk/src/test/java/org/apache/hadoop/hbase/regionserver/TestMemStoreLAB.java> <https://builds.apache.org/job/HBase-0.94-security/ws/trunk/src/test/java/org/apache/hadoop/hbase/io/hfile/TestHFileBlock.java> <https://builds.apache.org/job/HBase-0.94-security/ws/trunk/src/test/java/org/apache/hadoop/hbase/test/IntegrationTestBigLinkedList.java> <https://builds.apache.org/job/HBase-0.94-security/ws/trunk/src/test/java/org/apache/hadoop/hbase/regionserver/wal/FaultySequenceFileLogReader.java> <https://builds.apache.org/job/HBase-0.94-security/ws/trunk/src/test/java/org/apache/hadoop/hbase/catalog/TestMetaReaderEditorNoCluster.java> <https://builds.apache.org/job/HBase-0.94-security/ws/trunk/src/test/java/org/apache/hadoop/hbase/client/TestHTablePool.java> <https://builds.apache.org/job/HBase-0.94-security/ws/trunk/src/test/java/org/apache/hadoop/hbase/regionserver/TestRpcMetrics.java> <https://builds.apache.org/job/HBase-0.94-security/ws/trunk/src/test/java/org/apache/hadoop/hbase/regionserver/TestStoreScanner.java> <https://builds.apache.org/job/HBase-0.94-security/ws/trunk/src/test/java/org/apache/hadoop/hbase/master/snapshot/TestSnapshotHFileCleaner.java> <https://builds.apache.org/job/HBase-0.94-security/ws/trunk/src/test/java/org/apache/hadoop/hbase/TestZooKeeper.java> <https://builds.apache.org/job/HBase-0.94-security/ws/trunk/src/test/java/org/apache/hadoop/hbase/test/IntegrationTestLoadAndVerify.java> <https://builds.apache.org/job/HBase-0.94-security/ws/trunk/src/test/java/org/apache/hadoop/hbase/snapshot/TestExportSnapshot.java> <https://builds.apache.org/job/HBase-0.94-security/ws/trunk/src/test/java/org/apache/hadoop/hbase/master/snapshot/TestSnapshotLogCleaner.java> <https://builds.apache.org/job/HBase-0.94-security/ws/trunk/src/test/java/org/apache/hadoop/hbase/regionserver/wal/TestLogRollingNoCluster.java> <https://builds.apache.org/job/HBase-0.94-security/ws/trunk/src/test/java/org/apache/hadoop/hbase/regionserver/wal/TestDurability.java> <https://builds.apache.org/job/HBase-0.94-security/ws/trunk/src/test/java/org/apache/hadoop/hbase/regionserver/TestSplitTransaction.java> <https://builds.apache.org/job/HBase-0.94-security/ws/trunk/src/test/java/org/apache/hadoop/hbase/util/TestRegionSplitter.java> <https://builds.apache.org/job/HBase-0.94-security/ws/trunk/src/test/java/org/apache/hadoop/hbase/IntegrationTestDataIngestWithChaosMonkey.java> <https://builds.apache.org/job/HBase-0.94-security/ws/trunk/src/test/java/org/apache/hadoop/hbase/regionserver/handler/TestOpenRegionHandler.java> <https://builds.apache.org/job/HBase-0.94-security/ws/trunk/src/test/java/org/apache/hadoop/hbase/util/TestBase64.java> <https://builds.apache.org/job/HBase-0.94-security/ws/trunk/src/test/java/org/apache/hadoop/hbase/util/TestLoadTestKVGenerator.java> <https://builds.apache.org/job/HBase-0.94-security/ws/trunk/src/test/java/org/apache/hadoop/hbase/rest/client/TestRemoteHTableRetries.java> <https://builds.apache.org/job/HBase-0.94-security/ws/trunk/src/test/java/org/apache/hadoop/hbase/util/TestBytes.java> <https://builds.apache.org/job/HBase-0.94-security/ws/trunk/src/test/java/org/apache/hadoop/hbase/util/TestKeying.java> <https://builds.apache.org/job/HBase-0.94-security/ws/trunk/src/test/java/org/apache/hadoop/hbase/mapreduce/TestCopyTable.java> <https://builds.apache.org/job/HBase-0.94-security/ws/trunk/src/test/java/org/apache/hadoop/hbase/rest/TestRESTMetrics.java> <https://builds.apache.org/job/HBase-0.94-security/ws/trunk/src/test/java/org/apache/hadoop/hbase/io/hfile/TestHFileBlockIndex.java> <https://builds.apache.org/job/HBase-0.94-security/ws/trunk/src/test/java/org/apache/hadoop/hbase/util/TestCompressionTest.java> <https://builds.apache.org/job/HBase-0.94-security/ws/trunk/src/test/java/org/apache/hadoop/hbase/SmallTests.java> <https://builds.apache.org/job/HBase-0.94-security/ws/trunk/src/test/java/org/apache/hadoop/hbase/regionserver/TestAtomicOperation.java> <https://builds.apache.org/job/HBase-0.94-security/ws/trunk/src/test/java/org/apache/hadoop/hbase/master/handler/TestCreateTableHandler.java> <https://builds.apache.org/job/HBase-0.94-security/ws/trunk/src/test/java/org/apache/hadoop/hbase/ResourceCheckerJUnitRule.java> <https://builds.apache.org/job/HBase-0.94-security/ws/trunk/src/test/java/org/apache/hadoop/hbase/metrics/TestExactCounterMetric.java> <https://builds.apache.org/job/HBase-0.94-security/ws/trunk/src/test/java/org/apache/hadoop/hbase/coprocessor/TestCoprocessorInterface.java> <https://builds.apache.org/job/HBase-0.94-security/ws/trunk/src/test/java/org/apache/hadoop/hbase/regionserver/TestMXBean.java> <https://builds.apache.org/job/HBase-0.94-security/ws/trunk/src/test/java/org/apache/hadoop/hbase/catalog/TestCatalogTracker.java> <https://builds.apache.org/job/HBase-0.94-security/ws/trunk/src/test/java/org/apache/hadoop/hbase/mapreduce/TestImportExport.java> <https://builds.apache.org/job/HBase-0.94-security/ws/trunk/src/test/java/org/apache/hadoop/hbase/TestKeyValue.java> <https://builds.apache.org/job/HBase-0.94-security/ws/trunk/src/test/java/org/apache/hadoop/hbase/rest/model/TestStorageClusterStatusModel.java> <https://builds.apache.org/job/HBase-0.94-security/ws/trunk/src/test/java/org/apache/hadoop/hbase/util/TestIncrementingEnvironmentEdge.java> <https://builds.apache.org/job/HBase-0.94-security/ws/trunk/src/test/java/org/apache/hadoop/hbase/client/TestResult.java> <https://builds.apache.org/job/HBase-0.94-security/ws/trunk/src/test/java/org/apache/hadoop/hbase/util/RestartMetaTest.java> <https://builds.apache.org/job/HBase-0.94-security/ws/trunk/src/test/java/org/apache/hadoop/hbase/coprocessor/ColumnAggregationEndpoint.java> <https://builds.apache.org/job/HBase-0.94-security/ws/trunk/src/test/java/org/apache/hadoop/hbase/regionserver/wal/InstrumentedSequenceFileLogWriter.java> <https://builds.apache.org/job/HBase-0.94-security/ws/trunk/src/test/java/org/apache/hadoop/hbase/io/encoding/TestBufferedDataBlockEncoder.java> <https://builds.apache.org/job/HBase-0.94-security/ws/trunk/src/test/java/org/apache/hadoop/hbase/mapred/TestTableMapReduce.java> <https://builds.apache.org/job/HBase-0.94-security/ws/trunk/src/test/java/org/apache/hadoop/hbase/snapshot/TestSnapshotLogSplitter.java> <https://builds.apache.org/job/HBase-0.94-security/ws/trunk/src/test/java/org/apache/hadoop/hbase/HBaseCluster.java> <https://builds.apache.org/job/HBase-0.94-security/ws/trunk/src/test/java/org/apache/hadoop/hbase/regionserver/TestHRegion.java> <https://builds.apache.org/job/HBase-0.94-security/ws/trunk/src/test/java/org/apache/hadoop/hbase/mttr/IntegrationTestMTTR.java> <https://builds.apache.org/job/HBase-0.94-security/ws/trunk/src/test/java/org/apache/hadoop/hbase/master/cleaner/TestHFileLinkCleaner.java> <https://builds.apache.org/job/HBase-0.94-security/ws/trunk/src/test/java/org/apache/hadoop/hbase/regionserver/TestSplitTransactionOnCluster.java> <https://builds.apache.org/job/HBase-0.94-security/ws/trunk/src/test/java/org/apache/hadoop/hbase/io/hfile/TestHFile.java> <https://builds.apache.org/job/HBase-0.94-security/ws/trunk/src/test/java/org/apache/hadoop/hbase/coprocessor/SampleRegionWALObserver.java> <https://builds.apache.org/job/HBase-0.94-security/ws/trunk/src/test/java/org/apache/hadoop/hbase/client/TestAttributes.java> <https://builds.apache.org/job/HBase-0.94-security/ws/trunk/src/test/java/org/apache/hadoop/hbase/regionserver/TestFSErrorsExposed.java> <https://builds.apache.org/job/HBase-0.94-security/ws/trunk/src/test/java/org/apache/hadoop/hbase/regionserver/TestResettingCounters.java> <https://builds.apache.org/job/HBase-0.94-security/ws/trunk/src/test/java/org/apache/hadoop/hbase/regionserver/wal/TestCompressor.java> <https://builds.apache.org/job/HBase-0.94-security/ws/trunk/src/test/java/org/apache/hadoop/hbase/util/hbck/TestOfflineMetaRebuildOverlap.java> <https://builds.apache.org/job/HBase-0.94-security/ws/trunk/src/test/java/org/apache/hadoop/hbase/coprocessor/TestMasterCoprocessorExceptionWithAbort.java> <https://builds.apache.org/job/HBase-0.94-security/ws/trunk/src/test/java/org/apache/hadoop/hbase/util/TestMiniClusterLoadParallel.java> <https://builds.apache.org/job/HBase-0.94-security/ws/trunk/src/test/java/org/apache/hadoop/hbase/util/MockServer.java> <https://builds.apache.org/job/HBase-0.94-security/ws/trunk/src/test/java/org/apache/hadoop/hbase/mapreduce/TestTableInputFormatScan1.java> <https://builds.apache.org/job/HBase-0.94-security/ws/trunk/src/test/java/org/apache/hadoop/hbase/TestGlobalMemStoreSize.java> <https://builds.apache.org/job/HBase-0.94-security/ws/trunk/src/test/java/org/apache/hadoop/hbase/mapreduce/hadoopbackport/TestJarFinder.java> <https://builds.apache.org/job/HBase-0.94-security/ws/trunk/src/test/java/org/apache/hadoop/hbase/regionserver/TestScanWithBloomError.java> <https://builds.apache.org/job/HBase-0.94-security/ws/trunk/security/src/test/java/org/apache/hadoop/hbase/security/access/TestTablePermissions.java> <https://builds.apache.org/job/HBase-0.94-security/ws/trunk/src/test/java/org/apache/hadoop/hbase/rest/TestSchemaResource.java> <https://builds.apache.org/job/HBase-0.94-security/ws/trunk/src/test/java/org/apache/hadoop/hbase/client/TestTimestampsFilter.java> <https://builds.apache.org/job/HBase-0.94-security/ws/trunk/src/test/java/org/apache/hadoop/hbase/mapreduce/TestTableMapReduce.java> <https://builds.apache.org/job/HBase-0.94-security/ws/trunk/src/test/java/org/apache/hadoop/hbase/regionserver/TestMultiVersionConsistencyControl.java> <https://builds.apache.org/job/HBase-0.94-security/ws/trunk/src/test/java/org/apache/hadoop/hbase/client/TestAdmin.java> <https://builds.apache.org/job/HBase-0.94-security/ws/trunk/src/test/java/org/apache/hadoop/hbase/client/TestRestoreSnapshotFromClient.java> <https://builds.apache.org/job/HBase-0.94-security/ws/trunk/src/test/java/org/apache/hadoop/hbase/filter/TestColumnPrefixFilter.java> <https://builds.apache.org/job/HBase-0.94-security/ws/trunk/src/test/java/org/apache/hadoop/hbase/master/TestDeadServer.java> <https://builds.apache.org/job/HBase-0.94-security/ws/trunk/src/test/java/org/apache/hadoop/hbase/regionserver/HFileReadWriteTest.java> <https://builds.apache.org/job/HBase-0.94-security/ws/trunk/src/test/java/org/apache/hadoop/hbase/util/TestHBaseFsckComparator.java> <https://builds.apache.org/job/HBase-0.94-security/ws/trunk/src/test/java/org/apache/hadoop/hbase/regionserver/TestMemStore.java> <https://builds.apache.org/job/HBase-0.94-security/ws/trunk/security/src/test/java/org/apache/hadoop/hbase/security/access/TestZKPermissionsWatcher.java> <https://builds.apache.org/job/HBase-0.94-security/ws/trunk/src/test/java/org/apache/hadoop/hbase/util/TestCoprocessorScanPolicy.java> <https://builds.apache.org/job/HBase-0.94-security/ws/trunk/src/test/java/org/apache/hadoop/hbase/constraint/WorksConstraint.java> <https://builds.apache.org/job/HBase-0.94-security/ws/trunk/src/test/java/org/apache/hadoop/hbase/coprocessor/example/TestBulkDeleteProtocol.java> <https://builds.apache.org/job/HBase-0.94-security/ws/trunk/src/test/java/org/apache/hadoop/hbase/master/cleaner/TestLogsCleaner.java> <https://builds.apache.org/job/HBase-0.94-security/ws/trunk/src/test/java/org/apache/hadoop/hbase/procedure/TestZKProcedureControllers.java> <https://builds.apache.org/job/HBase-0.94-security/ws/trunk/src/test/java/org/apache/hadoop/hbase/client/TestScan.java> <https://builds.apache.org/job/HBase-0.94-security/ws/trunk/src/test/java/org/apache/hadoop/hbase/client/TestSnapshotFromAdmin.java> <https://builds.apache.org/job/HBase-0.94-security/ws/trunk/src/test/java/org/apache/hadoop/hbase/client/TestMetaScanner.java> <https://builds.apache.org/job/HBase-0.94-security/ws/trunk/src/test/java/org/apache/hadoop/hbase/constraint/TestConstraint.java> <https://builds.apache.org/job/HBase-0.94-security/ws/trunk/src/test/java/org/apache/hadoop/hbase/IntegrationTests.java> <https://builds.apache.org/job/HBase-0.94-security/ws/trunk/src/test/java/org/apache/hadoop/hbase/io/TestImmutableBytesWritable.java> <https://builds.apache.org/job/HBase-0.94-security/ws/trunk/src/test/java/org/apache/hadoop/hbase/rest/model/TestVersionModel.java> <https://builds.apache.org/job/HBase-0.94-security/ws/trunk/src/test/java/org/apache/hadoop/hbase/coprocessor/TestBigDecimalColumnInterpreter.java> <https://builds.apache.org/job/HBase-0.94-security/ws/trunk/src/test/java/org/apache/hadoop/hbase/HServerLoad092.java> <https://builds.apache.org/job/HBase-0.94-security/ws/trunk/security/src/test/java/org/apache/hadoop/hbase/mapreduce/TestSecureLoadIncrementalHFilesSplitRecovery.java> <https://builds.apache.org/job/HBase-0.94-security/ws/trunk/src/test/java/org/apache/hadoop/hbase/master/cleaner/TestSnapshotFromMaster.java> <https://builds.apache.org/job/HBase-0.94-security/ws/trunk/src/test/java/org/apache/hadoop/hbase/regionserver/TestKeyValueScanFixture.java> <https://builds.apache.org/job/HBase-0.94-security/ws/trunk/src/test/java/org/apache/hadoop/hbase/client/TestOperation.java> <https://builds.apache.org/job/HBase-0.94-security/ws/trunk/src/test/java/org/apache/hadoop/hbase/io/hfile/KeySampler.java> <https://builds.apache.org/job/HBase-0.94-security/ws/trunk/src/test/java/org/apache/hadoop/hbase/TestLocalHBaseCluster.java> <https://builds.apache.org/job/HBase-0.94-security/ws/trunk/src/test/java/org/apache/hadoop/hbase/filter/TestDependentColumnFilter.java> <https://builds.apache.org/job/HBase-0.94-security/ws/trunk/src/test/java/org/apache/hadoop/hbase/util/StoppableImplementation.java> <https://builds.apache.org/job/HBase-0.94-security/ws/trunk/src/test/java/org/apache/hadoop/hbase/util/TestFSUtils.java> <https://builds.apache.org/job/HBase-0.94-security/ws/trunk/src/test/java/org/apache/hadoop/hbase/client/TestFromClientSide.java> <https://builds.apache.org/job/HBase-0.94-security/ws/trunk/src/test/java/org/apache/hadoop/hbase/coprocessor/TestCoprocessorEndpoint.java> <https://builds.apache.org/job/HBase-0.94-security/ws/trunk/src/test/java/org/apache/hadoop/hbase/util/TestSizeBasedThrottler.java> <https://builds.apache.org/job/HBase-0.94-security/ws/trunk/src/test/java/org/apache/hadoop/hbase/io/hfile/TestHFilePerformance.java> <https://builds.apache.org/job/HBase-0.94-security/ws/trunk/src/test/java/org/apache/hadoop/hbase/rest/TestTableResource.java> <https://builds.apache.org/job/HBase-0.94-security/ws/trunk/src/test/java/org/apache/hadoop/hbase/coprocessor/TestRegionServerCoprocessorExceptionWithRemove.java> <https://builds.apache.org/job/HBase-0.94-security/ws/trunk/src/test/java/org/apache/hadoop/hbase/master/TestRollingRestart.java> <https://builds.apache.org/job/HBase-0.94-security/ws/trunk/src/test/java/org/apache/hadoop/hbase/executor/TestExecutorService.java> <https://builds.apache.org/job/HBase-0.94-security/ws/trunk/src/test/java/org/apache/hadoop/hbase/io/hfile/TestScannerSelectionUsingKeyRange.java> <https://builds.apache.org/job/HBase-0.94-security/ws/trunk/src/test/java/org/apache/hadoop/hbase/io/TestHalfStoreFileReader.java> <https://builds.apache.org/job/HBase-0.94-security/ws/trunk/src/test/java/org/apache/hadoop/hbase/snapshot/TestCopyRecoveredEditsTask.java> <https://builds.apache.org/job/HBase-0.94-security/ws/trunk/src/test/java/org/apache/hadoop/hbase/regionserver/KeyValueScanFixture.java> <https://builds.apache.org/job/HBase-0.94-security/ws/trunk/src/test/java/org/apache/hadoop/hbase/regionserver/TestRSStatusServlet.java> <https://builds.apache.org/job/HBase-0.94-security/ws/trunk/src/test/java/org/apache/hadoop/hbase/TestHTableDescriptor.java> <https://builds.apache.org/job/HBase-0.94-security/ws/trunk/src/test/java/org/apache/hadoop/hbase/util/hbck/TestOfflineMetaRebuildBase.java> <https://builds.apache.org/job/HBase-0.94-security/ws/trunk/src/test/java/org/apache/hadoop/hbase/master/TestMasterRestartAfterDisablingTable.java> <https://builds.apache.org/job/HBase-0.94-security/ws/trunk/src/test/java/org/apache/hadoop/hbase/util/TestFSTableDescriptors.java> <https://builds.apache.org/job/HBase-0.94-security/ws/trunk/src/test/java/org/apache/hadoop/hbase/ipc/TestProtocolExtension.java> <https://builds.apache.org/job/HBase-0.94-security/ws/trunk/src/test/java/org/apache/hadoop/hbase/mapreduce/TestHLogRecordReader.java> <https://builds.apache.org/job/HBase-0.94-security/ws/trunk/src/test/java/org/apache/hadoop/hbase/regionserver/EncodedSeekPerformanceTest.java> <https://builds.apache.org/job/HBase-0.94-security/ws/trunk/src/test/java/org/apache/hadoop/hbase/MultithreadedTestUtil.java> <https://builds.apache.org/job/HBase-0.94-security/ws/trunk/src/test/java/org/apache/hadoop/hbase/client/TestFromClientSide3.java> <https://builds.apache.org/job/HBase-0.94-security/ws/trunk/src/test/java/org/apache/hadoop/hbase/snapshot/TestWALReferenceTask.java> <https://builds.apache.org/job/HBase-0.94-security/ws/trunk/src/test/java/org/apache/hadoop/hbase/IntegrationTestingUtility.java> <https://builds.apache.org/job/HBase-0.94-security/ws/trunk/src/test/java/org/apache/hadoop/hbase/coprocessor/TestRegionObserverStacking.java> <https://builds.apache.org/job/HBase-0.94-security/ws/trunk/src/test/java/org/apache/hadoop/hbase/snapshot/TestFlushSnapshotFromClient.java> <https://builds.apache.org/job/HBase-0.94-security/ws/trunk/src/test/java/org/apache/hadoop/hbase/master/TestMXBean.java> <https://builds.apache.org/job/HBase-0.94-security/ws/trunk/src/test/java/org/apache/hadoop/hbase/regionserver/wal/HLogPerformanceEvaluation.java> <https://builds.apache.org/job/HBase-0.94-security/ws/trunk/src/test/java/org/apache/hadoop/hbase/MapFilePerformanceEvaluation.java> <https://builds.apache.org/job/HBase-0.94-security/ws/trunk/src/test/java/org/apache/hadoop/hbase/util/TestByteBufferUtils.java> <https://builds.apache.org/job/HBase-0.94-security/ws/trunk/src/test/java/org/apache/hadoop/hbase/replication/TestReplicationSource.java> <https://builds.apache.org/job/HBase-0.94-security/ws/trunk/src/test/java/org/apache/hadoop/hbase/client/TestCloneSnapshotFromClient.java> <https://builds.apache.org/job/HBase-0.94-security/ws/trunk/src/test/java/org/apache/hadoop/hbase/coprocessor/TestRegionServerCoprocessorExceptionWithAbort.java> <https://builds.apache.org/job/HBase-0.94-security/ws/trunk/src/test/java/org/apache/hadoop/hbase/master/TestSplitLogManager.java> <https://builds.apache.org/job/HBase-0.94-security/ws/trunk/src/test/java/org/apache/hadoop/hbase/util/TestMergeTool.java> <https://builds.apache.org/job/HBase-0.94-security/ws/trunk/src/test/java/org/apache/hadoop/hbase/client/TestMultiParallel.java> <https://builds.apache.org/job/HBase-0.94-security/ws/trunk/src/test/java/org/apache/hadoop/hbase/procedure/TestProcedure.java> <https://builds.apache.org/job/HBase-0.94-security/ws/trunk/src/test/java/org/apache/hadoop/hbase/master/handler/TestTableDeleteFamilyHandler.java> <https://builds.apache.org/job/HBase-0.94-security/ws/trunk/src/test/java/org/apache/hadoop/hbase/replication/TestReplicationZookeeper.java> <https://builds.apache.org/job/HBase-0.94-security/ws/trunk/src/test/java/org/apache/hadoop/hbase/rest/PerformanceEvaluation.java> <https://builds.apache.org/job/HBase-0.94-security/ws/trunk/src/test/java/org/apache/hadoop/hbase/coprocessor/TestWALObserver.java> <https://builds.apache.org/job/HBase-0.94-security/ws/trunk/src/test/java/org/apache/hadoop/hbase/rest/TestScannerResource.java> <https://builds.apache.org/job/HBase-0.94-security/ws/trunk/src/test/java/org/apache/hadoop/hbase/constraint/AllPassConstraint.java> <https://builds.apache.org/job/HBase-0.94-security/ws/trunk/src/test/java/org/apache/hadoop/hbase/master/metrics/TestMasterStatistics.java> <https://builds.apache.org/job/HBase-0.94-security/ws/trunk/src/test/java/org/apache/hadoop/hbase/replication/TestMultiSlaveReplication.java> <https://builds.apache.org/job/HBase-0.94-security/ws/trunk/src/test/java/org/apache/hadoop/hbase/util/TestRegionSplitCalculator.java> <https://builds.apache.org/job/HBase-0.94-security/ws/trunk/src/test/java/org/apache/hadoop/hbase/regionserver/DataBlockEncodingTool.java> <https://builds.apache.org/job/HBase-0.94-security/ws/trunk/src/test/java/org/apache/hadoop/hbase/TestInfoServers.java> <https://builds.apache.org/job/HBase-0.94-security/ws/trunk/src/test/java/org/apache/hadoop/hbase/rest/client/TestRemoteAdminRetries.java> <https://builds.apache.org/job/HBase-0.94-security/ws/trunk/src/test/java/org/apache/hadoop/hbase/coprocessor/TestOpenTableInCoprocessor.java> <https://builds.apache.org/job/HBase-0.94-security/ws/trunk/src/test/java/org/apache/hadoop/hbase/MiniHBaseCluster.java> <https://builds.apache.org/job/HBase-0.94-security/ws/trunk/src/test/java/org/apache/hadoop/hbase/coprocessor/SimpleRegionObserver.java> <https://builds.apache.org/job/HBase-0.94-security/ws/trunk/src/test/java/org/apache/hadoop/hbase/regionserver/handler/TestCloseRegionHandler.java> <https://builds.apache.org/job/HBase-0.94-security/ws/trunk/src/test/java/org/apache/hadoop/hbase/coprocessor/GenericEndpoint.java> <https://builds.apache.org/job/HBase-0.94-security/ws/trunk/src/test/java/org/apache/hadoop/hbase/io/encoding/TestDataBlockEncoders.java> <https://builds.apache.org/job/HBase-0.94-security/ws/trunk/src/test/java/org/apache/hadoop/hbase/io/hfile/TestForceCacheImportantBlocks.java> <https://builds.apache.org/job/HBase-0.94-security/ws/trunk/src/test/java/org/apache/hadoop/hbase/regionserver/wal/TestWALActionsListener.java> <https://builds.apache.org/job/HBase-0.94-security/ws/trunk/src/test/java/org/apache/hadoop/hbase/regionserver/TestRegionServerMetrics.java> <https://builds.apache.org/job/HBase-0.94-security/ws/trunk/src/test/java/org/apache/hadoop/hbase/mapreduce/TestMultiTableInputFormat.java> <https://builds.apache.org/job/HBase-0.94-security/ws/trunk/src/test/java/org/apache/hadoop/hbase/util/ClassLoaderTestHelper.java> <https://builds.apache.org/job/HBase-0.94-security/ws/trunk/src/test/java/org/apache/hadoop/hbase/io/hfile/TestHFileInlineToRootChunkConversion.java> <https://builds.apache.org/job/HBase-0.94-security/ws/trunk/src/test/java/org/apache/hadoop/hbase/mapred/TestTableInputFormat.java> <https://builds.apache.org/job/HBase-0.94-security/ws/trunk/security/src/test/java/org/apache/hadoop/hbase/security/token/TestZKSecretWatcher.java> <https://builds.apache.org/job/HBase-0.94-security/ws/trunk/src/test/java/org/apache/hadoop/hbase/filter/TestSingleColumnValueExcludeFilter.java> <https://builds.apache.org/job/HBase-0.94-security/ws/trunk/src/test/java/org/apache/hadoop/hbase/coprocessor/TestRegionObserverInterface.java> <https://builds.apache.org/job/HBase-0.94-security/ws/trunk/src/test/java/org/apache/hadoop/hbase/filter/TestFuzzyRowAndColumnRangeFilter.java> <https://builds.apache.org/job/HBase-0.94-security/ws/trunk/src/test/java/org/apache/hadoop/hbase/coprocessor/ColumnAggregationProtocol.java> <https://builds.apache.org/job/HBase-0.94-security/ws/trunk/src/test/java/org/apache/hadoop/hbase/filter/TestBitComparator.java> <https://builds.apache.org/job/HBase-0.94-security/ws/trunk/src/test/java/org/apache/hadoop/hbase/filter/TestColumnCountGetFilter.java> <https://builds.apache.org/job/HBase-0.94-security/ws/trunk/src/test/java/org/apache/hadoop/hbase/metrics/TestMetricsMBeanBase.java> <https://builds.apache.org/job/HBase-0.94-security/ws/trunk/src/test/java/org/apache/hadoop/hbase/rest/model/TestCellSetModel.java> <https://builds.apache.org/job/HBase-0.94-security/ws/trunk/src/test/java/org/apache/hadoop/hbase/regionserver/wal/TestHLogBench.java> <https://builds.apache.org/job/HBase-0.94-security/ws/trunk/security/src/test/java/org/apache/hadoop/hbase/security/access/TestAccessController.java> <https://builds.apache.org/job/HBase-0.94-security/ws/trunk/src/test/java/org/apache/hadoop/hbase/procedure/TestProcedureMember.java> <https://builds.apache.org/job/HBase-0.94-security/ws/trunk/src/test/java/org/apache/hadoop/hbase/mapreduce/TestWALPlayer.java> <https://builds.apache.org/job/HBase-0.94-security/ws/trunk/src/test/java/org/apache/hadoop/hbase/regionserver/TestStoreFile.java> <https://builds.apache.org/job/HBase-0.94-security/ws/trunk/src/test/java/org/apache/hadoop/hbase/replication/TestMasterReplication.java> <https://builds.apache.org/job/HBase-0.94-security/ws/trunk/src/test/java/org/apache/hadoop/hbase/rest/TestStatusResource.java> <https://builds.apache.org/job/HBase-0.94-security/ws/trunk/src/test/java/org/apache/hadoop/hbase/regionserver/TestScanDeleteTracker.java> <https://builds.apache.org/job/HBase-0.94-security/ws/trunk/src/test/java/org/apache/hadoop/hbase/master/TestOpenedRegionHandler.java> <https://builds.apache.org/job/HBase-0.94-security/ws/trunk/src/test/java/org/apache/hadoop/hbase/mapreduce/TestHFileOutputFormat.java> <https://builds.apache.org/job/HBase-0.94-security/ws/trunk/src/test/java/org/apache/hadoop/hbase/HFilePerformanceEvaluation.java> <https://builds.apache.org/job/HBase-0.94-security/ws/trunk/src/test/java/org/apache/hadoop/hbase/backup/TestHFileArchiving.java> <https://builds.apache.org/job/HBase-0.94-security/ws/trunk/src/test/java/org/apache/hadoop/hbase/util/hbck/TestOfflineMetaRebuildHole.java> <https://builds.apache.org/job/HBase-0.94-security/ws/trunk/src/test/java/org/apache/hadoop/hbase/security/TestUser.java> <https://builds.apache.org/job/HBase-0.94-security/ws/trunk/src/test/java/org/apache/hadoop/hbase/TestHServerInfo.java> <https://builds.apache.org/job/HBase-0.94-security/ws/trunk/src/test/java/org/apache/hadoop/hbase/io/encoding/TestLoadAndSwitchEncodeOnDisk.java> <https://builds.apache.org/job/HBase-0.94-security/ws/trunk/src/test/java/org/apache/hadoop/hbase/replication/regionserver/TestReplicationSink.java> <https://builds.apache.org/job/HBase-0.94-security/ws/trunk/src/test/java/org/apache/hadoop/hbase/rest/model/TestColumnSchemaModel.java> <https://builds.apache.org/job/HBase-0.94-security/ws/trunk/src/test/java/org/apache/hadoop/hbase/master/TestActiveMasterManager.java> <https://builds.apache.org/job/HBase-0.94-security/ws/trunk/src/test/java/org/apache/hadoop/hbase/util/ProcessBasedLocalHBaseCluster.java> <https://builds.apache.org/job/HBase-0.94-security/ws/trunk/src/test/java/org/apache/hadoop/hbase/replication/TestReplicationSmallTests.java> <https://builds.apache.org/job/HBase-0.94-security/ws/trunk/src/test/java/org/apache/hadoop/hbase/mapreduce/hadoopbackport/TestInputSampler.java> <https://builds.apache.org/job/HBase-0.94-security/ws/trunk/src/test/java/org/apache/hadoop/hbase/master/TestCatalogJanitor.java> <https://builds.apache.org/job/HBase-0.94-security/ws/trunk/src/test/java/org/apache/hadoop/hbase/util/LoadTestTool.java> <https://builds.apache.org/job/HBase-0.94-security/ws/trunk/src/test/java/org/apache/hadoop/hbase/filter/TestInvocationRecordFilter.java> <https://builds.apache.org/job/HBase-0.94-security/ws/trunk/src/test/java/org/apache/hadoop/hbase/io/hfile/TestHFileBlockCompatibility.java> <https://builds.apache.org/job/HBase-0.94-security/ws/trunk/src/test/java/org/apache/hadoop/hbase/io/hfile/CacheTestUtils.java> <https://builds.apache.org/job/HBase-0.94-security/ws/trunk/src/test/java/org/apache/hadoop/hbase/util/TestHFileArchiveUtil.java> <https://builds.apache.org/job/HBase-0.94-security/ws/trunk/src/test/java/org/apache/hadoop/hbase/master/TestMasterFailover.java> <https://builds.apache.org/job/HBase-0.94-security/ws/trunk/src/test/java/org/apache/hadoop/hbase/client/TestSnapshotsFromAdmin.java> <https://builds.apache.org/job/HBase-0.94-security/ws/trunk/src/test/java/org/apache/hadoop/hbase/util/TestFSHDFSUtils.java> <https://builds.apache.org/job/HBase-0.94-security/ws/trunk/src/test/java/org/apache/hadoop/hbase/regionserver/TestGetClosestAtOrBefore.java> <https://builds.apache.org/job/HBase-0.94-security/ws/trunk/src/test/java/org/apache/hadoop/hbase/util/LoadTestDataGenerator.java> <https://builds.apache.org/job/HBase-0.94-security/ws/trunk/src/test/java/org/apache/hadoop/hbase/regionserver/TestCacheOnWriteInSchema.java> <https://builds.apache.org/job/HBase-0.94-security/ws/trunk/src/test/java/org/apache/hadoop/hbase/regionserver/TestBlocksScanned.java> <https://builds.apache.org/job/HBase-0.94-security/ws/trunk/src/test/java/org/apache/hadoop/hbase/regionserver/wal/TestWALReplayCompressed.java> <https://builds.apache.org/job/HBase-0.94-security/ws/trunk/src/test/java/org/apache/hadoop/hbase/io/encoding/TestEncodedSeekers.java> <https://builds.apache.org/job/HBase-0.94-security/ws/trunk/src/test/java/org/apache/hadoop/hbase/util/TestIdLock.java> <https://builds.apache.org/job/HBase-0.94-security/ws/trunk/src/test/java/org/apache/hadoop/hbase/regionserver/wal/TestHLogSplit.java> <https://builds.apache.org/job/HBase-0.94-security/ws/trunk/src/test/java/org/apache/hadoop/hbase/TestClassFinder.java> <https://builds.apache.org/job/HBase-0.94-security/ws/trunk/src/test/java/org/apache/hadoop/hbase/io/hfile/TestHFileSeek.java> <https://builds.apache.org/job/HBase-0.94-security/ws/trunk/src/test/java/org/apache/hadoop/hbase/errorhandling/TestForeignExceptionDispatcher.java> <https://builds.apache.org/job/HBase-0.94-security/ws/trunk/src/test/java/org/apache/hadoop/hbase/client/TestMetaMigrationRemovingHTD.java> <https://builds.apache.org/job/HBase-0.94-security/ws/trunk/src/test/java/org/apache/hadoop/hbase/mapreduce/TestLoadIncrementalHFiles.java> <https://builds.apache.org/job/HBase-0.94-security/ws/trunk/src/test/java/org/apache/hadoop/hbase/regionserver/TestHRegionServerBulkLoad.java> <https://builds.apache.org/job/HBase-0.94-security/ws/trunk/src/test/java/org/apache/hadoop/hbase/TestHDFSBlocksDistribution.java> <https://builds.apache.org/job/HBase-0.94-security/ws/trunk/src/test/java/org/apache/hadoop/hbase/util/MultiThreadedWriter.java> <https://builds.apache.org/job/HBase-0.94-security/ws/trunk/src/test/java/org/apache/hadoop/hbase/mapreduce/TestTableInputFormatScan2.java> <https://builds.apache.org/job/HBase-0.94-security/ws/trunk/src/test/java/org/apache/hadoop/hbase/coprocessor/TestMasterCoprocessorExceptionWithRemove.java> <https://builds.apache.org/job/HBase-0.94-security/ws/trunk/src/test/java/org/apache/hadoop/hbase/coprocessor/TestMasterObserver.java> <https://builds.apache.org/job/HBase-0.94-security/ws/trunk/src/test/java/org/apache/hadoop/hbase/regionserver/TestMasterAddressManager.java> <https://builds.apache.org/job/HBase-0.94-security/ws/trunk/src/test/java/org/apache/hadoop/hbase/regionserver/TestSeekOptimizations.java> <https://builds.apache.org/job/HBase-0.94-security/ws/trunk/src/test/java/org/apache/hadoop/hbase/PerformanceEvaluation.java> <https://builds.apache.org/job/HBase-0.94-security/ws/trunk/src/test/java/org/apache/hadoop/hbase/coprocessor/TestRegionObserverBypass.java> <https://builds.apache.org/job/HBase-0.94-security/ws/trunk/src/test/java/org/apache/hadoop/hbase/client/TestMultipleTimestamps.java> <https://builds.apache.org/job/HBase-0.94-security/ws/trunk/src/test/java/org/apache/hadoop/hbase/TestSerialization.java> <https://builds.apache.org/job/HBase-0.94-security/ws/trunk/src/test/java/org/apache/hadoop/hbase/regionserver/wal/TestWALReplay.java> <https://builds.apache.org/job/HBase-0.94-security/ws/trunk/src/test/java/org/apache/hadoop/hbase/rest/model/TestTableSchemaModel.java> <https://builds.apache.org/job/HBase-0.94-security/ws/trunk/src/test/java/org/apache/hadoop/hbase/TestHBaseFileSystem.java> <https://builds.apache.org/job/HBase-0.94-security/ws/trunk/src/test/java/org/apache/hadoop/hbase/client/replication/TestReplicationAdmin.java> <https://builds.apache.org/job/HBase-0.94-security/ws/trunk/src/test/java/org/apache/hadoop/hbase/master/TestClockSkewDetection.java> <https://builds.apache.org/job/HBase-0.94-security/ws/trunk/src/test/java/org/apache/hadoop/hbase/io/hfile/TestReseekTo.java> <https://builds.apache.org/job/HBase-0.94-security/ws/trunk/src/test/java/org/apache/hadoop/hbase/rest/TestMultiRowResource.java> <https://builds.apache.org/job/HBase-0.94-security/ws/trunk/src/test/java/org/apache/hadoop/hbase/mapreduce/TestTableSnapshotInputFormat.java> <https://builds.apache.org/job/HBase-0.94-security/ws/trunk/src/test/java/org/apache/hadoop/hbase/snapshot/TestRestoreSnapshotHelper.java> <https://builds.apache.org/job/HBase-0.94-security/ws/trunk/src/test/java/org/apache/hadoop/hbase/client/TestFromClientSideWithCoprocessor.java> <https://builds.apache.org/job/HBase-0.94-security/ws/trunk/src/test/java/org/apache/hadoop/hbase/mapreduce/TestImportTsv.java> <https://builds.apache.org/job/HBase-0.94-security/ws/trunk/src/test/java/org/apache/hadoop/hbase/regionserver/TestParallelPut.java> <https://builds.apache.org/job/HBase-0.94-security/ws/trunk/src/test/java/org/apache/hadoop/hbase/util/hbck/OfflineMetaRebuildTestCore.java> <https://builds.apache.org/job/HBase-0.94-security/ws/trunk/src/test/java/org/apache/hadoop/hbase/regionserver/TestRegionSplitPolicy.java> <https://builds.apache.org/job/HBase-0.94-security/ws/trunk/src/test/java/org/apache/hadoop/hbase/TestServerName.java> <https://builds.apache.org/job/HBase-0.94-security/ws/trunk/src/test/java/org/apache/hadoop/hbase/TestHBaseTestingUtility.java> <https://builds.apache.org/job/HBase-0.94-security/ws/trunk/src/test/java/org/apache/hadoop/hbase/regionserver/metrics/TestSchemaConfigured.java> <https://builds.apache.org/job/HBase-0.94-security/ws/trunk/src/test/java/org/apache/hadoop/hbase/constraint/CheckConfigurationConstraint.java> <https://builds.apache.org/job/HBase-0.94-security/ws/trunk/src/test/java/org/apache/hadoop/hbase/util/TestSortedCopyOnWriteSet.java> <https://builds.apache.org/job/HBase-0.94-security/ws/trunk/src/test/java/org/apache/hadoop/hbase/mapreduce/TestTableSnapshotInputFormatScan.java> <https://builds.apache.org/job/HBase-0.94-security/ws/trunk/src/test/java/org/apache/hadoop/hbase/TestMultiVersions.java> <https://builds.apache.org/job/HBase-0.94-security/ws/trunk/src/test/java/org/apache/hadoop/hbase/util/MultiThreadedReader.java> <https://builds.apache.org/job/HBase-0.94-security/ws/trunk/src/test/java/org/apache/hadoop/hbase/filter/TestRandomRowFilter.java> <https://builds.apache.org/job/HBase-0.94-security/ws/trunk/src/test/java/org/apache/hadoop/hbase/migration/TestMigrationFrom090To092.java> <https://builds.apache.org/job/HBase-0.94-security/ws/trunk/src/test/java/org/apache/hadoop/hbase/client/TestHCM.java> <https://builds.apache.org/job/HBase-0.94-security/ws/trunk/src/test/java/org/apache/hadoop/hbase/regionserver/TestBlocksRead.java> <https://builds.apache.org/job/HBase-0.94-security/ws/trunk/src/test/java/org/apache/hadoop/hbase/io/encoding/TestChangingEncoding.java> <https://builds.apache.org/job/HBase-0.94-security/ws/trunk/src/test/java/org/apache/hadoop/hbase/regionserver/TestCompactSelection.java> <https://builds.apache.org/job/HBase-0.94-security/ws/trunk/src/test/java/org/apache/hadoop/hbase/io/hfile/slab/TestSlab.java> <https://builds.apache.org/job/HBase-0.94-security/ws/trunk/src/test/java/org/apache/hadoop/hbase/io/hfile/TestLruBlockCache.java> <https://builds.apache.org/job/HBase-0.94-security/ws/trunk/src/test/java/org/apache/hadoop/hbase/util/ChaosMonkey.java> <https://builds.apache.org/job/HBase-0.94-security/ws/trunk/src/test/java/org/apache/hadoop/hbase/mapreduce/TsvImporterCustomTestMapper.java> <https://builds.apache.org/job/HBase-0.94-security/ws/trunk/src/test/java/org/apache/hadoop/hbase/io/hfile/RandomSeek.java> <https://builds.apache.org/job/HBase-0.94-security/ws/trunk/src/test/java/org/apache/hadoop/hbase/monitoring/TestTaskMonitor.java> <https://builds.apache.org/job/HBase-0.94-security/ws/trunk/src/test/java/org/apache/hadoop/hbase/regionserver/TestColumnSeeking.java> <https://builds.apache.org/job/HBase-0.94-security/ws/trunk/src/test/java/org/apache/hadoop/hbase/filter/TestSingleColumnValueFilter.java> <https://builds.apache.org/job/HBase-0.94-security/ws/trunk/src/test/java/org/apache/hadoop/hbase/regionserver/wal/TestHLogMethods.java> <https://builds.apache.org/job/HBase-0.94-security/ws/trunk/src/test/java/org/apache/hadoop/hbase/util/TestByteBloomFilter.java> <https://builds.apache.org/job/HBase-0.94-security/ws/trunk/src/test/java/org/apache/hadoop/hbase/snapshot/TestRestoreFlushSnapshotFromClient.java> <https://builds.apache.org/job/HBase-0.94-security/ws/trunk/src/test/java/org/apache/hadoop/hbase/filter/TestPageFilter.java> <https://builds.apache.org/job/HBase-0.94-security/ws/trunk/src/test/java/org/apache/hadoop/hbase/util/TestDefaultEnvironmentEdge.java> <https://builds.apache.org/job/HBase-0.94-security/ws/trunk/security/src/test/java/org/apache/hadoop/hbase/security/token/TestTokenAuthentication.java> <https://builds.apache.org/job/HBase-0.94-security/ws/trunk/src/test/java/org/apache/hadoop/hbase/regionserver/TestHRegionBusyWait.java> <https://builds.apache.org/job/HBase-0.94-security/ws/trunk/src/test/java/org/apache/hadoop/hbase/util/TestFSVisitor.java> <https://builds.apache.org/job/HBase-0.94-security/ws/trunk/src/test/java/org/apache/hadoop/hbase/io/hfile/NanoTimer.java> <https://builds.apache.org/job/HBase-0.94-security/ws/trunk/src/test/java/org/apache/hadoop/hbase/regionserver/TestKeyValueSkipListSet.java> <https://builds.apache.org/job/HBase-0.94-security/ws/trunk/src/test/java/org/apache/hadoop/hbase/rest/model/TestTableInfoModel.java> <https://builds.apache.org/job/HBase-0.94-security/ws/trunk/src/test/java/org/apache/hadoop/hbase/regionserver/NoOpScanPolicyObserver.java> <https://builds.apache.org/job/HBase-0.94-security/ws/trunk/src/test/java/org/apache/hadoop/hbase/zookeeper/TestZKMulti.java> <https://builds.apache.org/job/HBase-0.94-security/ws/trunk/src/test/java/org/apache/hadoop/hbase/util/TestRootPath.java> <https://builds.apache.org/job/HBase-0.94-security/ws/trunk/src/test/java/org/apache/hadoop/hbase/TestFullLogReconstruction.java> <https://builds.apache.org/job/HBase-0.94-security/ws/trunk/src/test/java/org/apache/hadoop/hbase/io/hfile/TestChecksum.java> <https://builds.apache.org/job/HBase-0.94-security/ws/trunk/src/test/java/org/apache/hadoop/hbase/regionserver/TestCompactionWithCoprocessor.java> <https://builds.apache.org/job/HBase-0.94-security/ws/trunk/src/test/java/org/apache/hadoop/hbase/io/hfile/TestHFileDataBlockEncoder.java> <https://builds.apache.org/job/HBase-0.94-security/ws/trunk/src/test/java/org/apache/hadoop/hbase/avro/TestAvroServer.java> <https://builds.apache.org/job/HBase-0.94-security/ws/trunk/src/test/java/org/apache/hadoop/hbase/replication/ReplicationSourceDummy.java> <https://builds.apache.org/job/HBase-0.94-security/ws/trunk/src/test/java/org/apache/hadoop/hbase/client/HConnectionTestingUtility.java> <https://builds.apache.org/job/HBase-0.94-security/ws/trunk/src/test/java/org/apache/hadoop/hbase/regionserver/CheckedArchivingHFileCleaner.java> <https://builds.apache.org/job/HBase-0.94-security/ws/trunk/src/test/java/org/apache/hadoop/hbase/master/TestZKBasedOpenCloseRegion.java> <https://builds.apache.org/job/HBase-0.94-security/ws/trunk/src/test/java/org/apache/hadoop/hbase/HBaseClusterManager.java> <https://builds.apache.org/job/HBase-0.94-security/ws/trunk/src/test/java/org/apache/hadoop/hbase/master/TestMasterFileSystem.java> <https://builds.apache.org/job/HBase-0.94-security/ws/trunk/src/test/java/org/apache/hadoop/hbase/util/TestMiniClusterLoadEncoded.java> <https://builds.apache.org/job/HBase-0.94-security/ws/trunk/src/test/java/org/apache/hadoop/hbase/rest/model/TestTableListModel.java> <https://builds.apache.org/job/HBase-0.94-security/ws/trunk/src/test/java/org/apache/hadoop/hbase/rest/model/TestTableRegionModel.java> <https://builds.apache.org/job/HBase-0.94-security/ws/trunk/src/test/java/org/apache/hadoop/hbase/io/TestHbaseObjectWritable.java> <https://builds.apache.org/job/HBase-0.94-security/ws/trunk/security/src/test/java/org/apache/hadoop/hbase/security/access/TestAccessControlFilter.java> <https://builds.apache.org/job/HBase-0.94-security/ws/trunk/src/test/java/org/apache/hadoop/hbase/regionserver/TestExplicitColumnTracker.java> <https://builds.apache.org/job/HBase-0.94-security/ws/trunk/src/test/java/org/apache/hadoop/hbase/replication/TestReplicationQueueFailoverCompressed.java> <https://builds.apache.org/job/HBase-0.94-security/ws/trunk/src/test/java/org/apache/hadoop/hbase/master/TestDistributedLogSplitting.java> <https://builds.apache.org/job/HBase-0.94-security/ws/trunk/src/test/java/org/apache/hadoop/hbase/IntegrationTestsDriver.java> <https://builds.apache.org/job/HBase-0.94-security/ws/trunk/src/test/java/org/apache/hadoop/hbase/util/MultiThreadedAction.java> <https://builds.apache.org/job/HBase-0.94-security/ws/trunk/src/test/java/org/apache/hadoop/hbase/io/hfile/TestCacheOnWrite.java> <https://builds.apache.org/job/HBase-0.94-security/ws/trunk/src/test/java/org/apache/hadoop/hbase/metrics/TestExponentiallyDecayingSample.java> <https://builds.apache.org/job/HBase-0.94-security/ws/trunk/src/test/java/org/apache/hadoop/hbase/mapreduce/TestMultithreadedTableMapper.java> <https://builds.apache.org/job/HBase-0.94-security/ws/trunk/src/test/java/org/apache/hadoop/hbase/regionserver/TestServerCustomProtocol.java> <https://builds.apache.org/job/HBase-0.94-security/ws/trunk/src/test/java/org/apache/hadoop/hbase/regionserver/TestRSKilledWhenMasterInitializing.java> <https://builds.apache.org/job/HBase-0.94-security/ws/trunk/src/test/java/org/apache/hadoop/hbase/regionserver/TestScanner.java> <https://builds.apache.org/job/HBase-0.94-security/ws/trunk/security/src/test/java/org/apache/hadoop/hbase/mapreduce/TestSecureLoadIncrementalHFiles.java> <https://builds.apache.org/job/HBase-0.94-security/ws/trunk/src/test/java/org/apache/hadoop/hbase/TestRegionRebalancing.java> <https://builds.apache.org/job/HBase-0.94-security/ws/trunk/src/test/java/org/apache/hadoop/hbase/client/TestHConnection.java> <https://builds.apache.org/job/HBase-0.94-security/ws/trunk/src/test/java/org/apache/hadoop/hbase/master/Mocking.java> <https://builds.apache.org/job/HBase-0.94-security/ws/trunk/src/test/java/org/apache/hadoop/hbase/filter/TestPrefixFilter.java> <https://builds.apache.org/job/HBase-0.94-security/ws/trunk/src/test/java/org/apache/hadoop/hbase/regionserver/TestCompoundConfiguration.java> <https://builds.apache.org/job/HBase-0.94-security/ws/trunk/src/test/java/org/apache/hadoop/hbase/io/hfile/TestCachedBlockQueue.java> <https://builds.apache.org/job/HBase-0.94-security/ws/trunk/src/test/java/org/apache/hadoop/hbase/rest/model/TestScannerModel.java> <https://builds.apache.org/job/HBase-0.94-security/ws/trunk/src/test/java/org/apache/hadoop/hbase/catalog/TestMetaReaderEditor.java> <https://builds.apache.org/job/HBase-0.94-security/ws/trunk/src/test/java/org/apache/hadoop/hbase/ipc/TestDelayedRpc.java> <https://builds.apache.org/job/HBase-0.94-security/ws/trunk/src/test/java/org/apache/hadoop/hbase/regionserver/TestHRegionOnCluster.java> <https://builds.apache.org/job/HBase-0.94-security/ws/trunk/src/test/java/org/apache/hadoop/hbase/regionserver/wal/TestHLog.java> <https://builds.apache.org/job/HBase-0.94-security/ws/trunk/src/test/java/org/apache/hadoop/hbase/mapreduce/TestLoadIncrementalHFilesSplitRecovery.java> <https://builds.apache.org/job/HBase-0.94-security/ws/trunk/src/test/java/org/apache/hadoop/hbase/regionserver/wal/TestLogRolling.java> <https://builds.apache.org/job/HBase-0.94-security/ws/trunk/src/test/java/org/apache/hadoop/hbase/io/hfile/TestHFileWriterV2.java> <https://builds.apache.org/job/HBase-0.94-security/ws/trunk/src/test/java/org/apache/hadoop/hbase/util/TestMergeTable.java> <https://builds.apache.org/job/HBase-0.94-security/ws/trunk/src/test/java/org/apache/hadoop/hbase/regionserver/TestMinVersions.java> <https://builds.apache.org/job/HBase-0.94-security/ws/trunk/src/test/java/org/apache/hadoop/hbase/master/TestMaster.java> <https://builds.apache.org/job/HBase-0.94-security/ws/trunk/src/test/java/org/apache/hadoop/hbase/metrics/file/TestTimeStampingMetricsContext.java> <https://builds.apache.org/job/HBase-0.94-security/ws/trunk/src/test/java/org/apache/hadoop/hbase/master/TestMasterZKSessionRecovery.java> <https://builds.apache.org/job/HBase-0.94-security/ws/trunk/src/test/java/org/apache/hadoop/hbase/zookeeper/TestZKLeaderManager.java> <https://builds.apache.org/job/HBase-0.94-security/ws/trunk/src/test/java/org/apache/hadoop/hbase/regionserver/wal/TestCustomWALEditCodec.java> <https://builds.apache.org/job/HBase-0.94-security/ws/trunk/src/test/java/org/apache/hadoop/hbase/client/TestCoprocessorHConnection.java> <https://builds.apache.org/job/HBase-0.94-security/ws/trunk/src/test/java/org/apache/hadoop/hbase/rest/TestGZIPResponseWrapper.java> <https://builds.apache.org/job/HBase-0.94-security/ws/trunk/src/test/java/org/apache/hadoop/hbase/constraint/RuntimeFailConstraint.java> <https://builds.apache.org/job/HBase-0.94-security/ws/trunk/src/test/java/org/apache/hadoop/hbase/util/TestHBaseFsck.java> <https://builds.apache.org/job/HBase-0.94-security/ws/trunk/src/test/java/org/apache/hadoop/hbase/io/hfile/TestBlockCacheColumnFamilySummary.java> <https://builds.apache.org/job/HBase-0.94-security/ws/trunk/src/test/java/org/apache/hadoop/hbase/io/hfile/TestSeekTo.java> <https://builds.apache.org/job/HBase-0.94-security/ws/trunk/src/test/java/org/apache/hadoop/hbase/procedure/TestZKProcedure.java> <https://builds.apache.org/job/HBase-0.94-security/ws/trunk/src/test/java/org/apache/hadoop/hbase/filter/TestColumnRangeFilter.java> <https://builds.apache.org/job/HBase-0.94-security/ws/trunk/src/test/java/org/apache/hadoop/hbase/io/hfile/TestFixedFileTrailer.java> <https://builds.apache.org/job/HBase-0.94-security/ws/trunk/src/test/java/org/apache/hadoop/hbase/io/hfile/KVGenerator.java> <https://builds.apache.org/job/HBase-0.94-security/ws/trunk/src/test/java/org/apache/hadoop/hbase/regionserver/TestMultiColumnScanner.java> <https://builds.apache.org/job/HBase-0.94-security/ws/trunk/src/test/java/org/apache/hadoop/hbase/regionserver/metrics/TestSchemaMetrics.java> <https://builds.apache.org/job/HBase-0.94-security/ws/trunk/src/test/java/org/apache/hadoop/hbase/master/TestRestartCluster.java> <https://builds.apache.org/job/HBase-0.94-security/ws/trunk/src/test/java/org/apache/hadoop/hbase/TestClusterBootOrder.java> <https://builds.apache.org/job/HBase-0.94-security/ws/trunk/src/test/java/org/apache/hadoop/hbase/rest/model/TestCellModel.java> <https://builds.apache.org/job/HBase-0.94-security/ws/trunk/src/test/java/org/apache/hadoop/hbase/master/handler/TestTableDescriptorModification.java> <https://builds.apache.org/job/HBase-0.94-security/ws/trunk/src/test/java/org/apache/hadoop/hbase/regionserver/TestStoreFileBlockCacheSummary.java> <https://builds.apache.org/job/HBase-0.94-security/ws/trunk/src/test/java/org/apache/hadoop/hbase/PerformanceEvaluationCommons.java> <https://builds.apache.org/job/HBase-0.94-security/ws/trunk/src/test/java/org/apache/hadoop/hbase/regionserver/TestScanWildcardColumnTracker.java> <https://builds.apache.org/job/HBase-0.94-security/ws/trunk/src/test/java/org/apache/hadoop/hbase/io/hfile/TestScannerSelectionUsingTTL.java> <https://builds.apache.org/job/HBase-0.94-security/ws/trunk/src/test/java/org/apache/hadoop/hbase/client/TestShell.java> <https://builds.apache.org/job/HBase-0.94-security/ws/trunk/src/test/java/org/apache/hadoop/hbase/filter/TestParseFilter.java> <https://builds.apache.org/job/HBase-0.94-security/ws/trunk/src/test/java/org/apache/hadoop/hbase/rest/client/TestRemoteAdmin.java> <https://builds.apache.org/job/HBase-0.94-security/ws/trunk/src/test/java/org/apache/hadoop/hbase/ipc/TestPBOnWritableRpc.java> <https://builds.apache.org/job/HBase-0.94-security/ws/trunk/src/test/java/org/apache/hadoop/hbase/mapreduce/hadoopbackport/TestInputSamplerTool.java> <https://builds.apache.org/job/HBase-0.94-security/ws/trunk/src/test/java/org/apache/hadoop/hbase/thrift/TestThriftServer.java> <https://builds.apache.org/job/HBase-0.94-security/ws/trunk/src/test/java/org/apache/hadoop/hbase/constraint/AllFailConstraint.java> <https://builds.apache.org/job/HBase-0.94-security/ws/trunk/src/test/java/org/apache/hadoop/hbase/replication/TestReplicationSyncUpTool.java> <https://builds.apache.org/job/HBase-0.94-security/ws/trunk/src/test/java/org/apache/hadoop/hbase/rest/TestScannersWithFilters.java> <https://builds.apache.org/job/HBase-0.94-security/ws/trunk/src/test/java/org/apache/hadoop/hbase/mapreduce/hadoopbackport/TestTotalOrderPartitioner.java> <https://builds.apache.org/job/HBase-0.94-security/ws/trunk/src/test/java/org/apache/hadoop/hbase/ClusterManager.java> <https://builds.apache.org/job/HBase-0.94-security/ws/trunk/src/test/java/org/apache/hadoop/hbase/replication/regionserver/TestReplicationSourceManager.java> <https://builds.apache.org/job/HBase-0.94-security/ws/trunk/src/test/java/org/apache/hadoop/hbase/filter/TestFilterList.java> <https://builds.apache.org/job/HBase-0.94-security/ws/trunk/src/test/java/org/apache/hadoop/hbase/client/TestConnectionUtils.java> <https://builds.apache.org/job/HBase-0.94-security/ws/trunk/src/test/java/org/apache/hadoop/hbase/constraint/TestConstraints.java> <https://builds.apache.org/job/HBase-0.94-security/ws/trunk/src/test/java/org/apache/hadoop/hbase/thrift/TestThriftServerCmdLine.java> <https://builds.apache.org/job/HBase-0.94-security/ws/trunk/src/test/java/org/apache/hadoop/hbase/rest/model/TestStorageClusterVersionModel.java> <https://builds.apache.org/job/HBase-0.94-security/ws/trunk/src/test/java/org/apache/hadoop/hbase/thrift2/TestThriftHBaseServiceHandler.java> <https://builds.apache.org/job/HBase-0.94-security/ws/trunk/src/test/java/org/apache/hadoop/hbase/master/TestMasterStatusServlet.java> <https://builds.apache.org/job/HBase-0.94-security/ws/trunk/src/test/java/org/apache/hadoop/hbase/regionserver/wal/HLogUtilsForTests.java> <https://builds.apache.org/job/HBase-0.94-security/ws/trunk/src/test/java/org/apache/hadoop/hbase/regionserver/wal/TestLRUDictionary.java> <https://builds.apache.org/job/HBase-0.94-security/ws/trunk/src/test/java/org/apache/hadoop/hbase/master/TestMasterShutdown.java> <https://builds.apache.org/job/HBase-0.94-security/ws/trunk/src/test/java/org/apache/hadoop/hbase/master/cleaner/TestCleanerChore.java> <https://builds.apache.org/job/HBase-0.94-security/ws/trunk/src/test/java/org/apache/hadoop/hbase/rest/model/TestRowModel.java> <https://builds.apache.org/job/HBase-0.94-security/ws/trunk/src/test/java/org/apache/hadoop/hbase/coprocessor/TestClassLoading.java> <https://builds.apache.org/job/HBase-0.94-security/ws/trunk/src/test/java/org/apache/hadoop/hbase/IngestIntegrationTestBase.java> <https://builds.apache.org/job/HBase-0.94-security/ws/trunk/src/test/java/org/apache/hadoop/hbase/replication/TestReplicationDisableInactivePeer.java> <https://builds.apache.org/job/HBase-0.94-security/ws/trunk/src/test/java/org/apache/hadoop/hbase/util/MockRegionServerServices.java> <https://builds.apache.org/job/HBase-0.94-security/ws/trunk/src/test/java/org/apache/hadoop/hbase/mapreduce/TestTableSplit.java> <https://builds.apache.org/job/HBase-0.94-security/ws/trunk/src/test/java/org/apache/hadoop/hbase/snapshot/TestSnapshotDescriptionUtils.java> <https://builds.apache.org/job/HBase-0.94-security/ws/trunk/src/test/java/org/apache/hadoop/hbase/master/TestAssignmentManager.java> <https://builds.apache.org/job/HBase-0.94-security/ws/trunk/src/test/java/org/apache/hadoop/hbase/regionserver/TestSplitLogWorker.java> <https://builds.apache.org/job/HBase-0.94-security/ws/trunk/src/test/java/org/apache/hadoop/hbase/regionserver/TestCompactionState.java> <https://builds.apache.org/job/HBase-0.94-security/ws/trunk/src/test/java/org/apache/hadoop/hbase/coprocessor/TestRegionObserverScannerOpenHook.java> <https://builds.apache.org/job/HBase-0.94-security/ws/trunk/src/test/java/org/apache/hadoop/hbase/rest/TestGzipFilter.java> <https://builds.apache.org/job/HBase-0.94-security/ws/trunk/src/test/java/org/apache/hadoop/hbase/regionserver/TestKeyValueHeap.java> <https://builds.apache.org/job/HBase-0.94-security/ws/trunk/src/test/java/org/apache/hadoop/hbase/regionserver/OOMERegionServer.java> <https://builds.apache.org/job/HBase-0.94-security/ws/trunk/src/test/java/org/apache/hadoop/hbase/coprocessor/GenericProtocol.java> <https://builds.apache.org/job/HBase-0.94-security/ws/trunk/src/test/java/org/apache/hadoop/hbase/rest/client/TestRemoteTable.java> <https://builds.apache.org/job/HBase-0.94-security/ws/trunk/src/test/java/org/apache/hadoop/hbase/util/TestPoolMap.java> <https://builds.apache.org/job/HBase-0.94-security/ws/trunk/src/test/java/org/apache/hadoop/hbase/rest/TestRowResource.java> <https://builds.apache.org/job/HBase-0.94-security/ws/trunk/src/test/java/org/apache/hadoop/hbase/regionserver/wal/TestLogRollPeriod.java> <https://builds.apache.org/job/HBase-0.94-security/ws/trunk/src/test/java/org/apache/hadoop/hbase/filter/TestColumnPaginationFilter.java> <https://builds.apache.org/job/HBase-0.94-security/ws/trunk/src/test/java/org/apache/hadoop/hbase/io/hfile/RandomDistribution.java> <https://builds.apache.org/job/HBase-0.94-security/ws/trunk/src/test/java/org/apache/hadoop/hbase/thrift/TestCallQueue.java> <https://builds.apache.org/job/HBase-0.94-security/ws/trunk/security/src/test/java/org/apache/hadoop/hbase/security/access/SecureTestUtil.java> <https://builds.apache.org/job/HBase-0.94-security/ws/trunk/src/test/java/org/apache/hadoop/hbase/io/TestHeapSize.java> <https://builds.apache.org/job/HBase-0.94-security/ws/trunk/src/test/java/org/apache/hadoop/hbase/ResourceChecker.java> <https://builds.apache.org/job/HBase-0.94-security/ws/trunk/src/test/java/org/apache/hadoop/hbase/util/HFileArchiveTestingUtil.java> <https://builds.apache.org/job/HBase-0.94-security/ws/trunk/src/test/java/org/apache/hadoop/hbase/errorhandling/TestForeignExceptionSerialization.java> <https://builds.apache.org/job/HBase-0.94-security/ws/trunk/src/test/java/org/apache/hadoop/hbase/mapreduce/TestSimpleTotalOrderPartitioner.java> <https://builds.apache.org/job/HBase-0.94-security/ws/trunk/src/test/java/org/apache/hadoop/hbase/zookeeper/TestZooKeeperACL.java> <https://builds.apache.org/job/HBase-0.94-security/ws/trunk/src/test/java/org/apache/hadoop/hbase/regionserver/TestKeepDeletes.java> <https://builds.apache.org/job/HBase-0.94-security/ws/trunk/src/test/java/org/apache/hadoop/hbase/mapreduce/TestTimeRangeMapRed.java> <https://builds.apache.org/job/HBase-0.94-security/ws/trunk/src/test/java/org/apache/hadoop/hbase/regionserver/TestQueryMatcher.java> <https://builds.apache.org/job/HBase-0.94-security/ws/trunk/src/test/java/org/apache/hadoop/hbase/avro/TestAvroUtil.java> <https://builds.apache.org/job/HBase-0.94-security/ws/trunk/src/test/java/org/apache/hadoop/hbase/io/hfile/slab/TestSlabCache.java> <https://builds.apache.org/job/HBase-0.94-security/ws/trunk/src/test/java/org/apache/hadoop/hbase/rest/TestVersionResource.java> <https://builds.apache.org/job/HBase-0.94-security/ws/trunk/src/test/java/org/apache/hadoop/hbase/coprocessor/TestAggregateProtocol.java> <https://builds.apache.org/job/HBase-0.94-security/ws/trunk/src/test/java/org/apache/hadoop/hbase/client/TestPutDotHas.java> <https://builds.apache.org/job/HBase-0.94-security/ws/trunk/src/test/java/org/apache/hadoop/hbase/snapshot/TestSnapshotTask.java> <https://builds.apache.org/job/HBase-0.94-security/ws/trunk/src/test/java/org/apache/hadoop/hbase/master/TestMasterTransitions.java> <https://builds.apache.org/job/HBase-0.94-security/ws/trunk/src/test/java/org/apache/hadoop/hbase/MediumTests.java> <https://builds.apache.org/job/HBase-0.94-security/ws/trunk/src/test/java/org/apache/hadoop/hbase/regionserver/TestBatchHRegionLockingAndWrites.java> <https://builds.apache.org/job/HBase-0.94-security/ws/trunk/src/test/java/org/apache/hadoop/hbase/regionserver/TestHRegionInfo.java> <https://builds.apache.org/job/HBase-0.94-security/ws/trunk/src/test/java/org/apache/hadoop/hbase/io/encoding/TestUpgradeFromHFileV1ToEncoding.java> <https://builds.apache.org/job/HBase-0.94-security/ws/trunk/src/test/java/org/apache/hadoop/hbase/LargeTests.java> <https://builds.apache.org/job/HBase-0.94-security/ws/trunk/src/test/java/org/apache/hadoop/hbase/regionserver/TestEndToEndSplitTransaction.java> <https://builds.apache.org/job/HBase-0.94-security/ws/trunk/src/test/java/org/apache/hadoop/hbase/TestHRegionLocation.java> <https://builds.apache.org/job/HBase-0.94-security/ws/trunk/src/test/java/org/apache/hadoop/hbase/io/encoding/RedundantKVGenerator.java> <https://builds.apache.org/job/HBase-0.94-security/ws/trunk/src/test/java/org/apache/hadoop/hbase/HBaseTestCase.java> <https://builds.apache.org/job/HBase-0.94-security/ws/trunk/src/test/java/org/apache/hadoop/hbase/procedure/TestProcedureCoordinator.java> <https://builds.apache.org/job/HBase-0.94-security/ws/trunk/src/test/java/org/apache/hadoop/hbase/util/TestDynamicClassLoader.java> <https://builds.apache.org/job/HBase-0.94-security/ws/trunk/src/test/java/org/apache/hadoop/hbase/io/hfile/slab/TestSingleSizeCache.java> <https://builds.apache.org/job/HBase-0.94-security/ws/trunk/src/test/java/org/apache/hadoop/hbase/mapreduce/MapreduceTestingShim.java> <https://builds.apache.org/job/HBase-0.94-security/ws/trunk/src/test/java/org/apache/hadoop/hbase/zookeeper/TestZooKeeperMainServerArg.java> <https://builds.apache.org/job/HBase-0.94-security/ws/trunk/src/test/java/org/apache/hadoop/hbase/coprocessor/example/TestZooKeeperScanPolicyObserver.java> <https://builds.apache.org/job/HBase-0.94-security/ws/trunk/src/test/java/org/apache/hadoop/hbase/util/TestMiniClusterLoadSequential.java> <https://builds.apache.org/job/HBase-0.94-security/ws/trunk/src/test/java/org/apache/hadoop/hbase/master/snapshot/TestSnapshotManager.java> <https://builds.apache.org/job/HBase-0.94-security/ws/trunk/src/test/java/org/apache/hadoop/hbase/zookeeper/TestHQuorumPeer.java> <https://builds.apache.org/job/HBase-0.94-security/ws/trunk/src/test/java/org/apache/hadoop/hbase/rest/HBaseRESTTestingUtility.java> <https://builds.apache.org/job/HBase-0.94-security/ws/trunk/src/test/java/org/apache/hadoop/hbase/snapshot/TestReferenceRegionHFilesTask.java> <https://builds.apache.org/job/HBase-0.94-security/ws/trunk/src/test/java/org/apache/hadoop/hbase/metrics/TestMetricsHistogram.java> <https://builds.apache.org/job/HBase-0.94-security/ws/trunk/src/test/java/org/apache/hadoop/hbase/TestAcidGuarantees.java> <https://builds.apache.org/job/HBase-0.94-security/ws/trunk/src/test/java/org/apache/hadoop/hbase/filter/TestMultipleColumnPrefixFilter.java> <https://builds.apache.org/job/HBase-0.94-security/ws/trunk/src/test/java/org/apache/hadoop/hbase/regionserver/wal/TestLogRollAbort.java> <https://builds.apache.org/job/HBase-0.94-security/ws/trunk/src/test/java/org/apache/hadoop/hbase/monitoring/TestMemoryBoundedLogMessageBuffer.java> <https://builds.apache.org/job/HBase-0.94-security/ws/trunk/src/test/java/org/apache/hadoop/hbase/zookeeper/TestZKTableReadOnly.java> <https://builds.apache.org/job/HBase-0.94-security/ws/trunk/src/test/java/org/apache/hadoop/hbase/ClassTestFinder.java> <https://builds.apache.org/job/HBase-0.94-security/ws/trunk/src/test/java/org/apache/hadoop/hbase/mapreduce/TestTableInputFormatScanBase.java> <https://builds.apache.org/job/HBase-0.94-security/ws/trunk/src/test/java/org/apache/hadoop/hbase/client/TestHTableUtil.java> <https://builds.apache.org/job/HBase-0.94-security/ws/trunk/src/test/java/org/apache/hadoop/hbase/regionserver/TestMiniBatchOperationInProgress.java> <https://builds.apache.org/job/HBase-0.94-security/ws/trunk/src/test/java/org/apache/hadoop/hbase/io/hfile/TestHFileReaderV1.java> <https://builds.apache.org/job/HBase-0.94-security/ws/trunk/src/test/java/org/apache/hadoop/hbase/KeyValueTestUtil.java> <https://builds.apache.org/job/HBase-0.94-security/ws/trunk/src/test/java/org/apache/hadoop/hbase/client/TestGet.java> <https://builds.apache.org/job/HBase-0.94-security/ws/trunk/src/test/java/org/apache/hadoop/hbase/util/EnvironmentEdgeManagerTestHelper.java> <https://builds.apache.org/job/HBase-0.94-security/ws/trunk/src/test/java/org/apache/hadoop/hbase/master/TestDefaultLoadBalancer.java> <https://builds.apache.org/job/HBase-0.94-security/ws/trunk/src/test/java/org/apache/hadoop/hbase/ClassFinder.java> <https://builds.apache.org/job/HBase-0.94-security/ws/trunk/src/test/java/org/apache/hadoop/hbase/regionserver/wal/TestHLogSplitCompressed.java> <https://builds.apache.org/job/HBase-0.94-security/ws/trunk/src/test/java/org/apache/hadoop/hbase/regionserver/TestWideScanner.java> <https://builds.apache.org/job/HBase-0.94-security/ws/trunk/src/test/java/org/apache/hadoop/hbase/replication/TestReplicationQueueFailover.java> <https://builds.apache.org/job/HBase-0.94-security/ws/trunk/src/test/java/org/apache/hadoop/hbase/client/TestSnapshotFromClient.java> <https://builds.apache.org/job/HBase-0.94-security/ws/trunk/src/test/java/org/apache/hadoop/hbase/util/LoadTestKVGenerator.java> <https://builds.apache.org/job/HBase-0.94-security/ws/trunk/src/test/java/org/apache/hadoop/hbase/TestFSTableDescriptorForceCreation.java> <https://builds.apache.org/job/HBase-0.94-security/ws/trunk/src/test/java/org/apache/hadoop/hbase/TestNodeHealthCheckChore.java> <https://builds.apache.org/job/HBase-0.94-security/ws/trunk/src/test/java/org/apache/hadoop/hbase/master/snapshot/TestSnapshotFileCache.java> <https://builds.apache.org/job/HBase-0.94-security/ws/trunk/src/test/java/org/apache/hadoop/hbase/replication/TestReplicationBase.java> <https://builds.apache.org/job/HBase-0.94-security/ws/trunk/src/test/java/org/apache/hadoop/hbase/TestCheckTestClasses.java> <https://builds.apache.org/job/HBase-0.94-security/ws/trunk/src/test/java/org/apache/hadoop/hbase/zookeeper/TestRecoverableZooKeeper.java> <https://builds.apache.org/job/HBase-0.94-security/ws/trunk/src/test/java/org/apache/hadoop/hbase/util/hbck/HbckTestingUtil.java> <https://builds.apache.org/job/HBase-0.94-security/ws/trunk/src/test/java/org/apache/hadoop/hbase/util/TestThreads.java> <https://builds.apache.org/job/HBase-0.94-security/ws/trunk/src/test/java/org/apache/hadoop/hbase/zookeeper/TestZKTable.java> -s <https://builds.apache.org/job/HBase-0.94-security/ws/trunk/target/generated-test-sources/test-annotations> -g -target 1.6 -source 1.6 -encoding UTF-8 -Xlint:-options
[INFO] Compiling 486 source files to <https://builds.apache.org/job/HBase-0.94-security/ws/trunk/target/test-classes>
[INFO] -------------------------------------------------------------
[ERROR] COMPILATION ERROR : 
[INFO] -------------------------------------------------------------
[ERROR] <https://builds.apache.org/job/HBase-0.94-security/ws/trunk/src/test/java/org/apache/hadoop/hbase/regionserver/TestHRegion.java>:[3265,15] cannot find symbol
symbol  : class DroppedSnapshotException
location: class org.apache.hadoop.hbase.regionserver.TestHRegion
[INFO] 1 error
[INFO] -------------------------------------------------------------
[INFO] ------------------------------------------------------------------------
[INFO] BUILD FAILURE
[INFO] ------------------------------------------------------------------------
[INFO] Total time: 2:39.677s
[INFO] Finished at: Fri Mar 14 21:26:41 UTC 2014
[INFO] Final Memory: 61M/844M
[INFO] ------------------------------------------------------------------------
[ERROR] Failed to execute goal org.apache.maven.plugins:maven-compiler-plugin:2.5.1:testCompile (default-testCompile) on project hbase: Compilation failure
[ERROR] <https://builds.apache.org/job/HBase-0.94-security/ws/trunk/src/test/java/org/apache/hadoop/hbase/regionserver/TestHRegion.java>:[3265,15] cannot find symbol
[ERROR] symbol  : class DroppedSnapshotException
[ERROR] location: class org.apache.hadoop.hbase.regionserver.TestHRegion
[ERROR] -> [Help 1]
org.apache.maven.lifecycle.LifecycleExecutionException: Failed to execute goal org.apache.maven.plugins:maven-compiler-plugin:2.5.1:testCompile (default-testCompile) on project hbase: Compilation failure
<https://builds.apache.org/job/HBase-0.94-security/ws/trunk/src/test/java/org/apache/hadoop/hbase/regionserver/TestHRegion.java>:[3265,15] cannot find symbol
symbol  : class DroppedSnapshotException
location: class org.apache.hadoop.hbase.regionserver.TestHRegion

	at org.apache.maven.lifecycle.internal.MojoExecutor.execute(MojoExecutor.java:213)
	at org.apache.maven.lifecycle.internal.MojoExecutor.execute(MojoExecutor.java:153)
	at org.apache.maven.lifecycle.internal.MojoExecutor.execute(MojoExecutor.java:145)
	at org.apache.maven.lifecycle.internal.MojoExecutor.executeForkedExecutions(MojoExecutor.java:365)
	at org.apache.maven.lifecycle.internal.MojoExecutor.execute(MojoExecutor.java:199)
	at org.apache.maven.lifecycle.internal.MojoExecutor.execute(MojoExecutor.java:153)
	at org.apache.maven.lifecycle.internal.MojoExecutor.execute(MojoExecutor.java:145)
	at org.apache.maven.lifecycle.internal.LifecycleModuleBuilder.buildProject(LifecycleModuleBuilder.java:84)
	at org.apache.maven.lifecycle.internal.LifecycleModuleBuilder.buildProject(LifecycleModuleBuilder.java:59)
	at org.apache.maven.lifecycle.internal.LifecycleStarter.singleThreadedBuild(LifecycleStarter.java:183)
	at org.apache.maven.lifecycle.internal.LifecycleStarter.execute(LifecycleStarter.java:161)
	at org.apache.maven.DefaultMaven.doExecute(DefaultMaven.java:320)
	at org.apache.maven.DefaultMaven.execute(DefaultMaven.java:156)
	at org.apache.maven.cli.MavenCli.execute(MavenCli.java:537)
	at org.apache.maven.cli.MavenCli.doMain(MavenCli.java:196)
	at org.apache.maven.cli.MavenCli.main(MavenCli.java:141)
	at sun.reflect.NativeMethodAccessorImpl.invoke0(Native Method)
	at sun.reflect.NativeMethodAccessorImpl.invoke(NativeMethodAccessorImpl.java:39)
	at sun.reflect.DelegatingMethodAccessorImpl.invoke(DelegatingMethodAccessorImpl.java:25)
	at java.lang.reflect.Method.invoke(Method.java:597)
	at org.codehaus.plexus.classworlds.launcher.Launcher.launchEnhanced(Launcher.java:290)
	at org.codehaus.plexus.classworlds.launcher.Launcher.launch(Launcher.java:230)
	at org.codehaus.plexus.classworlds.launcher.Launcher.mainWithExitCode(Launcher.java:409)
	at org.codehaus.plexus.classworlds.launcher.Launcher.main(Launcher.java:352)
Caused by: org.apache.maven.plugin.CompilationFailureException: Compilation failure
<https://builds.apache.org/job/HBase-0.94-security/ws/trunk/src/test/java/org/apache/hadoop/hbase/regionserver/TestHRegion.java>:[3265,15] cannot find symbol
symbol  : class DroppedSnapshotException
location: class org.apache.hadoop.hbase.regionserver.TestHRegion

	at org.apache.maven.plugin.AbstractCompilerMojo.execute(AbstractCompilerMojo.java:729)
	at org.apache.maven.plugin.TestCompilerMojo.execute(TestCompilerMojo.java:161)
	at org.apache.maven.plugin.DefaultBuildPluginManager.executeMojo(DefaultBuildPluginManager.java:101)
	at org.apache.maven.lifecycle.internal.MojoExecutor.execute(MojoExecutor.java:209)
	... 23 more
[ERROR] 
[ERROR] 
[ERROR] For more information about the errors and possible solutions, please read the following articles:
[ERROR] [Help 1] http://cwiki.apache.org/confluence/display/MAVEN/MojoFailureException
Build step 'Invoke top-level Maven targets' marked build as failure
Archiving artifacts
Error updating JIRA issues. Saving issues for next build.
com.atlassian.jira.rpc.exception.RemotePermissionException: This issue does not exist or you don't have permission to view it.
Recording test results

Mime
View raw message