hbase-builds mailing list archives

Site index · List index
Message view « Date » · « Thread »
Top « Date » · « Thread »
From Apache Jenkins Server <jenk...@builds.apache.org>
Subject Build failed in Jenkins: hbase-0.96 #299
Date Tue, 18 Feb 2014 23:18:22 GMT
See <https://builds.apache.org/job/hbase-0.96/299/changes>

Changes:

[larsh] HBASE-10501 Improve IncreasingToUpperBoundRegionSplitPolicy to avoid too many regions.

[larsh] HBASE-10546 Two scanner objects are open for each hbase map task but only one scanner
object is closed. (Vasu Mariyala)

[stack] HBASE-10539 HRegion.addAndGetGlobalMemstoreSize returns previous size

------------------------------------------
[...truncated 4331 lines...]
Tests run: 10, Failures: 0, Errors: 0, Skipped: 0, Time elapsed: 121.848 sec
Running org.apache.hadoop.hbase.procedure.TestZKProcedureControllers
Tests run: 4, Failures: 0, Errors: 0, Skipped: 0, Time elapsed: 3.24 sec
Running org.apache.hadoop.hbase.procedure.TestZKProcedure
Tests run: 4, Failures: 0, Errors: 0, Skipped: 0, Time elapsed: 3.108 sec
Running org.apache.hadoop.hbase.TestIOFencing
Tests run: 2, Failures: 0, Errors: 0, Skipped: 0, Time elapsed: 123.325 sec

Results :

Tests run: 1526, Failures: 0, Errors: 0, Skipped: 22

[INFO] 
[INFO] --- maven-jar-plugin:2.4:test-jar (default) @ hbase-server ---
[INFO] Building jar: /home/hudson/jenkins-slave/workspace/hbase-0.96/0.96/hbase-server/target/hbase-server-0.96.2-tests.jar
[INFO] 
[INFO] --- maven-source-plugin:2.2.1:jar-no-fork (attach-sources) @ hbase-server ---
[INFO] Building jar: /home/hudson/jenkins-slave/workspace/hbase-0.96/0.96/hbase-server/target/hbase-server-0.96.2-sources.jar
[INFO] 
[INFO] --- maven-jar-plugin:2.4:jar (default-jar) @ hbase-server ---
[INFO] Building jar: /home/hudson/jenkins-slave/workspace/hbase-0.96/0.96/hbase-server/target/hbase-server-0.96.2.jar
[INFO] 
[INFO] --- maven-install-plugin:2.3.1:install (default-install) @ hbase-server ---
[INFO] Installing /home/hudson/jenkins-slave/workspace/hbase-0.96/0.96/hbase-server/target/hbase-server-0.96.2.jar
to /home/jenkins/.m2/repository/org/apache/hbase/hbase-server/0.96.2/hbase-server-0.96.2.jar
[INFO] Installing /home/hudson/jenkins-slave/workspace/hbase-0.96/0.96/hbase-server/pom.xml
to /home/jenkins/.m2/repository/org/apache/hbase/hbase-server/0.96.2/hbase-server-0.96.2.pom
[INFO] Installing /home/hudson/jenkins-slave/workspace/hbase-0.96/0.96/hbase-server/target/hbase-server-0.96.2-tests.jar
to /home/jenkins/.m2/repository/org/apache/hbase/hbase-server/0.96.2/hbase-server-0.96.2-tests.jar
[INFO] Installing /home/hudson/jenkins-slave/workspace/hbase-0.96/0.96/hbase-server/target/hbase-server-0.96.2-sources.jar
to /home/jenkins/.m2/repository/org/apache/hbase/hbase-server/0.96.2/hbase-server-0.96.2-sources.jar
[INFO]                                                                         
[INFO] ------------------------------------------------------------------------
[INFO] Building HBase - Testing Util 0.96.2
[INFO] ------------------------------------------------------------------------
[INFO] 
[INFO] --- maven-remote-resources-plugin:1.4:process (default) @ hbase-testing-util ---
[INFO] 
[INFO] --- maven-resources-plugin:2.6:resources (default-resources) @ hbase-testing-util ---
[INFO] Using 'UTF-8' encoding to copy filtered resources.
[INFO] skip non existing resourceDirectory /home/hudson/jenkins-slave/workspace/hbase-0.96/0.96/hbase-testing-util/src/main/resources
[INFO] Copying 3 resources
[INFO] 
[INFO] --- maven-compiler-plugin:2.5.1:compile (default-compile) @ hbase-testing-util ---
[INFO] No sources to compile
[INFO] 
[INFO] --- maven-resources-plugin:2.6:testResources (default-testResources) @ hbase-testing-util
---
[INFO] Using 'UTF-8' encoding to copy filtered resources.
[INFO] skip non existing resourceDirectory /home/hudson/jenkins-slave/workspace/hbase-0.96/0.96/hbase-testing-util/src/test/resources
[INFO] Copying 3 resources
[INFO] 
[INFO] --- maven-compiler-plugin:2.5.1:testCompile (default-testCompile) @ hbase-testing-util
---
[INFO] No sources to compile
[INFO] 
[INFO] --- maven-surefire-plugin:2.12-TRUNK-HBASE-2:test (default-test) @ hbase-testing-util
---
[INFO] Surefire report directory: /home/hudson/jenkins-slave/workspace/hbase-0.96/0.96/hbase-testing-util/target/surefire-reports
[INFO] Using configured provider org.apache.maven.surefire.junitcore.JUnitCoreProvider

-------------------------------------------------------
 T E S T S
-------------------------------------------------------

Results :

Tests run: 0, Failures: 0, Errors: 0, Skipped: 0

[INFO] 
[INFO] --- maven-surefire-plugin:2.12-TRUNK-HBASE-2:test (secondPartTestsExecution) @ hbase-testing-util
---
[INFO] Surefire report directory: /home/hudson/jenkins-slave/workspace/hbase-0.96/0.96/hbase-testing-util/target/surefire-reports
[INFO] Using configured provider org.apache.maven.surefire.junitcore.JUnitCoreProvider

-------------------------------------------------------
 T E S T S
-------------------------------------------------------

-------------------------------------------------------
 T E S T S
-------------------------------------------------------

Results :

Tests run: 0, Failures: 0, Errors: 0, Skipped: 0

[INFO] 
[INFO] --- maven-jar-plugin:2.4:test-jar (default) @ hbase-testing-util ---
[INFO] Building jar: /home/hudson/jenkins-slave/workspace/hbase-0.96/0.96/hbase-testing-util/target/hbase-testing-util-0.96.2-tests.jar
[INFO] 
[INFO] --- maven-jar-plugin:2.4:jar (default-jar) @ hbase-testing-util ---
[INFO] Building jar: /home/hudson/jenkins-slave/workspace/hbase-0.96/0.96/hbase-testing-util/target/hbase-testing-util-0.96.2.jar
[INFO] 
[INFO] --- maven-install-plugin:2.3.1:install (default-install) @ hbase-testing-util ---
[INFO] Installing /home/hudson/jenkins-slave/workspace/hbase-0.96/0.96/hbase-testing-util/target/hbase-testing-util-0.96.2.jar
to /home/jenkins/.m2/repository/org/apache/hbase/hbase-testing-util/0.96.2/hbase-testing-util-0.96.2.jar
[INFO] Installing /home/hudson/jenkins-slave/workspace/hbase-0.96/0.96/hbase-testing-util/pom.xml
to /home/jenkins/.m2/repository/org/apache/hbase/hbase-testing-util/0.96.2/hbase-testing-util-0.96.2.pom
[INFO] Installing /home/hudson/jenkins-slave/workspace/hbase-0.96/0.96/hbase-testing-util/target/hbase-testing-util-0.96.2-tests.jar
to /home/jenkins/.m2/repository/org/apache/hbase/hbase-testing-util/0.96.2/hbase-testing-util-0.96.2-tests.jar
[INFO]                                                                         
[INFO] ------------------------------------------------------------------------
[INFO] Building HBase - Thrift 0.96.2
[INFO] ------------------------------------------------------------------------
[INFO] 
[INFO] --- maven-antrun-plugin:1.6:run (generate) @ hbase-thrift ---
[INFO] Executing tasks

main:
    [mkdir] Created dir: /home/hudson/jenkins-slave/workspace/hbase-0.96/0.96/hbase-thrift/target/hbase-webapps
     [copy] Copying 17 files to /home/hudson/jenkins-slave/workspace/hbase-0.96/0.96/hbase-thrift/target/hbase-webapps
14/02/18 23:14:43 INFO mortbay.log: Logging to org.slf4j.impl.Log4jLoggerAdapter(org.mortbay.log)
via org.mortbay.log.Slf4jLog
    [mkdir] Created dir: /home/hudson/jenkins-slave/workspace/hbase-0.96/0.96/hbase-thrift/target/hbase-webapps/thrift/WEB-INF
[INFO] Executed tasks
[INFO] 
[INFO] --- build-helper-maven-plugin:1.5:add-source (jspcSource-packageInfo-source) @ hbase-thrift
---
[INFO] Source directory: /home/hudson/jenkins-slave/workspace/hbase-0.96/0.96/hbase-thrift/target/generated-sources/java
added.
[INFO] 
[INFO] --- maven-remote-resources-plugin:1.4:process (default) @ hbase-thrift ---
[INFO] 
[INFO] --- maven-resources-plugin:2.6:resources (default-resources) @ hbase-thrift ---
[INFO] Using 'UTF-8' encoding to copy filtered resources.
[INFO] Copying 18 resources
[INFO] Copying 3 resources
[INFO] 
[INFO] --- maven-compiler-plugin:2.5.1:compile (default-compile) @ hbase-thrift ---
[INFO] Compiling 44 source files to /home/hudson/jenkins-slave/workspace/hbase-0.96/0.96/hbase-thrift/target/classes
[INFO] 
[INFO] --- maven-resources-plugin:2.6:testResources (default-testResources) @ hbase-thrift
---
[INFO] Using 'UTF-8' encoding to copy filtered resources.
[INFO] skip non existing resourceDirectory /home/hudson/jenkins-slave/workspace/hbase-0.96/0.96/hbase-thrift/src/test/resources
[INFO] Copying 3 resources
[INFO] 
[INFO] --- maven-compiler-plugin:2.5.1:testCompile (default-testCompile) @ hbase-thrift ---
[INFO] Compiling 4 source files to /home/hudson/jenkins-slave/workspace/hbase-0.96/0.96/hbase-thrift/target/test-classes
[INFO] 
[INFO] --- maven-surefire-plugin:2.12-TRUNK-HBASE-2:test (default-test) @ hbase-thrift ---
[INFO] Surefire report directory: /home/hudson/jenkins-slave/workspace/hbase-0.96/0.96/hbase-thrift/target/surefire-reports
[INFO] Using configured provider org.apache.maven.surefire.junitcore.JUnitCoreProvider

-------------------------------------------------------
 T E S T S
-------------------------------------------------------
Running org.apache.hadoop.hbase.thrift.TestThriftServer
Tests run: 1, Failures: 0, Errors: 1, Skipped: 0, Time elapsed: 106.175 sec <<< FAILURE!
Running org.apache.hadoop.hbase.thrift2.TestThriftHBaseServiceHandler
Tests run: 1, Failures: 0, Errors: 1, Skipped: 0, Time elapsed: 106.175 sec <<< FAILURE!
Running org.apache.hadoop.hbase.thrift.TestThriftServerCmdLine
Tests run: 1, Failures: 0, Errors: 1, Skipped: 0, Time elapsed: 106.175 sec <<< FAILURE!
Running org.apache.hadoop.hbase.thrift.TestCallQueue
Tests run: 18, Failures: 0, Errors: 0, Skipped: 0, Time elapsed: 106.175 sec

Results :

Tests in error: 
  org.apache.hadoop.hbase.thrift.TestThriftServer: Shutting down
  org.apache.hadoop.hbase.thrift2.TestThriftHBaseServiceHandler: Shutting down
  org.apache.hadoop.hbase.thrift.TestThriftServerCmdLine: Shutting down

Tests run: 21, Failures: 0, Errors: 3, Skipped: 0

[INFO] ------------------------------------------------------------------------
[INFO] Reactor Summary:
[INFO] 
[INFO] HBase ............................................. SUCCESS [12.866s]
[INFO] HBase - Common .................................... SUCCESS [33.529s]
[INFO] HBase - Protocol .................................. SUCCESS [13.019s]
[INFO] HBase - Client .................................... SUCCESS [38.917s]
[INFO] HBase - Hadoop Compatibility ...................... SUCCESS [8.663s]
[INFO] HBase - Hadoop One Compatibility .................. SUCCESS [2.441s]
[INFO] HBase - Prefix Tree ............................... SUCCESS [3.864s]
[INFO] HBase - Server .................................... SUCCESS [2:39:19.268s]
[INFO] HBase - Testing Util .............................. SUCCESS [1.007s]
[INFO] HBase - Thrift .................................... FAILURE [1:50.737s]
[INFO] HBase - Shell ..................................... SKIPPED
[INFO] HBase - Integration Tests ......................... SKIPPED
[INFO] HBase - Examples .................................. SKIPPED
[INFO] HBase - Assembly .................................. SKIPPED
[INFO] ------------------------------------------------------------------------
[INFO] BUILD FAILURE
[INFO] ------------------------------------------------------------------------
[INFO] Total time: 2:43:05.085s
[INFO] Finished at: Tue Feb 18 23:16:33 UTC 2014
[INFO] Final Memory: 40M/390M
[INFO] ------------------------------------------------------------------------
[ERROR] Failed to execute goal org.apache.maven.plugins:maven-surefire-plugin:2.12-TRUNK-HBASE-2:test
(default-test) on project hbase-thrift: There are test failures.
[ERROR] 
[ERROR] Please refer to /home/hudson/jenkins-slave/workspace/hbase-0.96/0.96/hbase-thrift/target/surefire-reports
for the individual test results.
[ERROR] -> [Help 1]
[ERROR] 
[ERROR] To see the full stack trace of the errors, re-run Maven with the -e switch.
[ERROR] Re-run Maven using the -X switch to enable full debug logging.
[ERROR] 
[ERROR] For more information about the errors and possible solutions, please read the following
articles:
[ERROR] [Help 1] http://cwiki.apache.org/confluence/display/MAVEN/MojoFailureException
[ERROR] 
[ERROR] After correcting the problems, you can resume the build with the command
[ERROR]   mvn <goals> -rf :hbase-thrift
Build step 'Invoke top-level Maven targets' marked build as failure
Performing Post build task...
Match found for :.* : True
Logical operation result is TRUE
Running script  :   ZOMBIE_TESTS_COUNT=`jps | grep surefirebooter | wc -l`
  if [[ $ZOMBIE_TESTS_COUNT != 0 ]] ; then
    #It seems sometimes the tests are not dying immediately. Let's give them 10s
    echo "Suspicious java process found - waiting 10s to see if there are just slow to stop"
    sleep 10
    ZOMBIE_TESTS_COUNT=`jps | grep surefirebooter | wc -l`
    if [[ $ZOMBIE_TESTS_COUNT != 0 ]] ; then
      echo "There are $ZOMBIE_TESTS_COUNT zombie tests, they should have been killed by surefire
but survived"
      echo "************ BEGIN zombies jstack extract"
      ZB_STACK=`jps | grep surefirebooter | cut -d ' ' -f 1 | xargs -n 1 jstack | grep ".test"
| grep "\.java"`
      jps | grep surefirebooter | cut -d ' ' -f 1 | xargs -n 1 jstack
      echo "************ END  zombies jstack extract"
      JIRA_COMMENT="$JIRA_COMMENT

     {color:red}-1 core zombie tests{color}.  There are ${ZOMBIE_TESTS_COUNT} zombie test(s):
${ZB_STACK}"
      BAD=1
      jps | grep surefirebooter | cut -d ' ' -f 1 | xargs kill -9
    else
      echo "We're ok: there is no zombie test, but some tests took some time to stop"
    fi
  else
    echo "We're ok: there is no zombie test"
  fi
[hbase-0.96] $ /bin/bash -xe /tmp/hudson6311946902064858284.sh
++ jps
++ grep surefirebooter
++ wc -l
+ ZOMBIE_TESTS_COUNT=3
+ [[ 3 != 0 ]]
+ echo 'Suspicious java process found - waiting 10s to see if there are just slow to stop'
Suspicious java process found - waiting 10s to see if there are just slow to stop
+ sleep 10
++ jps
++ grep surefirebooter
++ wc -l
+ ZOMBIE_TESTS_COUNT=3
+ [[ 3 != 0 ]]
+ echo 'There are 3 zombie tests, they should have been killed by surefire but survived'
There are 3 zombie tests, they should have been killed by surefire but survived
+ echo '************ BEGIN zombies jstack extract'
************ BEGIN zombies jstack extract
++ jps
++ grep surefirebooter
++ cut -d ' ' -f 1
++ xargs -n 1 jstack
++ grep .test
++ grep '\.java'
1906: Unable to open socket file: target process not responding or HotSpot VM not loaded
The -F option can be used when the target process is not responding
+ ZB_STACK=
POST BUILD TASK : FAILURE
END OF POST BUILD TASK : 0
Archiving artifacts
Recording test results
Updating HBASE-10539
Updating HBASE-10501
Updating HBASE-10546

Mime
View raw message