hbase-builds mailing list archives

Site index · List index
Message view « Date » · « Thread »
Top « Date » · « Thread »
From Apache Jenkins Server <jenk...@builds.apache.org>
Subject Build failed in Jenkins: HBase-0.98 #109
Date Mon, 27 Jan 2014 22:28:18 GMT
See <https://builds.apache.org/job/HBase-0.98/109/changes>

Changes:

[stack] HBASE-10423 Report back the message of split or rollback failure to the master (Harsh
J)

------------------------------------------
[...truncated 4501 lines...]
Running org.apache.hadoop.hbase.mapreduce.TestImportExport
Tests run: 10, Failures: 0, Errors: 0, Skipped: 0, Time elapsed: 334.009 sec
Running org.apache.hadoop.hbase.snapshot.TestFlushSnapshotFromClient
Tests run: 7, Failures: 0, Errors: 0, Skipped: 0, Time elapsed: 140.909 sec
Running org.apache.hadoop.hbase.catalog.TestMetaReaderEditorNoCluster
Tests run: 2, Failures: 0, Errors: 0, Skipped: 0, Time elapsed: 4.508 sec
Running org.apache.hadoop.hbase.snapshot.TestRestoreFlushSnapshotFromClient
Tests run: 5, Failures: 0, Errors: 0, Skipped: 0, Time elapsed: 177.022 sec
Running org.apache.hadoop.hbase.catalog.TestCatalogTracker
Tests run: 7, Failures: 0, Errors: 0, Skipped: 0, Time elapsed: 3.369 sec
Running org.apache.hadoop.hbase.catalog.TestMetaReaderEditor
Tests run: 5, Failures: 0, Errors: 0, Skipped: 0, Time elapsed: 33.174 sec
Running org.apache.hadoop.hbase.catalog.TestMetaMigrationConvertingToPB
Tests run: 3, Failures: 0, Errors: 0, Skipped: 0, Time elapsed: 33.052 sec
Running org.apache.hadoop.hbase.client.TestTimestampsFilter
Tests run: 3, Failures: 0, Errors: 0, Skipped: 0, Time elapsed: 31.193 sec
Running org.apache.hadoop.hbase.client.TestFromClientSide3
Tests run: 5, Failures: 0, Errors: 0, Skipped: 0, Time elapsed: 98.557 sec
Running org.apache.hadoop.hbase.client.TestClientTimeouts
Tests run: 1, Failures: 0, Errors: 0, Skipped: 0, Time elapsed: 18.599 sec
Running org.apache.hadoop.hbase.client.TestScannersFromClientSide
Tests run: 5, Failures: 0, Errors: 0, Skipped: 0, Time elapsed: 25.418 sec
Running org.apache.hadoop.hbase.client.TestHCM
Tests run: 15, Failures: 0, Errors: 0, Skipped: 3, Time elapsed: 88.83 sec
Running org.apache.hadoop.hbase.client.TestFromClientSide
Tests run: 74, Failures: 0, Errors: 0, Skipped: 4, Time elapsed: 237.948 sec
Running org.apache.hadoop.hbase.client.TestScannerTimeout
Tests run: 4, Failures: 0, Errors: 0, Skipped: 0, Time elapsed: 62.641 sec
Running org.apache.hadoop.hbase.client.TestHTableMultiplexer
Tests run: 1, Failures: 0, Errors: 0, Skipped: 0, Time elapsed: 24.092 sec
Running org.apache.hadoop.hbase.client.TestMetaScanner
Tests run: 2, Failures: 0, Errors: 0, Skipped: 0, Time elapsed: 59.725 sec
Running org.apache.hadoop.hbase.client.TestHTableUtil
Tests run: 2, Failures: 0, Errors: 0, Skipped: 0, Time elapsed: 13.208 sec
Running org.apache.hadoop.hbase.client.TestFromClientSideWithCoprocessor
Tests run: 74, Failures: 0, Errors: 0, Skipped: 4, Time elapsed: 215.805 sec
Running org.apache.hadoop.hbase.client.TestTableSnapshotScanner
Tests run: 3, Failures: 0, Errors: 0, Skipped: 0, Time elapsed: 160.9 sec
Running org.apache.hadoop.hbase.client.TestSnapshotFromClient
Tests run: 4, Failures: 0, Errors: 0, Skipped: 0, Time elapsed: 44.105 sec
Running org.apache.hadoop.hbase.client.TestHTablePool$TestHTableReusablePool
Tests run: 9, Failures: 0, Errors: 0, Skipped: 0, Time elapsed: 5.807 sec
Running org.apache.hadoop.hbase.client.TestHTablePool$TestHTableThreadLocalPool
Tests run: 9, Failures: 0, Errors: 0, Skipped: 0, Time elapsed: 44.038 sec
Running org.apache.hadoop.hbase.client.TestSnapshotMetadata
Tests run: 4, Failures: 0, Errors: 0, Skipped: 0, Time elapsed: 56.334 sec
Running org.apache.hadoop.hbase.client.TestMultipleTimestamps
Tests run: 8, Failures: 0, Errors: 0, Skipped: 0, Time elapsed: 32.612 sec
Running org.apache.hadoop.hbase.client.TestSnapshotCloneIndependence
Tests run: 6, Failures: 0, Errors: 0, Skipped: 0, Time elapsed: 88.081 sec
Running org.apache.hadoop.hbase.client.TestClientScannerRPCTimeout
Tests run: 1, Failures: 0, Errors: 0, Skipped: 0, Time elapsed: 37.926 sec
Running org.apache.hadoop.hbase.client.replication.TestReplicationAdmin
Tests run: 2, Failures: 0, Errors: 0, Skipped: 0, Time elapsed: 3.023 sec
Running org.apache.hadoop.hbase.client.TestRestoreSnapshotFromClient
Tests run: 5, Failures: 0, Errors: 0, Skipped: 0, Time elapsed: 574.603 sec
Running org.apache.hadoop.hbase.client.TestMultiParallel
Tests run: 12, Failures: 0, Errors: 0, Skipped: 0, Time elapsed: 72.583 sec
Running org.apache.hadoop.hbase.client.TestCloneSnapshotFromClient
Tests run: 4, Failures: 0, Errors: 0, Skipped: 0, Time elapsed: 212.998 sec
Running org.apache.hadoop.hbase.client.TestFromClientSideNoCodec
Tests run: 2, Failures: 0, Errors: 0, Skipped: 0, Time elapsed: 15.689 sec
Running org.apache.hadoop.hbase.constraint.TestConstraint
Tests run: 5, Failures: 0, Errors: 0, Skipped: 0, Time elapsed: 27.206 sec
Running org.apache.hadoop.hbase.rest.TestGetAndPutResource
Tests run: 18, Failures: 0, Errors: 0, Skipped: 0, Time elapsed: 106.033 sec
Running org.apache.hadoop.hbase.rest.TestGzipFilter
Tests run: 2, Failures: 0, Errors: 0, Skipped: 0, Time elapsed: 26.174 sec
Running org.apache.hadoop.hbase.client.TestAdmin
Tests run: 44, Failures: 0, Errors: 0, Skipped: 0, Time elapsed: 492.304 sec
Running org.apache.hadoop.hbase.rest.TestTableScan
Tests run: 6, Failures: 0, Errors: 0, Skipped: 0, Time elapsed: 38.305 sec
Running org.apache.hadoop.hbase.rest.TestMultiRowResource
Tests run: 3, Failures: 0, Errors: 0, Skipped: 0, Time elapsed: 24.798 sec
Running org.apache.hadoop.hbase.rest.TestScannersWithFilters
Tests run: 10, Failures: 0, Errors: 0, Skipped: 0, Time elapsed: 26.259 sec
Running org.apache.hadoop.hbase.rest.TestResourceFilter
Tests run: 1, Failures: 0, Errors: 0, Skipped: 0, Time elapsed: 18.643 sec
Running org.apache.hadoop.hbase.rest.TestScannersWithLabels
Tests run: 2, Failures: 0, Errors: 0, Skipped: 0, Time elapsed: 26.151 sec
Running org.apache.hadoop.hbase.rest.TestDeleteRow
Tests run: 2, Failures: 0, Errors: 0, Skipped: 0, Time elapsed: 29.806 sec
Running org.apache.hadoop.hbase.rest.TestVersionResource
Tests run: 7, Failures: 0, Errors: 0, Skipped: 0, Time elapsed: 18.531 sec
Running org.apache.hadoop.hbase.rest.client.TestRemoteTable
Tests run: 9, Failures: 0, Errors: 0, Skipped: 0, Time elapsed: 57.848 sec
Running org.apache.hadoop.hbase.rest.TestScannerResource
Tests run: 5, Failures: 0, Errors: 0, Skipped: 0, Time elapsed: 36.066 sec
Running org.apache.hadoop.hbase.rest.TestTableResource
Tests run: 8, Failures: 0, Errors: 0, Skipped: 0, Time elapsed: 34.3 sec
Running org.apache.hadoop.hbase.rest.TestStatusResource
Tests run: 2, Failures: 0, Errors: 0, Skipped: 0, Time elapsed: 17.982 sec
Running org.apache.hadoop.hbase.TestIOFencing
Tests run: 2, Failures: 0, Errors: 0, Skipped: 2, Time elapsed: 0.034 sec
Running org.apache.hadoop.hbase.rest.TestSchemaResource
Tests run: 2, Failures: 0, Errors: 0, Skipped: 0, Time elapsed: 26.242 sec
Running org.apache.hadoop.hbase.io.encoding.TestLoadAndSwitchEncodeOnDisk
Tests run: 1, Failures: 0, Errors: 0, Skipped: 0, Time elapsed: 37.805 sec
Running org.apache.hadoop.hbase.io.encoding.TestChangingEncoding
Tests run: 3, Failures: 0, Errors: 0, Skipped: 0, Time elapsed: 132.218 sec
Running org.apache.hadoop.hbase.io.encoding.TestBufferedDataBlockEncoder
Tests run: 1, Failures: 0, Errors: 0, Skipped: 0, Time elapsed: 23.693 sec
Running org.apache.hadoop.hbase.io.encoding.TestDataBlockEncoders
Tests run: 24, Failures: 0, Errors: 0, Skipped: 0, Time elapsed: 239.208 sec
Running org.apache.hadoop.hbase.io.hfile.TestHFileSeek
Tests run: 1, Failures: 0, Errors: 0, Skipped: 0, Time elapsed: 5.172 sec
Running org.apache.hadoop.hbase.io.hfile.slab.TestSlabCache
Tests run: 7, Failures: 0, Errors: 0, Skipped: 0, Time elapsed: 28.24 sec
Running org.apache.hadoop.hbase.io.hfile.slab.TestSingleSizeCache
Tests run: 5, Failures: 0, Errors: 0, Skipped: 0, Time elapsed: 40.066 sec
Running org.apache.hadoop.hbase.io.hfile.TestHFileBlockIndex
Tests run: 10, Failures: 0, Errors: 0, Skipped: 0, Time elapsed: 13.263 sec
Running org.apache.hadoop.hbase.io.hfile.TestScannerSelectionUsingTTL
Tests run: 6, Failures: 0, Errors: 0, Skipped: 0, Time elapsed: 63.803 sec
Running org.apache.hadoop.hbase.io.hfile.TestForceCacheImportantBlocks
Tests run: 2, Failures: 0, Errors: 0, Skipped: 0, Time elapsed: 37.082 sec
Running org.apache.hadoop.hbase.io.hfile.TestHFileBlock
Tests run: 28, Failures: 0, Errors: 0, Skipped: 0, Time elapsed: 125.833 sec
Running org.apache.hadoop.hbase.io.hfile.TestCacheOnWrite
Tests run: 36, Failures: 0, Errors: 0, Skipped: 0, Time elapsed: 90.418 sec
Running org.apache.hadoop.hbase.io.TestFileLink
Tests run: 3, Failures: 0, Errors: 0, Skipped: 0, Time elapsed: 32.75 sec
Running org.apache.hadoop.hbase.TestClusterBootOrder
Tests run: 2, Failures: 0, Errors: 0, Skipped: 0, Time elapsed: 72.92 sec
Running org.apache.hadoop.hbase.migration.TestUpgradeTo96
Tests run: 5, Failures: 0, Errors: 0, Skipped: 0, Time elapsed: 49.74 sec
Running org.apache.hadoop.hbase.migration.TestNamespaceUpgrade
Tests run: 4, Failures: 0, Errors: 0, Skipped: 0, Time elapsed: 150.947 sec
Running org.apache.hadoop.hbase.replication.TestReplicationKillMasterRSCompressed
Tests run: 1, Failures: 0, Errors: 0, Skipped: 0, Time elapsed: 175.448 sec
Running org.apache.hadoop.hbase.replication.TestReplicationDisableInactivePeer
Tests run: 1, Failures: 0, Errors: 0, Skipped: 0, Time elapsed: 130.007 sec
Running org.apache.hadoop.hbase.replication.TestReplicationChangingPeerRegionservers
Tests run: 1, Failures: 0, Errors: 0, Skipped: 0, Time elapsed: 104.038 sec
Running org.apache.hadoop.hbase.replication.TestMultiSlaveReplication
Tests run: 1, Failures: 0, Errors: 0, Skipped: 0, Time elapsed: 81.497 sec
Running org.apache.hadoop.hbase.replication.TestReplicationKillMasterRS
Tests run: 1, Failures: 0, Errors: 0, Skipped: 0, Time elapsed: 110.673 sec
Running org.apache.hadoop.hbase.replication.TestReplicationSyncUpTool
Tests run: 1, Failures: 0, Errors: 0, Skipped: 0, Time elapsed: 128.543 sec
Running org.apache.hadoop.hbase.replication.regionserver.TestReplicationSourceManager
Tests run: 3, Failures: 0, Errors: 0, Skipped: 0, Time elapsed: 8.579 sec
Running org.apache.hadoop.hbase.replication.regionserver.TestReplicationSink
Tests run: 5, Failures: 0, Errors: 0, Skipped: 0, Time elapsed: 34.929 sec
Running org.apache.hadoop.hbase.replication.TestReplicationTrackerZKImpl
Tests run: 4, Failures: 0, Errors: 0, Skipped: 2, Time elapsed: 2.382 sec
Running org.apache.hadoop.hbase.replication.TestReplicationStateZKImpl
Tests run: 6, Failures: 0, Errors: 0, Skipped: 0, Time elapsed: 10.897 sec
Running org.apache.hadoop.hbase.replication.regionserver.TestReplicationHLogReaderManager
Tests run: 8, Failures: 0, Errors: 0, Skipped: 0, Time elapsed: 216.629 sec
Running org.apache.hadoop.hbase.replication.TestReplicationSource
Tests run: 1, Failures: 0, Errors: 0, Skipped: 0, Time elapsed: 6.667 sec
Running org.apache.hadoop.hbase.replication.TestMasterReplication
Tests run: 3, Failures: 0, Errors: 0, Skipped: 0, Time elapsed: 124.288 sec
Running org.apache.hadoop.hbase.replication.TestReplicationSmallTests
Tests run: 9, Failures: 0, Errors: 0, Skipped: 0, Time elapsed: 112.394 sec
Running org.apache.hadoop.hbase.replication.TestReplicationKillSlaveRS
Tests run: 1, Failures: 0, Errors: 0, Skipped: 0, Time elapsed: 85.763 sec
Running org.apache.hadoop.hbase.ipc.TestDelayedRpc
Tests run: 4, Failures: 0, Errors: 0, Skipped: 0, Time elapsed: 4.536 sec
Running org.apache.hadoop.hbase.ipc.TestProtoBufRpc
Tests run: 1, Failures: 0, Errors: 0, Skipped: 0, Time elapsed: 2.226 sec
Running org.apache.hadoop.hbase.ipc.TestHBaseClient
Tests run: 1, Failures: 0, Errors: 0, Skipped: 0, Time elapsed: 0.6 sec
Running org.apache.hadoop.hbase.replication.TestReplicationWithTags
Tests run: 1, Failures: 0, Errors: 0, Skipped: 0, Time elapsed: 49.141 sec
Running org.apache.hadoop.hbase.TestHBaseTestingUtility
Tests run: 7, Failures: 0, Errors: 0, Skipped: 0, Time elapsed: 74.245 sec
Running org.apache.hadoop.hbase.TestZooKeeper
Tests run: 10, Failures: 0, Errors: 0, Skipped: 0, Time elapsed: 138.559 sec

Results :

Tests run: 1758, Failures: 0, Errors: 0, Skipped: 23

[INFO] ------------------------------------------------------------------------
[INFO] Reactor Summary:
[INFO] 
[INFO] HBase ............................................. SUCCESS [15.583s]
[INFO] HBase - Common .................................... SUCCESS [31.358s]
[INFO] HBase - Protocol .................................. SUCCESS [23.463s]
[INFO] HBase - Client .................................... SUCCESS [44.553s]
[INFO] HBase - Hadoop Compatibility ...................... SUCCESS [6.661s]
[INFO] HBase - Hadoop Two Compatibility .................. SUCCESS [5.171s]
[INFO] HBase - Prefix Tree ............................... SUCCESS [6.450s]
[INFO] HBase - Server .................................... FAILURE [2:33:33.489s]
[INFO] HBase - Testing Util .............................. SKIPPED
[INFO] HBase - Thrift .................................... SKIPPED
[INFO] HBase - Shell ..................................... SKIPPED
[INFO] HBase - Integration Tests ......................... SKIPPED
[INFO] HBase - Examples .................................. SKIPPED
[INFO] HBase - Assembly .................................. SKIPPED
[INFO] ------------------------------------------------------------------------
[INFO] BUILD FAILURE
[INFO] ------------------------------------------------------------------------
[INFO] Total time: 2:35:47.624s
[INFO] Finished at: Mon Jan 27 22:26:24 UTC 2014
[INFO] Final Memory: 45M/796M
[INFO] ------------------------------------------------------------------------
[ERROR] Failed to execute goal org.apache.maven.plugins:maven-surefire-plugin:2.12-TRUNK-HBASE-2:test
(secondPartTestsExecution) on project hbase-server: Failure or timeout -> [Help 1]
[ERROR] 
[ERROR] To see the full stack trace of the errors, re-run Maven with the -e switch.
[ERROR] Re-run Maven using the -X switch to enable full debug logging.
[ERROR] 
[ERROR] For more information about the errors and possible solutions, please read the following
articles:
[ERROR] [Help 1] http://cwiki.apache.org/confluence/display/MAVEN/MojoExecutionException
[ERROR] 
[ERROR] After correcting the problems, you can resume the build with the command
[ERROR]   mvn <goals> -rf :hbase-server
Build step 'Invoke top-level Maven targets' marked build as failure
Performing Post build task...
Match found for :.* : True
Logical operation result is TRUE
Running script  :   ZOMBIE_TESTS_COUNT=`jps | grep surefirebooter | wc -l`
  if [[ $ZOMBIE_TESTS_COUNT != 0 ]] ; then
    #It seems sometimes the tests are not dying immediately. Let's give them 10s
    echo "Suspicious java process found - waiting 10s to see if there are just slow to stop"
    sleep 10   
    ZOMBIE_TESTS_COUNT=`jps | grep surefirebooter | wc -l`
    if [[ $ZOMBIE_TESTS_COUNT != 0 ]] ; then
      echo "There are $ZOMBIE_TESTS_COUNT zombie tests, they should have been killed by surefire
but survived"
      echo "************ BEGIN zombies jstack extract"
      ZB_STACK=`jps | grep surefirebooter | cut -d ' ' -f 1 | xargs -n 1 jstack | grep ".test"
| grep "\.java"`
      jps | grep surefirebooter | cut -d ' ' -f 1 | xargs -n 1 jstack
      echo "************ END  zombies jstack extract"
      JIRA_COMMENT="$JIRA_COMMENT

     {color:red}-1 core zombie tests{color}.  There are ${ZOMBIE_TESTS_COUNT} zombie test(s):
${ZB_STACK}"
      BAD=1
      jps | grep surefirebooter | cut -d ' ' -f 1 | xargs kill -9
    else
      echo "We're ok: there is no zombie test, but some tests took some time to stop"
    fi
  else
    echo "We're ok: there is no zombie test"
  fi
[HBase-0.98] $ /bin/bash -xe /tmp/hudson1177249723875396786.sh
++ jps
++ grep surefirebooter
++ wc -l
+ ZOMBIE_TESTS_COUNT=0
+ [[ 0 != 0 ]]
+ echo 'We'\''re ok: there is no zombie test'
We're ok: there is no zombie test
POST BUILD TASK : SUCCESS
END OF POST BUILD TASK : 0
Archiving artifacts
Recording test results
Updating HBASE-10423

Mime
View raw message