hbase-builds mailing list archives

Site index · List index
Message view « Date » · « Thread »
Top « Date » · « Thread »
From Apache Jenkins Server <jenk...@builds.apache.org>
Subject Build failed in Jenkins: HBase-TRUNK #4746
Date Mon, 23 Dec 2013 10:31:21 GMT
See <https://builds.apache.org/job/HBase-TRUNK/4746/changes>

Changes:

[anoopsamjohn] HBASE-10225 Bug in calls to RegionObsever.postScannerFilterRow

[anoopsamjohn] HBASE-9346 HBCK should provide an option to check if regions boundaries are
the same in META and in stores. (Jean Marc)

------------------------------------------
[...truncated 4506 lines...]
Tests run: 5, Failures: 0, Errors: 0, Skipped: 0, Time elapsed: 131.876 sec
Running org.apache.hadoop.hbase.client.TestClientTimeouts
Tests run: 1, Failures: 0, Errors: 0, Skipped: 0, Time elapsed: 18.651 sec
Running org.apache.hadoop.hbase.client.TestScannersFromClientSide
Tests run: 5, Failures: 0, Errors: 0, Skipped: 0, Time elapsed: 31.997 sec
Running org.apache.hadoop.hbase.client.TestHCM
Tests run: 15, Failures: 0, Errors: 0, Skipped: 3, Time elapsed: 112.474 sec
Running org.apache.hadoop.hbase.client.TestScannerTimeout
Tests run: 4, Failures: 0, Errors: 0, Skipped: 0, Time elapsed: 64.148 sec
Running org.apache.hadoop.hbase.client.TestFromClientSide
Tests run: 73, Failures: 0, Errors: 0, Skipped: 4, Time elapsed: 299.969 sec
Running org.apache.hadoop.hbase.client.TestHTableMultiplexer
Tests run: 1, Failures: 0, Errors: 0, Skipped: 0, Time elapsed: 26.708 sec
Running org.apache.hadoop.hbase.client.TestMetaScanner
Tests run: 2, Failures: 0, Errors: 0, Skipped: 0, Time elapsed: 69.2 sec
Running org.apache.hadoop.hbase.client.TestHTableUtil
Tests run: 2, Failures: 0, Errors: 0, Skipped: 0, Time elapsed: 20.863 sec
Running org.apache.hadoop.hbase.client.TestFromClientSideWithCoprocessor
Tests run: 73, Failures: 0, Errors: 0, Skipped: 4, Time elapsed: 264.299 sec
Running org.apache.hadoop.hbase.client.TestTableSnapshotScanner
Tests run: 3, Failures: 0, Errors: 1, Skipped: 0, Time elapsed: 153.751 sec <<< FAILURE!
Running org.apache.hadoop.hbase.client.TestSnapshotFromClient
Tests run: 4, Failures: 0, Errors: 0, Skipped: 0, Time elapsed: 101.773 sec
Running org.apache.hadoop.hbase.client.TestHTablePool$TestHTableReusablePool
Tests run: 9, Failures: 0, Errors: 0, Skipped: 0, Time elapsed: 10.904 sec
Running org.apache.hadoop.hbase.client.TestHTablePool$TestHTableThreadLocalPool
Tests run: 9, Failures: 0, Errors: 0, Skipped: 0, Time elapsed: 89.865 sec
Running org.apache.hadoop.hbase.client.TestSnapshotMetadata
Tests run: 4, Failures: 0, Errors: 0, Skipped: 0, Time elapsed: 66.17 sec
Running org.apache.hadoop.hbase.client.TestMultipleTimestamps
Tests run: 8, Failures: 0, Errors: 0, Skipped: 0, Time elapsed: 43.224 sec
Running org.apache.hadoop.hbase.client.TestSnapshotCloneIndependence
Tests run: 6, Failures: 0, Errors: 0, Skipped: 0, Time elapsed: 246.012 sec
Running org.apache.hadoop.hbase.client.replication.TestReplicationAdmin
Tests run: 2, Failures: 0, Errors: 0, Skipped: 0, Time elapsed: 2.372 sec
Running org.apache.hadoop.hbase.client.TestClientScannerRPCTimeout
Tests run: 1, Failures: 0, Errors: 0, Skipped: 0, Time elapsed: 76.324 sec
Running org.apache.hadoop.hbase.client.TestMultiParallel
Tests run: 12, Failures: 0, Errors: 0, Skipped: 0, Time elapsed: 141.537 sec
Running org.apache.hadoop.hbase.client.TestCloneSnapshotFromClient
Tests run: 4, Failures: 0, Errors: 0, Skipped: 0, Time elapsed: 345.782 sec
Running org.apache.hadoop.hbase.client.TestFromClientSideNoCodec
Tests run: 2, Failures: 0, Errors: 0, Skipped: 0, Time elapsed: 15.03 sec
Running org.apache.hadoop.hbase.constraint.TestConstraint
Tests run: 5, Failures: 0, Errors: 0, Skipped: 0, Time elapsed: 35.57 sec
Running org.apache.hadoop.hbase.client.TestAdmin
Tests run: 44, Failures: 0, Errors: 0, Skipped: 0, Time elapsed: 575.356 sec
Running org.apache.hadoop.hbase.rest.TestGzipFilter
Tests run: 2, Failures: 0, Errors: 0, Skipped: 0, Time elapsed: 37.552 sec
Running org.apache.hadoop.hbase.rest.TestGetAndPutResource
Tests run: 16, Failures: 0, Errors: 0, Skipped: 0, Time elapsed: 129.355 sec
Running org.apache.hadoop.hbase.rest.TestMultiRowResource
Tests run: 3, Failures: 0, Errors: 0, Skipped: 0, Time elapsed: 51.254 sec
Running org.apache.hadoop.hbase.rest.TestScannersWithFilters
Tests run: 10, Failures: 0, Errors: 0, Skipped: 0, Time elapsed: 49.523 sec
Running org.apache.hadoop.hbase.rest.TestScannersWithLabels
Tests run: 2, Failures: 0, Errors: 0, Skipped: 0, Time elapsed: 49.514 sec
Running org.apache.hadoop.hbase.rest.TestResourceFilter
Tests run: 1, Failures: 0, Errors: 0, Skipped: 0, Time elapsed: 17.277 sec
Running org.apache.hadoop.hbase.rest.TestDeleteRow
Tests run: 2, Failures: 0, Errors: 0, Skipped: 0, Time elapsed: 26.854 sec
Running org.apache.hadoop.hbase.rest.TestVersionResource
Tests run: 7, Failures: 0, Errors: 0, Skipped: 0, Time elapsed: 20.257 sec
Running org.apache.hadoop.hbase.rest.client.TestRemoteTable
Tests run: 9, Failures: 0, Errors: 0, Skipped: 0, Time elapsed: 60.817 sec
Running org.apache.hadoop.hbase.rest.TestScannerResource
Tests run: 5, Failures: 0, Errors: 0, Skipped: 0, Time elapsed: 32.087 sec
Running org.apache.hadoop.hbase.rest.TestStatusResource
Tests run: 2, Failures: 0, Errors: 0, Skipped: 0, Time elapsed: 19.507 sec
Running org.apache.hadoop.hbase.rest.TestTableResource
Tests run: 8, Failures: 0, Errors: 0, Skipped: 0, Time elapsed: 34.342 sec
Running org.apache.hadoop.hbase.rest.TestSchemaResource
Tests run: 2, Failures: 0, Errors: 0, Skipped: 0, Time elapsed: 29.506 sec
Running org.apache.hadoop.hbase.io.encoding.TestLoadAndSwitchEncodeOnDisk
Tests run: 1, Failures: 0, Errors: 0, Skipped: 0, Time elapsed: 37.705 sec
Running org.apache.hadoop.hbase.TestIOFencing
Tests run: 2, Failures: 0, Errors: 0, Skipped: 0, Time elapsed: 135.306 sec
Running org.apache.hadoop.hbase.io.encoding.TestChangingEncoding
Tests run: 3, Failures: 0, Errors: 0, Skipped: 0, Time elapsed: 119.654 sec
Running org.apache.hadoop.hbase.io.encoding.TestBufferedDataBlockEncoder
Tests run: 1, Failures: 0, Errors: 0, Skipped: 0, Time elapsed: 22.82 sec
Running org.apache.hadoop.hbase.io.encoding.TestDataBlockEncoders
Tests run: 24, Failures: 0, Errors: 0, Skipped: 0, Time elapsed: 235.135 sec
Running org.apache.hadoop.hbase.io.hfile.TestHFileSeek
Tests run: 1, Failures: 0, Errors: 0, Skipped: 0, Time elapsed: 4.255 sec
Running org.apache.hadoop.hbase.io.hfile.slab.TestSlabCache
Tests run: 7, Failures: 0, Errors: 0, Skipped: 0, Time elapsed: 23.404 sec
Running org.apache.hadoop.hbase.io.hfile.slab.TestSingleSizeCache
Tests run: 5, Failures: 0, Errors: 0, Skipped: 0, Time elapsed: 29.737 sec
Running org.apache.hadoop.hbase.io.hfile.TestHFileBlockIndex
Tests run: 10, Failures: 0, Errors: 0, Skipped: 0, Time elapsed: 10.803 sec
Running org.apache.hadoop.hbase.io.encoding.TestEncodedSeekers
Tests run: 40, Failures: 0, Errors: 0, Skipped: 0, Time elapsed: 544.024 sec
Running org.apache.hadoop.hbase.io.hfile.TestForceCacheImportantBlocks
Tests run: 2, Failures: 0, Errors: 0, Skipped: 0, Time elapsed: 28.99 sec
Running org.apache.hadoop.hbase.io.hfile.TestScannerSelectionUsingTTL
Tests run: 6, Failures: 0, Errors: 0, Skipped: 0, Time elapsed: 62.556 sec
Running org.apache.hadoop.hbase.io.hfile.TestHFileBlock
Tests run: 28, Failures: 0, Errors: 0, Skipped: 0, Time elapsed: 100.235 sec
Running org.apache.hadoop.hbase.io.TestFileLink
Tests run: 3, Failures: 0, Errors: 0, Skipped: 0, Time elapsed: 25.841 sec
Running org.apache.hadoop.hbase.io.hfile.TestCacheOnWrite
Tests run: 36, Failures: 0, Errors: 0, Skipped: 0, Time elapsed: 111.658 sec
Running org.apache.hadoop.hbase.migration.TestUpgradeTo96
Tests run: 5, Failures: 0, Errors: 0, Skipped: 0, Time elapsed: 27.482 sec
Running org.apache.hadoop.hbase.TestClusterBootOrder
Tests run: 2, Failures: 0, Errors: 0, Skipped: 0, Time elapsed: 45.77 sec
Running org.apache.hadoop.hbase.replication.TestReplicationKillMasterRSCompressed
Tests run: 1, Failures: 0, Errors: 0, Skipped: 0, Time elapsed: 82.798 sec
Running org.apache.hadoop.hbase.migration.TestNamespaceUpgrade
Tests run: 4, Failures: 0, Errors: 0, Skipped: 0, Time elapsed: 100.299 sec
Running org.apache.hadoop.hbase.replication.TestReplicationChangingPeerRegionservers
Tests run: 1, Failures: 0, Errors: 0, Skipped: 0, Time elapsed: 55.794 sec
Running org.apache.hadoop.hbase.replication.TestReplicationDisableInactivePeer
Tests run: 1, Failures: 0, Errors: 0, Skipped: 0, Time elapsed: 76.477 sec
Running org.apache.hadoop.hbase.replication.TestMultiSlaveReplication
Tests run: 1, Failures: 0, Errors: 0, Skipped: 0, Time elapsed: 69 sec
Running org.apache.hadoop.hbase.replication.TestReplicationKillMasterRS
Tests run: 1, Failures: 0, Errors: 0, Skipped: 0, Time elapsed: 85.976 sec
Running org.apache.hadoop.hbase.replication.TestReplicationSyncUpTool
Tests run: 1, Failures: 0, Errors: 0, Skipped: 0, Time elapsed: 130.692 sec
Running org.apache.hadoop.hbase.replication.regionserver.TestReplicationSourceManager
Tests run: 3, Failures: 0, Errors: 0, Skipped: 0, Time elapsed: 5.488 sec
Running org.apache.hadoop.hbase.replication.regionserver.TestReplicationSink
Tests run: 5, Failures: 0, Errors: 0, Skipped: 0, Time elapsed: 26.767 sec
Running org.apache.hadoop.hbase.replication.TestReplicationTrackerZKImpl
Tests run: 4, Failures: 0, Errors: 0, Skipped: 2, Time elapsed: 2.56 sec
Running org.apache.hadoop.hbase.replication.TestReplicationStateZKImpl
Tests run: 6, Failures: 0, Errors: 0, Skipped: 0, Time elapsed: 10.919 sec
Running org.apache.hadoop.hbase.replication.regionserver.TestReplicationHLogReaderManager
Tests run: 8, Failures: 0, Errors: 0, Skipped: 0, Time elapsed: 201.566 sec
Running org.apache.hadoop.hbase.replication.TestReplicationSource
Tests run: 1, Failures: 0, Errors: 0, Skipped: 0, Time elapsed: 6.026 sec
Running org.apache.hadoop.hbase.replication.TestReplicationSmallTests
Tests run: 9, Failures: 0, Errors: 0, Skipped: 0, Time elapsed: 96.423 sec
Running org.apache.hadoop.hbase.replication.TestMasterReplication
Tests run: 3, Failures: 0, Errors: 0, Skipped: 0, Time elapsed: 149.051 sec
Running org.apache.hadoop.hbase.ipc.TestDelayedRpc
Tests run: 4, Failures: 0, Errors: 0, Skipped: 0, Time elapsed: 3.396 sec
Running org.apache.hadoop.hbase.ipc.TestProtoBufRpc
Tests run: 1, Failures: 0, Errors: 0, Skipped: 0, Time elapsed: 1.403 sec
Running org.apache.hadoop.hbase.ipc.TestHBaseClient
Tests run: 1, Failures: 0, Errors: 0, Skipped: 0, Time elapsed: 0.319 sec
Running org.apache.hadoop.hbase.replication.TestReplicationKillSlaveRS
Tests run: 1, Failures: 0, Errors: 0, Skipped: 0, Time elapsed: 64.4 sec
Running org.apache.hadoop.hbase.TestHBaseTestingUtility
Tests run: 7, Failures: 0, Errors: 0, Skipped: 0, Time elapsed: 83.352 sec
Running org.apache.hadoop.hbase.TestZooKeeper
Tests run: 10, Failures: 0, Errors: 0, Skipped: 0, Time elapsed: 215.994 sec

Results :

Tests in error: 
  testWithOfflineHBaseMultiRegion(org.apache.hadoop.hbase.client.TestTableSnapshotScanner):
Snapshot 'testWithMultiRegion' wasn't completed in expectedTime:60000 ms

Tests run: 1713, Failures: 0, Errors: 1, Skipped: 20

[INFO] ------------------------------------------------------------------------
[INFO] Reactor Summary:
[INFO] 
[INFO] HBase ............................................. SUCCESS [5.173s]
[INFO] HBase - Common .................................... SUCCESS [24.046s]
[INFO] HBase - Protocol .................................. SUCCESS [18.451s]
[INFO] HBase - Client .................................... SUCCESS [38.388s]
[INFO] HBase - Hadoop Compatibility ...................... SUCCESS [5.396s]
[INFO] HBase - Hadoop Two Compatibility .................. SUCCESS [1.879s]
[INFO] HBase - Prefix Tree ............................... SUCCESS [3.861s]
[INFO] HBase - Server .................................... FAILURE [3:20:17.916s]
[INFO] HBase - Testing Util .............................. SKIPPED
[INFO] HBase - Thrift .................................... SKIPPED
[INFO] HBase - Shell ..................................... SKIPPED
[INFO] HBase - Integration Tests ......................... SKIPPED
[INFO] HBase - Examples .................................. SKIPPED
[INFO] HBase - Assembly .................................. SKIPPED
[INFO] ------------------------------------------------------------------------
[INFO] BUILD FAILURE
[INFO] ------------------------------------------------------------------------
[INFO] Total time: 3:21:55.870s
[INFO] Finished at: Mon Dec 23 10:28:45 UTC 2013
[INFO] Final Memory: 44M/481M
[INFO] ------------------------------------------------------------------------
[ERROR] Failed to execute goal org.apache.maven.plugins:maven-surefire-plugin:2.12-TRUNK-HBASE-2:test
(secondPartTestsExecution) on project hbase-server: Failure or timeout -> [Help 1]
[ERROR] 
[ERROR] To see the full stack trace of the errors, re-run Maven with the -e switch.
[ERROR] Re-run Maven using the -X switch to enable full debug logging.
[ERROR] 
[ERROR] For more information about the errors and possible solutions, please read the following
articles:
[ERROR] [Help 1] http://cwiki.apache.org/confluence/display/MAVEN/MojoExecutionException
[ERROR] 
[ERROR] After correcting the problems, you can resume the build with the command
[ERROR]   mvn <goals> -rf :hbase-server
Build step 'Invoke top-level Maven targets' marked build as failure
Performing Post build task...
Match found for :.* : True
Logical operation result is TRUE
Running script  :   ZOMBIE_TESTS_COUNT=`jps | grep surefirebooter | wc -l`
  if [[ $ZOMBIE_TESTS_COUNT != 0 ]] ; then
    #It seems sometimes the tests are not dying immediately. Let's give them 10s
    echo "Suspicious java process found - waiting 10s to see if there are just slow to stop"
    sleep 10   
    ZOMBIE_TESTS_COUNT=`jps | grep surefirebooter | wc -l`
    if [[ $ZOMBIE_TESTS_COUNT != 0 ]] ; then
      echo "There are $ZOMBIE_TESTS_COUNT zombie tests, they should have been killed by surefire
but survived"
      echo "************ BEGIN zombies jstack extract"
      ZB_STACK=`jps | grep surefirebooter | cut -d ' ' -f 1 | xargs -n 1 jstack | grep ".test"
| grep "\.java"`
      jps | grep surefirebooter | cut -d ' ' -f 1 | xargs -n 1 jstack
      echo "************ END  zombies jstack extract"
      JIRA_COMMENT="$JIRA_COMMENT

     {color:red}-1 core zombie tests{color}.  There are ${ZOMBIE_TESTS_COUNT} zombie test(s):
${ZB_STACK}"
      BAD=1
      jps | grep surefirebooter | cut -d ' ' -f 1 | xargs kill -9
    else
      echo "We're ok: there is no zombie test, but some tests took some time to stop"
    fi
  else
    echo "We're ok: there is no zombie test"
  fi
[HBase-TRUNK] $ /bin/bash -xe /tmp/hudson5659221336083413015.sh
++ grep surefirebooter
++ jps
++ wc -l
+ ZOMBIE_TESTS_COUNT=1
+ [[ 1 != 0 ]]
+ echo 'Suspicious java process found - waiting 10s to see if there are just slow to stop'
Suspicious java process found - waiting 10s to see if there are just slow to stop
+ sleep 10
++ jps
++ grep surefirebooter
++ wc -l
+ ZOMBIE_TESTS_COUNT=1
+ [[ 1 != 0 ]]
+ echo 'There are 1 zombie tests, they should have been killed by surefire but survived'
There are 1 zombie tests, they should have been killed by surefire but survived
+ echo '************ BEGIN zombies jstack extract'
************ BEGIN zombies jstack extract
++ jps
++ grep surefirebooter
++ cut -d ' ' -f 1
++ xargs -n 1 jstack
++ grep .test
++ grep '\.java'
+ ZB_STACK=
POST BUILD TASK : FAILURE
END OF POST BUILD TASK : 0
Archiving artifacts
Recording test results
Updating HBASE-9346
Updating HBASE-10225

Mime
View raw message