hbase-builds mailing list archives

Site index · List index
Message view « Date » · « Thread »
Top « Date » · « Thread »
From apurt...@apache.org
Subject Build failed in Jenkins: HBase-TRUNK #538
Date Thu, 28 Nov 2013 01:37:43 GMT
See <http://jenkins-public.iridiant.net/job/HBase-TRUNK/538/changes>

Changes:

[enis] HBASE-10020 Add maven compile-protobuf profile

[Michael Stack] HBASE-10051 rolling-restart.sh have old value of "zookeeper.znode.unassiged"
config causing infinite loop

[Michael Stack] HBASE-10050 graceful_stop.sh syntax error

[anoopsamjohn] HBASE-7662 [Per-KV security] Per cell ACLs stored in tags - Addendum to fix
javadoc warnings

[tedyu] HBASE-10046 Unmonitored HBase service could accumulate Status objects and OOM

[eclark] HBASE-10039 Fix potential Resource Leak in RpcServer

[eclark] HBASE-10045 HMaster's clear command could conflict with JMX ports

------------------------------------------
[...truncated 6476 lines...]
Running org.apache.hadoop.hbase.coprocessor.TestBigDecimalColumnInterpreter
Tests run: 38, Failures: 0, Errors: 0, Skipped: 0, Time elapsed: 17.368 sec
Running org.apache.hadoop.hbase.coprocessor.TestRegionObserverScannerOpenHook
Tests run: 3, Failures: 0, Errors: 0, Skipped: 0, Time elapsed: 17.441 sec
Running org.apache.hadoop.hbase.mapred.TestTableMapReduceUtil
Tests run: 4, Failures: 0, Errors: 0, Skipped: 0, Time elapsed: 211.79 sec
Running org.apache.hadoop.hbase.coprocessor.TestClassLoading
Tests run: 8, Failures: 0, Errors: 0, Skipped: 0, Time elapsed: 37.766 sec
Running org.apache.hadoop.hbase.coprocessor.TestRowProcessorEndpoint
Tests run: 4, Failures: 0, Errors: 0, Skipped: 0, Time elapsed: 37.95 sec
Running org.apache.hadoop.hbase.coprocessor.TestMasterCoprocessorExceptionWithRemove
Tests run: 1, Failures: 0, Errors: 0, Skipped: 0, Time elapsed: 21.698 sec
Running org.apache.hadoop.hbase.coprocessor.TestOpenTableInCoprocessor
Tests run: 2, Failures: 0, Errors: 0, Skipped: 0, Time elapsed: 23.027 sec
Running org.apache.hadoop.hbase.coprocessor.TestRegionServerCoprocessorExceptionWithAbort
Tests run: 1, Failures: 0, Errors: 0, Skipped: 0, Time elapsed: 25.754 sec
Running org.apache.hadoop.hbase.coprocessor.TestCoprocessorEndpoint
Tests run: 6, Failures: 0, Errors: 0, Skipped: 0, Time elapsed: 18.278 sec
Running org.apache.hadoop.hbase.coprocessor.TestMasterCoprocessorExceptionWithAbort
Tests run: 1, Failures: 0, Errors: 0, Skipped: 0, Time elapsed: 32.004 sec
Running org.apache.hadoop.hbase.coprocessor.TestMasterObserver
Tests run: 6, Failures: 0, Errors: 0, Skipped: 0, Time elapsed: 34.676 sec
Running org.apache.hadoop.hbase.TestMultiVersions
Tests run: 3, Failures: 0, Errors: 0, Skipped: 0, Time elapsed: 26.324 sec
Running org.apache.hadoop.hbase.rest.TestMultiRowResource
Tests run: 3, Failures: 0, Errors: 0, Skipped: 0, Time elapsed: 20.758 sec
Running org.apache.hadoop.hbase.coprocessor.TestRegionObserverInterface
Tests run: 9, Failures: 0, Errors: 0, Skipped: 0, Time elapsed: 65.045 sec
Running org.apache.hadoop.hbase.rest.TestResourceFilter
Tests run: 1, Failures: 0, Errors: 0, Skipped: 0, Time elapsed: 17.062 sec
Running org.apache.hadoop.hbase.rest.TestVersionResource
Tests run: 7, Failures: 0, Errors: 0, Skipped: 0, Time elapsed: 25.336 sec
Running org.apache.hadoop.hbase.rest.TestGzipFilter
Tests run: 2, Failures: 0, Errors: 0, Skipped: 0, Time elapsed: 25.554 sec
Running org.apache.hadoop.hbase.rest.TestStatusResource
Tests run: 2, Failures: 0, Errors: 0, Skipped: 0, Time elapsed: 23.451 sec
Running org.apache.hadoop.hbase.rest.TestScannerResource
Tests run: 5, Failures: 0, Errors: 0, Skipped: 0, Time elapsed: 55.607 sec
Running org.apache.hadoop.hbase.rest.TestSchemaResource
Tests run: 2, Failures: 0, Errors: 0, Skipped: 0, Time elapsed: 30.113 sec
Running org.apache.hadoop.hbase.rest.TestTableResource
Tests run: 8, Failures: 0, Errors: 0, Skipped: 0, Time elapsed: 51.856 sec
Running org.apache.hadoop.hbase.rest.TestScannersWithFilters
Tests run: 10, Failures: 0, Errors: 0, Skipped: 0, Time elapsed: 30.824 sec
Running org.apache.hadoop.hbase.master.handler.TestTableDescriptorModification
Tests run: 3, Failures: 0, Errors: 0, Skipped: 0, Time elapsed: 18.862 sec
Running org.apache.hadoop.hbase.rest.client.TestRemoteTable
Tests run: 9, Failures: 0, Errors: 0, Skipped: 0, Time elapsed: 54.66 sec
Running org.apache.hadoop.hbase.master.handler.TestTableDeleteFamilyHandler
Tests run: 1, Failures: 0, Errors: 0, Skipped: 0, Time elapsed: 21.099 sec
Running org.apache.hadoop.hbase.rest.TestRowResource
Tests run: 15, Failures: 0, Errors: 0, Skipped: 0, Time elapsed: 64.322 sec
Running org.apache.hadoop.hbase.master.TestActiveMasterManager
Tests run: 2, Failures: 0, Errors: 0, Skipped: 0, Time elapsed: 2.467 sec
Running org.apache.hadoop.hbase.master.handler.TestCreateTableHandler
Tests run: 3, Failures: 0, Errors: 0, Skipped: 0, Time elapsed: 44.403 sec
Running org.apache.hadoop.hbase.master.TestMasterMetricsWrapper
Tests run: 1, Failures: 0, Errors: 0, Skipped: 0, Time elapsed: 16.645 sec
Running org.apache.hadoop.hbase.master.TestRegionPlacement
Tests run: 4, Failures: 0, Errors: 0, Skipped: 0, Time elapsed: 43.919 sec
Running org.apache.hadoop.hbase.master.TestMasterShutdown
Tests run: 2, Failures: 0, Errors: 0, Skipped: 0, Time elapsed: 26.641 sec
Running org.apache.hadoop.hbase.master.TestOpenedRegionHandler
Tests run: 2, Failures: 0, Errors: 0, Skipped: 0, Time elapsed: 21.559 sec
Running org.apache.hadoop.hbase.master.TestMaster
Tests run: 4, Failures: 0, Errors: 0, Skipped: 0, Time elapsed: 25.1 sec
Running org.apache.hadoop.hbase.master.TestSplitLogManager
Tests run: 14, Failures: 0, Errors: 0, Skipped: 0, Time elapsed: 90.068 sec
Running org.apache.hadoop.hbase.master.TestMasterFileSystem
Tests run: 2, Failures: 0, Errors: 0, Skipped: 0, Time elapsed: 13.931 sec
Running org.apache.hadoop.hbase.master.TestAssignmentManagerOnCluster
Tests run: 13, Failures: 0, Errors: 0, Skipped: 0, Time elapsed: 47.896 sec
Running org.apache.hadoop.hbase.master.TestMasterRestartAfterDisablingTable
Tests run: 1, Failures: 0, Errors: 0, Skipped: 0, Time elapsed: 19.716 sec
Running org.apache.hadoop.hbase.master.TestDeadServer
Tests run: 3, Failures: 0, Errors: 0, Skipped: 0, Time elapsed: 0.638 sec
Running org.apache.hadoop.hbase.master.balancer.TestBaseLoadBalancer
Tests run: 3, Failures: 0, Errors: 0, Skipped: 0, Time elapsed: 1.222 sec
Running org.apache.hadoop.hbase.master.TestMasterFailover
Tests run: 4, Failures: 0, Errors: 0, Skipped: 0, Time elapsed: 83.101 sec
Running org.apache.hadoop.hbase.master.balancer.TestDefaultLoadBalancer
Tests run: 1, Failures: 0, Errors: 0, Skipped: 0, Time elapsed: 2.856 sec
Running org.apache.hadoop.hbase.master.cleaner.TestHFileCleaner
Tests run: 3, Failures: 0, Errors: 0, Skipped: 0, Time elapsed: 7.896 sec
Running org.apache.hadoop.hbase.master.cleaner.TestLogsCleaner
Tests run: 1, Failures: 0, Errors: 0, Skipped: 0, Time elapsed: 13.521 sec
Running org.apache.hadoop.hbase.master.TestRestartCluster
Tests run: 2, Failures: 0, Errors: 0, Skipped: 0, Time elapsed: 46.391 sec
Running org.apache.hadoop.hbase.master.TestTableLockManager
Tests run: 5, Failures: 0, Errors: 0, Skipped: 0, Time elapsed: 131.835 sec
Running org.apache.hadoop.hbase.master.TestZKBasedOpenCloseRegion
Tests run: 4, Failures: 0, Errors: 0, Skipped: 0, Time elapsed: 29.492 sec
Running org.apache.hadoop.hbase.master.cleaner.TestSnapshotFromMaster
Running org.apache.hadoop.hbase.master.TestMasterStatusServlet
Tests run: 4, Failures: 0, Errors: 0, Skipped: 0, Time elapsed: 2.421 sec
Tests run: 4, Failures: 0, Errors: 0, Skipped: 0, Time elapsed: 38.718 sec
Running org.apache.hadoop.hbase.master.TestMasterNoCluster
Tests run: 4, Failures: 0, Errors: 0, Skipped: 0, Time elapsed: 12.689 sec
Running org.apache.hadoop.hbase.master.TestHMasterRPCException
Tests run: 1, Failures: 0, Errors: 0, Skipped: 0, Time elapsed: 4.305 sec
Running org.apache.hadoop.hbase.master.TestMasterMetrics
Tests run: 2, Failures: 0, Errors: 0, Skipped: 0, Time elapsed: 33.955 sec
Running org.apache.hadoop.hbase.master.TestAssignmentManager
Tests run: 17, Failures: 0, Errors: 0, Skipped: 0, Time elapsed: 10.736 sec
Running org.apache.hadoop.hbase.master.snapshot.TestSnapshotFileCache
Tests run: 4, Failures: 0, Errors: 0, Skipped: 0, Time elapsed: 7.852 sec
Running org.apache.hadoop.hbase.master.TestMasterTransitions
Tests run: 3, Failures: 0, Errors: 0, Skipped: 3, Time elapsed: 25.686 sec
Running org.apache.hadoop.hbase.master.TestMasterFailoverBalancerPersistence
Tests run: 1, Failures: 0, Errors: 0, Skipped: 0, Time elapsed: 20.929 sec
Running org.apache.hadoop.hbase.master.TestClusterStatusPublisher
Tests run: 3, Failures: 0, Errors: 0, Skipped: 0, Time elapsed: 0.77 sec
Running org.apache.hadoop.hbase.master.balancer.TestStochasticLoadBalancer
Tests run: 13, Failures: 0, Errors: 0, Skipped: 0, Time elapsed: 120.113 sec
Running org.apache.hadoop.hbase.backup.example.TestZooKeeperTableArchiveClient
Tests run: 3, Failures: 0, Errors: 0, Skipped: 0, Time elapsed: 9.353 sec
Running org.apache.hadoop.hbase.master.TestRollingRestart
Tests run: 1, Failures: 0, Errors: 0, Skipped: 0, Time elapsed: 57.444 sec
Running org.apache.hadoop.hbase.replication.TestReplicationSource
Tests run: 1, Failures: 0, Errors: 0, Skipped: 0, Time elapsed: 6.779 sec
Running org.apache.hadoop.hbase.replication.regionserver.TestReplicationSourceManager
Tests run: 3, Failures: 0, Errors: 0, Skipped: 0, Time elapsed: 3.324 sec
Running org.apache.hadoop.hbase.constraint.TestConstraint
Tests run: 5, Failures: 0, Errors: 0, Skipped: 0, Time elapsed: 30.859 sec
Running org.apache.hadoop.hbase.replication.regionserver.TestReplicationSink
Tests run: 5, Failures: 0, Errors: 0, Skipped: 0, Time elapsed: 21.942 sec
Running org.apache.hadoop.hbase.replication.TestReplicationStateZKImpl
Tests run: 6, Failures: 0, Errors: 0, Skipped: 0, Time elapsed: 3.354 sec
Running org.apache.hadoop.hbase.replication.TestReplicationDisableInactivePeer
Tests run: 1, Failures: 0, Errors: 0, Skipped: 0, Time elapsed: 55.172 sec
Running org.apache.hadoop.hbase.replication.TestReplicationKillMasterRSCompressed
Tests run: 1, Failures: 0, Errors: 0, Skipped: 0, Time elapsed: 77.462 sec
Running org.apache.hadoop.hbase.replication.TestReplicationSmallTests
Tests run: 9, Failures: 0, Errors: 0, Skipped: 0, Time elapsed: 110.365 sec
Running org.apache.hadoop.hbase.replication.TestReplicationTrackerZKImpl
Tests run: 4, Failures: 0, Errors: 0, Skipped: 2, Time elapsed: 2.719 sec
Running org.apache.hadoop.hbase.backup.TestHFileArchiving
Tests run: 5, Failures: 0, Errors: 0, Skipped: 0, Time elapsed: 242.732 sec
Running org.apache.hadoop.hbase.replication.TestReplicationChangingPeerRegionservers
Tests run: 1, Failures: 0, Errors: 0, Skipped: 0, Time elapsed: 41.499 sec
Running org.apache.hadoop.hbase.replication.TestMasterReplication
Tests run: 3, Failures: 0, Errors: 0, Skipped: 0, Time elapsed: 131.331 sec
Running org.apache.hadoop.hbase.replication.TestReplicationKillSlaveRS
Tests run: 1, Failures: 0, Errors: 0, Skipped: 0, Time elapsed: 86.308 sec
Running org.apache.hadoop.hbase.master.TestDistributedLogSplitting
Tests run: 15, Failures: 0, Errors: 0, Skipped: 0, Time elapsed: 360.493 sec
Running org.apache.hadoop.hbase.replication.TestReplicationKillMasterRS
Tests run: 1, Failures: 0, Errors: 0, Skipped: 0, Time elapsed: 98.746 sec
Running org.apache.hadoop.hbase.replication.TestMultiSlaveReplication
Tests run: 1, Failures: 0, Errors: 0, Skipped: 0, Time elapsed: 54.415 sec
Running org.apache.hadoop.hbase.replication.regionserver.TestReplicationHLogReaderManager
Tests run: 8, Failures: 0, Errors: 0, Skipped: 0, Time elapsed: 321.276 sec

Results :

Failed tests:   testHbckThreadpooling(org.apache.hadoop.hbase.util.TestHBaseFsck): expected:<[]>
but was:<[SERVER_DOES_NOT_MATCH_META]>

Tests run: 1681, Failures: 1, Errors: 0, Skipped: 22

[JENKINS] Recording test results
[INFO] ------------------------------------------------------------------------
[INFO] Reactor Summary:
[INFO] 
[INFO] HBase ............................................. SUCCESS [38.217s]
[INFO] HBase - Common .................................... SUCCESS [58.532s]
[INFO] HBase - Protocol .................................. SUCCESS [23.424s]
[INFO] HBase - Client .................................... SUCCESS [44.376s]
[INFO] HBase - Hadoop Compatibility ...................... SUCCESS [5.944s]
[INFO] HBase - Hadoop One Compatibility .................. SUCCESS [13.504s]
[INFO] HBase - Prefix Tree ............................... SUCCESS [5.161s]
[INFO] HBase - Server .................................... FAILURE [1:16:56.046s]
[INFO] HBase - Testing Util .............................. SKIPPED
[INFO] HBase - Thrift .................................... SKIPPED
[INFO] HBase - Shell ..................................... SKIPPED
[INFO] HBase - Integration Tests ......................... SKIPPED
[INFO] HBase - Examples .................................. SKIPPED
[INFO] HBase - Assembly .................................. SKIPPED
[INFO] ------------------------------------------------------------------------
[INFO] BUILD FAILURE
[INFO] ------------------------------------------------------------------------
[INFO] Total time: 1:20:07.063s
[INFO] Finished at: Thu Nov 28 01:37:39 UTC 2013
[INFO] Final Memory: 68M/492M
[INFO] ------------------------------------------------------------------------
[JENKINS] Archiving <http://jenkins-public.iridiant.net/job/HBase-TRUNK/ws/hbase-common/pom.xml>
to /var/lib/jenkins/jobs/HBase-TRUNK/modules/org.apache.hbase$hbase-common/builds/2013-11-28_00-17-27/archive/org.apache.hbase/hbase-common/0.97.0-SNAPSHOT/hbase-common-0.97.0-SNAPSHOT.pom
[JENKINS] Archiving <http://jenkins-public.iridiant.net/job/HBase-TRUNK/ws/hbase-hadoop-compat/pom.xml>
to /var/lib/jenkins/jobs/HBase-TRUNK/modules/org.apache.hbase$hbase-hadoop-compat/builds/2013-11-28_00-17-27/archive/org.apache.hbase/hbase-hadoop-compat/0.97.0-SNAPSHOT/hbase-hadoop-compat-0.97.0-SNAPSHOT.pom
[JENKINS] Archiving <http://jenkins-public.iridiant.net/job/HBase-TRUNK/ws/hbase-examples/pom.xml>
to /var/lib/jenkins/jobs/HBase-TRUNK/modules/org.apache.hbase$hbase-examples/builds/2013-11-28_00-17-27/archive/org.apache.hbase/hbase-examples/0.97.0-SNAPSHOT/hbase-examples-0.97.0-SNAPSHOT.pom
[JENKINS] Archiving <http://jenkins-public.iridiant.net/job/HBase-TRUNK/ws/hbase-it/pom.xml>
to /var/lib/jenkins/jobs/HBase-TRUNK/modules/org.apache.hbase$hbase-it/builds/2013-11-28_00-17-27/archive/org.apache.hbase/hbase-it/0.97.0-SNAPSHOT/hbase-it-0.97.0-SNAPSHOT.pom
[JENKINS] Archiving <http://jenkins-public.iridiant.net/job/HBase-TRUNK/ws/pom.xml>
to /var/lib/jenkins/jobs/HBase-TRUNK/modules/org.apache.hbase$hbase/builds/2013-11-28_00-17-27/archive/org.apache.hbase/hbase/0.97.0-SNAPSHOT/hbase-0.97.0-SNAPSHOT.pom
[JENKINS] Archiving <http://jenkins-public.iridiant.net/job/HBase-TRUNK/ws/hbase-assembly/pom.xml>
to /var/lib/jenkins/jobs/HBase-TRUNK/modules/org.apache.hbase$hbase-assembly/builds/2013-11-28_00-17-27/archive/org.apache.hbase/hbase-assembly/0.97.0-SNAPSHOT/hbase-assembly-0.97.0-SNAPSHOT.pom
[JENKINS] Archiving <http://jenkins-public.iridiant.net/job/HBase-TRUNK/ws/hbase-thrift/pom.xml>
to /var/lib/jenkins/jobs/HBase-TRUNK/modules/org.apache.hbase$hbase-thrift/builds/2013-11-28_00-17-27/archive/org.apache.hbase/hbase-thrift/0.97.0-SNAPSHOT/hbase-thrift-0.97.0-SNAPSHOT.pom
[JENKINS] Archiving <http://jenkins-public.iridiant.net/job/HBase-TRUNK/ws/hbase-testing-util/pom.xml>
to /var/lib/jenkins/jobs/HBase-TRUNK/modules/org.apache.hbase$hbase-testing-util/builds/2013-11-28_00-17-27/archive/org.apache.hbase/hbase-testing-util/0.97.0-SNAPSHOT/hbase-testing-util-0.97.0-SNAPSHOT.pom
[JENKINS] Archiving <http://jenkins-public.iridiant.net/job/HBase-TRUNK/ws/hbase-client/pom.xml>
to /var/lib/jenkins/jobs/HBase-TRUNK/modules/org.apache.hbase$hbase-client/builds/2013-11-28_00-17-27/archive/org.apache.hbase/hbase-client/0.97.0-SNAPSHOT/hbase-client-0.97.0-SNAPSHOT.pom
[JENKINS] Archiving <http://jenkins-public.iridiant.net/job/HBase-TRUNK/ws/hbase-prefix-tree/pom.xml>
to /var/lib/jenkins/jobs/HBase-TRUNK/modules/org.apache.hbase$hbase-prefix-tree/builds/2013-11-28_00-17-27/archive/org.apache.hbase/hbase-prefix-tree/0.97.0-SNAPSHOT/hbase-prefix-tree-0.97.0-SNAPSHOT.pom
[JENKINS] Archiving <http://jenkins-public.iridiant.net/job/HBase-TRUNK/ws/hbase-protocol/pom.xml>
to /var/lib/jenkins/jobs/HBase-TRUNK/modules/org.apache.hbase$hbase-protocol/builds/2013-11-28_00-17-27/archive/org.apache.hbase/hbase-protocol/0.97.0-SNAPSHOT/hbase-protocol-0.97.0-SNAPSHOT.pom
[JENKINS] Archiving <http://jenkins-public.iridiant.net/job/HBase-TRUNK/ws/hbase-hadoop1-compat/pom.xml>
to /var/lib/jenkins/jobs/HBase-TRUNK/modules/org.apache.hbase$hbase-hadoop1-compat/builds/2013-11-28_00-17-27/archive/org.apache.hbase/hbase-hadoop1-compat/0.97.0-SNAPSHOT/hbase-hadoop1-compat-0.97.0-SNAPSHOT.pom
[JENKINS] Archiving <http://jenkins-public.iridiant.net/job/HBase-TRUNK/ws/hbase-shell/pom.xml>
to /var/lib/jenkins/jobs/HBase-TRUNK/modules/org.apache.hbase$hbase-shell/builds/2013-11-28_00-17-27/archive/org.apache.hbase/hbase-shell/0.97.0-SNAPSHOT/hbase-shell-0.97.0-SNAPSHOT.pom
[JENKINS] Archiving <http://jenkins-public.iridiant.net/job/HBase-TRUNK/ws/hbase-server/pom.xml>
to /var/lib/jenkins/jobs/HBase-TRUNK/modules/org.apache.hbase$hbase-server/builds/2013-11-28_00-17-27/archive/org.apache.hbase/hbase-server/0.97.0-SNAPSHOT/hbase-server-0.97.0-SNAPSHOT.pom
Waiting for Jenkins to finish collecting data
mavenExecutionResult exceptions not empty
message : Failed to execute goal org.apache.maven.plugins:maven-surefire-plugin:2.12-TRUNK-HBASE-2:test
(secondPartTestsExecution) on project hbase-server: Failure or timeout
cause : Failure or timeout
Stack trace : 
org.apache.maven.lifecycle.LifecycleExecutionException: Failed to execute goal org.apache.maven.plugins:maven-surefire-plugin:2.12-TRUNK-HBASE-2:test
(secondPartTestsExecution) on project hbase-server: Failure or timeout
	at org.apache.maven.lifecycle.internal.MojoExecutor.execute(MojoExecutor.java:217)
	at org.apache.maven.lifecycle.internal.MojoExecutor.execute(MojoExecutor.java:153)
	at org.apache.maven.lifecycle.internal.MojoExecutor.execute(MojoExecutor.java:145)
	at org.apache.maven.lifecycle.internal.LifecycleModuleBuilder.buildProject(LifecycleModuleBuilder.java:84)
	at org.apache.maven.lifecycle.internal.LifecycleModuleBuilder.buildProject(LifecycleModuleBuilder.java:59)
	at org.apache.maven.lifecycle.internal.LifecycleStarter.singleThreadedBuild(LifecycleStarter.java:183)
	at org.apache.maven.lifecycle.internal.LifecycleStarter.execute(LifecycleStarter.java:161)
	at org.apache.maven.DefaultMaven.doExecute(DefaultMaven.java:320)
	at org.apache.maven.DefaultMaven.execute(DefaultMaven.java:156)
	at org.jvnet.hudson.maven3.launcher.Maven3Launcher.main(Maven3Launcher.java:79)
	at sun.reflect.NativeMethodAccessorImpl.invoke0(Native Method)
	at sun.reflect.NativeMethodAccessorImpl.invoke(NativeMethodAccessorImpl.java:39)
	at sun.reflect.DelegatingMethodAccessorImpl.invoke(DelegatingMethodAccessorImpl.java:25)
	at java.lang.reflect.Method.invoke(Method.java:597)
	at org.codehaus.plexus.classworlds.launcher.Launcher.launchStandard(Launcher.java:329)
	at org.codehaus.plexus.classworlds.launcher.Launcher.launch(Launcher.java:239)
	at org.jvnet.hudson.maven3.agent.Maven3Main.launch(Maven3Main.java:158)
	at hudson.maven.Maven3Builder.call(Maven3Builder.java:100)
	at hudson.maven.Maven3Builder.call(Maven3Builder.java:66)
	at hudson.remoting.UserRequest.perform(UserRequest.java:118)
	at hudson.remoting.UserRequest.perform(UserRequest.java:48)
	at hudson.remoting.Request$2.run(Request.java:326)
	at hudson.remoting.InterceptingExecutorService$1.call(InterceptingExecutorService.java:72)
	at java.util.concurrent.FutureTask$Sync.innerRun(FutureTask.java:303)
	at java.util.concurrent.FutureTask.run(FutureTask.java:138)
	at java.util.concurrent.ThreadPoolExecutor$Worker.runTask(ThreadPoolExecutor.java:895)
	at java.util.concurrent.ThreadPoolExecutor$Worker.run(ThreadPoolExecutor.java:918)
	at java.lang.Thread.run(Thread.java:662)
Caused by: org.apache.maven.plugin.MojoExecutionException: Failure or timeout
	at org.apache.maven.plugin.surefire.SurefirePlugin.assertNoFailureOrTimeout(SurefirePlugin.java:643)
	at org.apache.maven.plugin.surefire.SurefirePlugin.handleSummary(SurefirePlugin.java:624)
	at org.apache.maven.plugin.surefire.AbstractSurefireMojo.executeAfterPreconditionsChecked(AbstractSurefireMojo.java:137)
	at org.apache.maven.plugin.surefire.AbstractSurefireMojo.execute(AbstractSurefireMojo.java:98)
	at org.apache.maven.plugin.DefaultBuildPluginManager.executeMojo(DefaultBuildPluginManager.java:101)
	at org.apache.maven.lifecycle.internal.MojoExecutor.execute(MojoExecutor.java:209)
	... 27 more
channel stopped
[HBase-TRUNK] $ /bin/bash -xe /tmp/hudson6507057404992689266.sh
++ jps
++ grep surefirebooter
++ wc -l
+ ZOMBIE_TESTS_COUNT=0
+ [[ 0 != 0 ]]
+ echo 'We'\''re ok: there is no zombie test'
We're ok: there is no zombie test

Mime
View raw message