hbase-builds mailing list archives

Site index · List index
Message view « Date » · « Thread »
Top « Date » · « Thread »
From Apache Jenkins Server <jenk...@builds.apache.org>
Subject Build failed in Jenkins: HBase-0.94-security #348
Date Thu, 28 Nov 2013 23:18:53 GMT
See <https://builds.apache.org/job/HBase-0.94-security/348/changes>

Changes:

[larsh] HBASE-10057 TestRestoreFlushSnapshotFromClient and TestRestoreSnapshotFromClient fail
to finish occasionally

[tedyu] HBASE-10049 Small improvments in region_mover.rb

------------------------------------------
[...truncated 20621 lines...]
Tests run: 4, Failures: 0, Errors: 0, Skipped: 0, Time elapsed: 3.771 sec
Forking command line: /bin/sh -c cd <https://builds.apache.org/job/HBase-0.94-security/ws/trunk>
&& /home/jenkins/tools/java/jdk1.6.0_45-32/jre/bin/java -enableassertions -Xmx1900m
-Djava.security.egd=file:/dev/./urandom -jar <https://builds.apache.org/job/HBase-0.94-security/ws/trunk/target/surefire/surefirebooter7101259163662122446.jar>
<https://builds.apache.org/job/HBase-0.94-security/ws/trunk/target/surefire/surefire3597857846277984147tmp>
<https://builds.apache.org/job/HBase-0.94-security/ws/trunk/target/surefire/surefire_1011336456613566139737tmp>
Running org.apache.hadoop.hbase.procedure.TestZKProcedure
Tests run: 4, Failures: 0, Errors: 0, Skipped: 0, Time elapsed: 2.805 sec
Forking command line: /bin/sh -c cd <https://builds.apache.org/job/HBase-0.94-security/ws/trunk>
&& /home/jenkins/tools/java/jdk1.6.0_45-32/jre/bin/java -enableassertions -Xmx1900m
-Djava.security.egd=file:/dev/./urandom -jar <https://builds.apache.org/job/HBase-0.94-security/ws/trunk/target/surefire/surefirebooter7183766672832687779.jar>
<https://builds.apache.org/job/HBase-0.94-security/ws/trunk/target/surefire/surefire8229402450945989411tmp>
<https://builds.apache.org/job/HBase-0.94-security/ws/trunk/target/surefire/surefire_1021374097448040167937tmp>
Running org.apache.hadoop.hbase.mapreduce.TestHLogRecordReader
Tests run: 2, Failures: 0, Errors: 0, Skipped: 0, Time elapsed: 9.134 sec
Forking command line: /bin/sh -c cd <https://builds.apache.org/job/HBase-0.94-security/ws/trunk>
&& /home/jenkins/tools/java/jdk1.6.0_45-32/jre/bin/java -enableassertions -Xmx1900m
-Djava.security.egd=file:/dev/./urandom -jar <https://builds.apache.org/job/HBase-0.94-security/ws/trunk/target/surefire/surefirebooter1824416519091983206.jar>
<https://builds.apache.org/job/HBase-0.94-security/ws/trunk/target/surefire/surefire7965326901690302842tmp>
<https://builds.apache.org/job/HBase-0.94-security/ws/trunk/target/surefire/surefire_1036049035908678939284tmp>
Running org.apache.hadoop.hbase.TestGlobalMemStoreSize
Tests run: 1, Failures: 0, Errors: 0, Skipped: 0, Time elapsed: 26.682 sec
Forking command line: /bin/sh -c cd <https://builds.apache.org/job/HBase-0.94-security/ws/trunk>
&& /home/jenkins/tools/java/jdk1.6.0_45-32/jre/bin/java -enableassertions -Xmx1900m
-Djava.security.egd=file:/dev/./urandom -jar <https://builds.apache.org/job/HBase-0.94-security/ws/trunk/target/surefire/surefirebooter3415628380575214821.jar>
<https://builds.apache.org/job/HBase-0.94-security/ws/trunk/target/surefire/surefire5118454022340459930tmp>
<https://builds.apache.org/job/HBase-0.94-security/ws/trunk/target/surefire/surefire_1048036721592494988111tmp>
Running org.apache.hadoop.hbase.mapreduce.TestImportExport
Tests run: 4, Failures: 0, Errors: 0, Skipped: 0, Time elapsed: 135.159 sec
Forking command line: /bin/sh -c cd <https://builds.apache.org/job/HBase-0.94-security/ws/trunk>
&& /home/jenkins/tools/java/jdk1.6.0_45-32/jre/bin/java -enableassertions -Xmx1900m
-Djava.security.egd=file:/dev/./urandom -jar <https://builds.apache.org/job/HBase-0.94-security/ws/trunk/target/surefire/surefirebooter2367640876301072584.jar>
<https://builds.apache.org/job/HBase-0.94-security/ws/trunk/target/surefire/surefire4547117594079949129tmp>
<https://builds.apache.org/job/HBase-0.94-security/ws/trunk/target/surefire/surefire_1053018466398673498333tmp>
Running org.apache.hadoop.hbase.TestAcidGuarantees
Tests run: 3, Failures: 0, Errors: 0, Skipped: 0, Time elapsed: 119.261 sec
Forking command line: /bin/sh -c cd <https://builds.apache.org/job/HBase-0.94-security/ws/trunk>
&& /home/jenkins/tools/java/jdk1.6.0_45-32/jre/bin/java -enableassertions -Xmx1900m
-Djava.security.egd=file:/dev/./urandom -jar <https://builds.apache.org/job/HBase-0.94-security/ws/trunk/target/surefire/surefirebooter4161229002138683966.jar>
<https://builds.apache.org/job/HBase-0.94-security/ws/trunk/target/surefire/surefire7755897894057226825tmp>
<https://builds.apache.org/job/HBase-0.94-security/ws/trunk/target/surefire/surefire_106298390943490182169tmp>
Running org.apache.hadoop.hbase.mapreduce.TestImportTsv
Tests run: 13, Failures: 0, Errors: 0, Skipped: 0, Time elapsed: 292.537 sec
Forking command line: /bin/sh -c cd <https://builds.apache.org/job/HBase-0.94-security/ws/trunk>
&& /home/jenkins/tools/java/jdk1.6.0_45-32/jre/bin/java -enableassertions -Xmx1900m
-Djava.security.egd=file:/dev/./urandom -jar <https://builds.apache.org/job/HBase-0.94-security/ws/trunk/target/surefire/surefirebooter8411601358727011780.jar>
<https://builds.apache.org/job/HBase-0.94-security/ws/trunk/target/surefire/surefire2262572317263832342tmp>
<https://builds.apache.org/job/HBase-0.94-security/ws/trunk/target/surefire/surefire_1071842998442390557140tmp>
Running org.apache.hadoop.hbase.snapshot.TestSnapshotDescriptionUtils
Tests run: 2, Failures: 0, Errors: 0, Skipped: 0, Time elapsed: 0.538 sec
Forking command line: /bin/sh -c cd <https://builds.apache.org/job/HBase-0.94-security/ws/trunk>
&& /home/jenkins/tools/java/jdk1.6.0_45-32/jre/bin/java -enableassertions -Xmx1900m
-Djava.security.egd=file:/dev/./urandom -jar <https://builds.apache.org/job/HBase-0.94-security/ws/trunk/target/surefire/surefirebooter1994049869343912985.jar>
<https://builds.apache.org/job/HBase-0.94-security/ws/trunk/target/surefire/surefire4476904975524155490tmp>
<https://builds.apache.org/job/HBase-0.94-security/ws/trunk/target/surefire/surefire_1084957208817190031510tmp>
Running org.apache.hadoop.hbase.snapshot.TestExportSnapshot
Tests run: 4, Failures: 0, Errors: 0, Skipped: 0, Time elapsed: 51.245 sec
Forking command line: /bin/sh -c cd <https://builds.apache.org/job/HBase-0.94-security/ws/trunk>
&& /home/jenkins/tools/java/jdk1.6.0_45-32/jre/bin/java -enableassertions -Xmx1900m
-Djava.security.egd=file:/dev/./urandom -jar <https://builds.apache.org/job/HBase-0.94-security/ws/trunk/target/surefire/surefirebooter4348891859873829393.jar>
<https://builds.apache.org/job/HBase-0.94-security/ws/trunk/target/surefire/surefire8059772658013601100tmp>
<https://builds.apache.org/job/HBase-0.94-security/ws/trunk/target/surefire/surefire_1091342025913795154189tmp>
Running org.apache.hadoop.hbase.thrift2.TestThriftHBaseServiceHandler
Tests run: 19, Failures: 0, Errors: 0, Skipped: 0, Time elapsed: 21.248 sec
Forking command line: /bin/sh -c cd <https://builds.apache.org/job/HBase-0.94-security/ws/trunk>
&& /home/jenkins/tools/java/jdk1.6.0_45-32/jre/bin/java -enableassertions -Xmx1900m
-Djava.security.egd=file:/dev/./urandom -jar <https://builds.apache.org/job/HBase-0.94-security/ws/trunk/target/surefire/surefirebooter1685961328659224937.jar>
<https://builds.apache.org/job/HBase-0.94-security/ws/trunk/target/surefire/surefire5854662931640230627tmp>
<https://builds.apache.org/job/HBase-0.94-security/ws/trunk/target/surefire/surefire_1101457650609137263716tmp>
Running org.apache.hadoop.hbase.catalog.TestMetaReaderEditorNoCluster
Tests run: 1, Failures: 0, Errors: 0, Skipped: 0, Time elapsed: 5.334 sec
Forking command line: /bin/sh -c cd <https://builds.apache.org/job/HBase-0.94-security/ws/trunk>
&& /home/jenkins/tools/java/jdk1.6.0_45-32/jre/bin/java -enableassertions -Xmx1900m
-Djava.security.egd=file:/dev/./urandom -jar <https://builds.apache.org/job/HBase-0.94-security/ws/trunk/target/surefire/surefirebooter4890897314503056755.jar>
<https://builds.apache.org/job/HBase-0.94-security/ws/trunk/target/surefire/surefire8731611569914397368tmp>
<https://builds.apache.org/job/HBase-0.94-security/ws/trunk/target/surefire/surefire_1112119187463075641941tmp>
Running org.apache.hadoop.hbase.catalog.TestCatalogTracker
Tests run: 10, Failures: 0, Errors: 0, Skipped: 1, Time elapsed: 9.305 sec
Forking command line: /bin/sh -c cd <https://builds.apache.org/job/HBase-0.94-security/ws/trunk>
&& /home/jenkins/tools/java/jdk1.6.0_45-32/jre/bin/java -enableassertions -Xmx1900m
-Djava.security.egd=file:/dev/./urandom -jar <https://builds.apache.org/job/HBase-0.94-security/ws/trunk/target/surefire/surefirebooter6029292869230652239.jar>
<https://builds.apache.org/job/HBase-0.94-security/ws/trunk/target/surefire/surefire7691259173870266064tmp>
<https://builds.apache.org/job/HBase-0.94-security/ws/trunk/target/surefire/surefire_1123394542664434934447tmp>
Running org.apache.hadoop.hbase.client.TestTimestampsFilter
Tests run: 3, Failures: 0, Errors: 0, Skipped: 0, Time elapsed: 28.534 sec
Forking command line: /bin/sh -c cd <https://builds.apache.org/job/HBase-0.94-security/ws/trunk>
&& /home/jenkins/tools/java/jdk1.6.0_45-32/jre/bin/java -enableassertions -Xmx1900m
-Djava.security.egd=file:/dev/./urandom -jar <https://builds.apache.org/job/HBase-0.94-security/ws/trunk/target/surefire/surefirebooter6426537962985610927.jar>
<https://builds.apache.org/job/HBase-0.94-security/ws/trunk/target/surefire/surefire6607420331025644910tmp>
<https://builds.apache.org/job/HBase-0.94-security/ws/trunk/target/surefire/surefire_1138269733197694328534tmp>
Running org.apache.hadoop.hbase.client.TestHCM
Tests run: 9, Failures: 0, Errors: 0, Skipped: 0, Time elapsed: 29.44 sec
Forking command line: /bin/sh -c cd <https://builds.apache.org/job/HBase-0.94-security/ws/trunk>
&& /home/jenkins/tools/java/jdk1.6.0_45-32/jre/bin/java -enableassertions -Xmx1900m
-Djava.security.egd=file:/dev/./urandom -jar <https://builds.apache.org/job/HBase-0.94-security/ws/trunk/target/surefire/surefirebooter2171745791126636816.jar>
<https://builds.apache.org/job/HBase-0.94-security/ws/trunk/target/surefire/surefire2008616449447461445tmp>
<https://builds.apache.org/job/HBase-0.94-security/ws/trunk/target/surefire/surefire_1143300810389454984609tmp>
Running org.apache.hadoop.hbase.client.TestMetaScanner
Tests run: 2, Failures: 0, Errors: 0, Skipped: 0, Time elapsed: 63.061 sec
Forking command line: /bin/sh -c cd <https://builds.apache.org/job/HBase-0.94-security/ws/trunk>
&& /home/jenkins/tools/java/jdk1.6.0_45-32/jre/bin/java -enableassertions -Xmx1900m
-Djava.security.egd=file:/dev/./urandom -jar <https://builds.apache.org/job/HBase-0.94-security/ws/trunk/target/surefire/surefirebooter5270341090315245640.jar>
<https://builds.apache.org/job/HBase-0.94-security/ws/trunk/target/surefire/surefire1890224937085264759tmp>
<https://builds.apache.org/job/HBase-0.94-security/ws/trunk/target/surefire/surefire_1154608093863860763279tmp>
Running org.apache.hadoop.hbase.client.TestHTableUtil
Tests run: 2, Failures: 0, Errors: 0, Skipped: 0, Time elapsed: 18.276 sec
Forking command line: /bin/sh -c cd <https://builds.apache.org/job/HBase-0.94-security/ws/trunk>
&& /home/jenkins/tools/java/jdk1.6.0_45-32/jre/bin/java -enableassertions -Xmx1900m
-Djava.security.egd=file:/dev/./urandom -jar <https://builds.apache.org/job/HBase-0.94-security/ws/trunk/target/surefire/surefirebooter4151389850064699285.jar>
<https://builds.apache.org/job/HBase-0.94-security/ws/trunk/target/surefire/surefire6398056109093587743tmp>
<https://builds.apache.org/job/HBase-0.94-security/ws/trunk/target/surefire/surefire_1161751088776737724558tmp>
Running org.apache.hadoop.hbase.client.TestMetaMigrationRemovingHTD
Tests run: 3, Failures: 0, Errors: 0, Skipped: 0, Time elapsed: 34.065 sec
Forking command line: /bin/sh -c cd <https://builds.apache.org/job/HBase-0.94-security/ws/trunk>
&& /home/jenkins/tools/java/jdk1.6.0_45-32/jre/bin/java -enableassertions -Xmx1900m
-Djava.security.egd=file:/dev/./urandom -jar <https://builds.apache.org/job/HBase-0.94-security/ws/trunk/target/surefire/surefirebooter2864720185360337309.jar>
<https://builds.apache.org/job/HBase-0.94-security/ws/trunk/target/surefire/surefire266101709026045669tmp>
<https://builds.apache.org/job/HBase-0.94-security/ws/trunk/target/surefire/surefire_1171227526522464614686tmp>
Running org.apache.hadoop.hbase.client.TestHTablePool$TestHTableReusablePool
Tests run: 8, Failures: 0, Errors: 0, Skipped: 0, Time elapsed: 6.605 sec
Running org.apache.hadoop.hbase.client.TestHTablePool$TestHTableThreadLocalPool
Tests run: 8, Failures: 0, Errors: 0, Skipped: 0, Time elapsed: 43.496 sec
Forking command line: /bin/sh -c cd <https://builds.apache.org/job/HBase-0.94-security/ws/trunk>
&& /home/jenkins/tools/java/jdk1.6.0_45-32/jre/bin/java -enableassertions -Xmx1900m
-Djava.security.egd=file:/dev/./urandom -jar <https://builds.apache.org/job/HBase-0.94-security/ws/trunk/target/surefire/surefirebooter6249439028677353311.jar>
<https://builds.apache.org/job/HBase-0.94-security/ws/trunk/target/surefire/surefire8782501398587272152tmp>
<https://builds.apache.org/job/HBase-0.94-security/ws/trunk/target/surefire/surefire_118747095571719378983tmp>
Running org.apache.hadoop.hbase.client.replication.TestReplicationAdmin
Tests run: 1, Failures: 0, Errors: 0, Skipped: 0, Time elapsed: 1.01 sec
Forking command line: /bin/sh -c cd <https://builds.apache.org/job/HBase-0.94-security/ws/trunk>
&& /home/jenkins/tools/java/jdk1.6.0_45-32/jre/bin/java -enableassertions -Xmx1900m
-Djava.security.egd=file:/dev/./urandom -jar <https://builds.apache.org/job/HBase-0.94-security/ws/trunk/target/surefire/surefirebooter7065727471323690783.jar>
<https://builds.apache.org/job/HBase-0.94-security/ws/trunk/target/surefire/surefire3309027921157150736tmp>
<https://builds.apache.org/job/HBase-0.94-security/ws/trunk/target/surefire/surefire_1198129539972872891233tmp>
Running org.apache.hadoop.hbase.client.TestMultiParallel
Tests run: 11, Failures: 0, Errors: 0, Skipped: 0, Time elapsed: 73.687 sec
Forking command line: /bin/sh -c cd <https://builds.apache.org/job/HBase-0.94-security/ws/trunk>
&& /home/jenkins/tools/java/jdk1.6.0_45-32/jre/bin/java -enableassertions -Xmx1900m
-Djava.security.egd=file:/dev/./urandom -jar <https://builds.apache.org/job/HBase-0.94-security/ws/trunk/target/surefire/surefirebooter7919550446528693556.jar>
<https://builds.apache.org/job/HBase-0.94-security/ws/trunk/target/surefire/surefire6518018222167546273tmp>
<https://builds.apache.org/job/HBase-0.94-security/ws/trunk/target/surefire/surefire_1203522018955863750605tmp>
Running org.apache.hadoop.hbase.client.TestHConnection
Tests run: 2, Failures: 0, Errors: 0, Skipped: 0, Time elapsed: 42.443 sec
Forking command line: /bin/sh -c cd <https://builds.apache.org/job/HBase-0.94-security/ws/trunk>
&& /home/jenkins/tools/java/jdk1.6.0_45-32/jre/bin/java -enableassertions -Xmx1900m
-Djava.security.egd=file:/dev/./urandom -jar <https://builds.apache.org/job/HBase-0.94-security/ws/trunk/target/surefire/surefirebooter6073706610485787417.jar>
<https://builds.apache.org/job/HBase-0.94-security/ws/trunk/target/surefire/surefire549903848129062985tmp>
<https://builds.apache.org/job/HBase-0.94-security/ws/trunk/target/surefire/surefire_121490820627472142648tmp>
Running org.apache.hadoop.hbase.catalog.TestMetaReaderEditor
Tests run: 5, Failures: 1, Errors: 3, Skipped: 0, Time elapsed: 355.699 sec <<< FAILURE!
Forking command line: /bin/sh -c cd <https://builds.apache.org/job/HBase-0.94-security/ws/trunk>
&& /home/jenkins/tools/java/jdk1.6.0_45-32/jre/bin/java -enableassertions -Xmx1900m
-Djava.security.egd=file:/dev/./urandom -jar <https://builds.apache.org/job/HBase-0.94-security/ws/trunk/target/surefire/surefirebooter2807638301503284233.jar>
<https://builds.apache.org/job/HBase-0.94-security/ws/trunk/target/surefire/surefire4588383156549906346tmp>
<https://builds.apache.org/job/HBase-0.94-security/ws/trunk/target/surefire/surefire_1221937049859057511519tmp>
Running org.apache.hadoop.hbase.metrics.TestMetricsMBeanBase
Tests run: 3, Failures: 0, Errors: 0, Skipped: 0, Time elapsed: 1.289 sec
Forking command line: /bin/sh -c cd <https://builds.apache.org/job/HBase-0.94-security/ws/trunk>
&& /home/jenkins/tools/java/jdk1.6.0_45-32/jre/bin/java -enableassertions -Xmx1900m
-Djava.security.egd=file:/dev/./urandom -jar <https://builds.apache.org/job/HBase-0.94-security/ws/trunk/target/surefire/surefirebooter1376902829894871620.jar>
<https://builds.apache.org/job/HBase-0.94-security/ws/trunk/target/surefire/surefire3340863297221575294tmp>
<https://builds.apache.org/job/HBase-0.94-security/ws/trunk/target/surefire/surefire_1231058233899985683689tmp>
Running org.apache.hadoop.hbase.client.TestCoprocessorHConnection
Tests run: 2, Failures: 0, Errors: 0, Skipped: 0, Time elapsed: 20.586 sec
Forking command line: /bin/sh -c cd <https://builds.apache.org/job/HBase-0.94-security/ws/trunk>
&& /home/jenkins/tools/java/jdk1.6.0_45-32/jre/bin/java -enableassertions -Xmx1900m
-Djava.security.egd=file:/dev/./urandom -jar <https://builds.apache.org/job/HBase-0.94-security/ws/trunk/target/surefire/surefirebooter4433934091761293671.jar>
<https://builds.apache.org/job/HBase-0.94-security/ws/trunk/target/surefire/surefire7117274197520265013tmp>
<https://builds.apache.org/job/HBase-0.94-security/ws/trunk/target/surefire/surefire_1246388973745171671196tmp>
Running org.apache.hadoop.hbase.constraint.TestConstraint
Tests run: 5, Failures: 0, Errors: 0, Skipped: 0, Time elapsed: 34.619 sec
Forking command line: /bin/sh -c cd <https://builds.apache.org/job/HBase-0.94-security/ws/trunk>
&& /home/jenkins/tools/java/jdk1.6.0_45-32/jre/bin/java -enableassertions -Xmx1900m
-Djava.security.egd=file:/dev/./urandom -jar <https://builds.apache.org/job/HBase-0.94-security/ws/trunk/target/surefire/surefirebooter7228148351851768480.jar>
<https://builds.apache.org/job/HBase-0.94-security/ws/trunk/target/surefire/surefire5907938141020605036tmp>
<https://builds.apache.org/job/HBase-0.94-security/ws/trunk/target/surefire/surefire_1258054349455769513813tmp>
Running org.apache.hadoop.hbase.rest.TestGzipFilter
Tests run: 2, Failures: 0, Errors: 0, Skipped: 0, Time elapsed: 18.461 sec
Forking command line: /bin/sh -c cd <https://builds.apache.org/job/HBase-0.94-security/ws/trunk>
&& /home/jenkins/tools/java/jdk1.6.0_45-32/jre/bin/java -enableassertions -Xmx1900m
-Djava.security.egd=file:/dev/./urandom -jar <https://builds.apache.org/job/HBase-0.94-security/ws/trunk/target/surefire/surefirebooter7789757432627222015.jar>
<https://builds.apache.org/job/HBase-0.94-security/ws/trunk/target/surefire/surefire4270017199786263888tmp>
<https://builds.apache.org/job/HBase-0.94-security/ws/trunk/target/surefire/surefire_1266815605605814811634tmp>
Running org.apache.hadoop.hbase.rest.TestMultiRowResource
Tests run: 3, Failures: 0, Errors: 0, Skipped: 0, Time elapsed: 18.92 sec
Forking command line: /bin/sh -c cd <https://builds.apache.org/job/HBase-0.94-security/ws/trunk>
&& /home/jenkins/tools/java/jdk1.6.0_45-32/jre/bin/java -enableassertions -Xmx1900m
-Djava.security.egd=file:/dev/./urandom -jar <https://builds.apache.org/job/HBase-0.94-security/ws/trunk/target/surefire/surefirebooter461598944194564902.jar>
<https://builds.apache.org/job/HBase-0.94-security/ws/trunk/target/surefire/surefire8158009045332560593tmp>
<https://builds.apache.org/job/HBase-0.94-security/ws/trunk/target/surefire/surefire_127668344047056016657tmp>
Running org.apache.hadoop.hbase.rest.TestGZIPResponseWrapper
Tests run: 5, Failures: 0, Errors: 0, Skipped: 0, Time elapsed: 0.237 sec
Forking command line: /bin/sh -c cd <https://builds.apache.org/job/HBase-0.94-security/ws/trunk>
&& /home/jenkins/tools/java/jdk1.6.0_45-32/jre/bin/java -enableassertions -Xmx1900m
-Djava.security.egd=file:/dev/./urandom -jar <https://builds.apache.org/job/HBase-0.94-security/ws/trunk/target/surefire/surefirebooter5604778766177121600.jar>
<https://builds.apache.org/job/HBase-0.94-security/ws/trunk/target/surefire/surefire2758988030474865187tmp>
<https://builds.apache.org/job/HBase-0.94-security/ws/trunk/target/surefire/surefire_1284238095084472374498tmp>
Running org.apache.hadoop.hbase.rest.TestScannersWithFilters
Tests run: 10, Failures: 0, Errors: 0, Skipped: 0, Time elapsed: 24.265 sec
Forking command line: /bin/sh -c cd <https://builds.apache.org/job/HBase-0.94-security/ws/trunk>
&& /home/jenkins/tools/java/jdk1.6.0_45-32/jre/bin/java -enableassertions -Xmx1900m
-Djava.security.egd=file:/dev/./urandom -jar <https://builds.apache.org/job/HBase-0.94-security/ws/trunk/target/surefire/surefirebooter2890275418109023825.jar>
<https://builds.apache.org/job/HBase-0.94-security/ws/trunk/target/surefire/surefire8405851961213925962tmp>
<https://builds.apache.org/job/HBase-0.94-security/ws/trunk/target/surefire/surefire_1293103103931179667157tmp>
Running org.apache.hadoop.hbase.rest.TestRowResource
Tests run: 12, Failures: 0, Errors: 0, Skipped: 0, Time elapsed: 22.385 sec
Forking command line: /bin/sh -c cd <https://builds.apache.org/job/HBase-0.94-security/ws/trunk>
&& /home/jenkins/tools/java/jdk1.6.0_45-32/jre/bin/java -enableassertions -Xmx1900m
-Djava.security.egd=file:/dev/./urandom -jar <https://builds.apache.org/job/HBase-0.94-security/ws/trunk/target/surefire/surefirebooter2359600513252907147.jar>
<https://builds.apache.org/job/HBase-0.94-security/ws/trunk/target/surefire/surefire2432683416125743427tmp>
<https://builds.apache.org/job/HBase-0.94-security/ws/trunk/target/surefire/surefire_1301777079946177780612tmp>
Running org.apache.hadoop.hbase.rest.client.TestRemoteAdmin
Tests run: 5, Failures: 0, Errors: 0, Skipped: 0, Time elapsed: 23.288 sec
Forking command line: /bin/sh -c cd <https://builds.apache.org/job/HBase-0.94-security/ws/trunk>
&& /home/jenkins/tools/java/jdk1.6.0_45-32/jre/bin/java -enableassertions -Xmx1900m
-Djava.security.egd=file:/dev/./urandom -jar <https://builds.apache.org/job/HBase-0.94-security/ws/trunk/target/surefire/surefirebooter1599771636591961758.jar>
<https://builds.apache.org/job/HBase-0.94-security/ws/trunk/target/surefire/surefire3210672723232751677tmp>
<https://builds.apache.org/job/HBase-0.94-security/ws/trunk/target/surefire/surefire_131720344445228940330tmp>
Running org.apache.hadoop.hbase.rest.TestVersionResource
Tests run: 7, Failures: 0, Errors: 0, Skipped: 0, Time elapsed: 17.528 sec
Forking command line: /bin/sh -c cd <https://builds.apache.org/job/HBase-0.94-security/ws/trunk>
&& /home/jenkins/tools/java/jdk1.6.0_45-32/jre/bin/java -enableassertions -Xmx1900m
-Djava.security.egd=file:/dev/./urandom -jar <https://builds.apache.org/job/HBase-0.94-security/ws/trunk/target/surefire/surefirebooter5429827936129249024.jar>
<https://builds.apache.org/job/HBase-0.94-security/ws/trunk/target/surefire/surefire4075107364380333916tmp>
<https://builds.apache.org/job/HBase-0.94-security/ws/trunk/target/surefire/surefire_1321099130487384643623tmp>
Running org.apache.hadoop.hbase.rest.TestScannerResource
Tests run: 5, Failures: 0, Errors: 0, Skipped: 0, Time elapsed: 31.413 sec
Forking command line: /bin/sh -c cd <https://builds.apache.org/job/HBase-0.94-security/ws/trunk>
&& /home/jenkins/tools/java/jdk1.6.0_45-32/jre/bin/java -enableassertions -Xmx1900m
-Djava.security.egd=file:/dev/./urandom -jar <https://builds.apache.org/job/HBase-0.94-security/ws/trunk/target/surefire/surefirebooter2411634006504186450.jar>
<https://builds.apache.org/job/HBase-0.94-security/ws/trunk/target/surefire/surefire4310806002075283412tmp>
<https://builds.apache.org/job/HBase-0.94-security/ws/trunk/target/surefire/surefire_1333563997736361463080tmp>
Running org.apache.hadoop.hbase.rest.client.TestRemoteTable
Tests run: 9, Failures: 0, Errors: 0, Skipped: 0, Time elapsed: 59.236 sec
Forking command line: /bin/sh -c cd <https://builds.apache.org/job/HBase-0.94-security/ws/trunk>
&& /home/jenkins/tools/java/jdk1.6.0_45-32/jre/bin/java -enableassertions -Xmx1900m
-Djava.security.egd=file:/dev/./urandom -jar <https://builds.apache.org/job/HBase-0.94-security/ws/trunk/target/surefire/surefirebooter4356067471730108452.jar>
<https://builds.apache.org/job/HBase-0.94-security/ws/trunk/target/surefire/surefire7440234279202100611tmp>
<https://builds.apache.org/job/HBase-0.94-security/ws/trunk/target/surefire/surefire_134941319293056355472tmp>
Running org.apache.hadoop.hbase.rest.TestStatusResource
Tests run: 2, Failures: 0, Errors: 0, Skipped: 0, Time elapsed: 16.869 sec
Forking command line: /bin/sh -c cd <https://builds.apache.org/job/HBase-0.94-security/ws/trunk>
&& /home/jenkins/tools/java/jdk1.6.0_45-32/jre/bin/java -enableassertions -Xmx1900m
-Djava.security.egd=file:/dev/./urandom -jar <https://builds.apache.org/job/HBase-0.94-security/ws/trunk/target/surefire/surefirebooter4973749735407025745.jar>
<https://builds.apache.org/job/HBase-0.94-security/ws/trunk/target/surefire/surefire298261117008065658tmp>
<https://builds.apache.org/job/HBase-0.94-security/ws/trunk/target/surefire/surefire_1351373839508527076469tmp>
Running org.apache.hadoop.hbase.rest.TestTableResource
Tests run: 8, Failures: 0, Errors: 0, Skipped: 0, Time elapsed: 29.971 sec
Forking command line: /bin/sh -c cd <https://builds.apache.org/job/HBase-0.94-security/ws/trunk>
&& /home/jenkins/tools/java/jdk1.6.0_45-32/jre/bin/java -enableassertions -Xmx1900m
-Djava.security.egd=file:/dev/./urandom -jar <https://builds.apache.org/job/HBase-0.94-security/ws/trunk/target/surefire/surefirebooter6986196451416427914.jar>
<https://builds.apache.org/job/HBase-0.94-security/ws/trunk/target/surefire/surefire8765890923221289071tmp>
<https://builds.apache.org/job/HBase-0.94-security/ws/trunk/target/surefire/surefire_1368057243893341568212tmp>
Running org.apache.hadoop.hbase.rest.TestSchemaResource
Tests run: 2, Failures: 0, Errors: 0, Skipped: 0, Time elapsed: 26.098 sec
Forking command line: /bin/sh -c cd <https://builds.apache.org/job/HBase-0.94-security/ws/trunk>
&& /home/jenkins/tools/java/jdk1.6.0_45-32/jre/bin/java -enableassertions -Xmx1900m
-Djava.security.egd=file:/dev/./urandom -jar <https://builds.apache.org/job/HBase-0.94-security/ws/trunk/target/surefire/surefirebooter4720251873170416843.jar>
<https://builds.apache.org/job/HBase-0.94-security/ws/trunk/target/surefire/surefire4806637193633313889tmp>
<https://builds.apache.org/job/HBase-0.94-security/ws/trunk/target/surefire/surefire_1375615939756080277170tmp>
Running org.apache.hadoop.hbase.io.encoding.TestLoadAndSwitchEncodeOnDisk
Tests run: 1, Failures: 0, Errors: 0, Skipped: 0, Time elapsed: 33.693 sec
Forking command line: /bin/sh -c cd <https://builds.apache.org/job/HBase-0.94-security/ws/trunk>
&& /home/jenkins/tools/java/jdk1.6.0_45-32/jre/bin/java -enableassertions -Xmx1900m
-Djava.security.egd=file:/dev/./urandom -jar <https://builds.apache.org/job/HBase-0.94-security/ws/trunk/target/surefire/surefirebooter8973294501609703832.jar>
<https://builds.apache.org/job/HBase-0.94-security/ws/trunk/target/surefire/surefire3999748598399005858tmp>
<https://builds.apache.org/job/HBase-0.94-security/ws/trunk/target/surefire/surefire_1387871725180972108564tmp>
Running org.apache.hadoop.hbase.thrift.TestThriftServer
Tests run: 1, Failures: 0, Errors: 0, Skipped: 0, Time elapsed: 55.343 sec
Forking command line: /bin/sh -c cd <https://builds.apache.org/job/HBase-0.94-security/ws/trunk>
&& /home/jenkins/tools/java/jdk1.6.0_45-32/jre/bin/java -enableassertions -Xmx1900m
-Djava.security.egd=file:/dev/./urandom -jar <https://builds.apache.org/job/HBase-0.94-security/ws/trunk/target/surefire/surefirebooter5907871906253782847.jar>
<https://builds.apache.org/job/HBase-0.94-security/ws/trunk/target/surefire/surefire7632025155851037395tmp>
<https://builds.apache.org/job/HBase-0.94-security/ws/trunk/target/surefire/surefire_1391614823794587800240tmp>
Running org.apache.hadoop.hbase.io.hfile.TestHFileSeek
Tests run: 1, Failures: 0, Errors: 0, Skipped: 0, Time elapsed: 5.613 sec
Forking command line: /bin/sh -c cd <https://builds.apache.org/job/HBase-0.94-security/ws/trunk>
&& /home/jenkins/tools/java/jdk1.6.0_45-32/jre/bin/java -enableassertions -Xmx1900m
-Djava.security.egd=file:/dev/./urandom -jar <https://builds.apache.org/job/HBase-0.94-security/ws/trunk/target/surefire/surefirebooter8411321470415457263.jar>
<https://builds.apache.org/job/HBase-0.94-security/ws/trunk/target/surefire/surefire4476830385862619359tmp>
<https://builds.apache.org/job/HBase-0.94-security/ws/trunk/target/surefire/surefire_1405849843628978853142tmp>
Running org.apache.hadoop.hbase.io.hfile.slab.TestSlabCache
Tests run: 7, Failures: 0, Errors: 0, Skipped: 0, Time elapsed: 24.69 sec
Forking command line: /bin/sh -c cd <https://builds.apache.org/job/HBase-0.94-security/ws/trunk>
&& /home/jenkins/tools/java/jdk1.6.0_45-32/jre/bin/java -enableassertions -Xmx1900m
-Djava.security.egd=file:/dev/./urandom -jar <https://builds.apache.org/job/HBase-0.94-security/ws/trunk/target/surefire/surefirebooter8497961874242703506.jar>
<https://builds.apache.org/job/HBase-0.94-security/ws/trunk/target/surefire/surefire5914377792305959385tmp>
<https://builds.apache.org/job/HBase-0.94-security/ws/trunk/target/surefire/surefire_1414464511765861829544tmp>
Running org.apache.hadoop.hbase.io.hfile.TestChecksum
Tests run: 3, Failures: 0, Errors: 0, Skipped: 0, Time elapsed: 0.831 sec
Forking command line: /bin/sh -c cd <https://builds.apache.org/job/HBase-0.94-security/ws/trunk>
&& /home/jenkins/tools/java/jdk1.6.0_45-32/jre/bin/java -enableassertions -Xmx1900m
-Djava.security.egd=file:/dev/./urandom -jar <https://builds.apache.org/job/HBase-0.94-security/ws/trunk/target/surefire/surefirebooter5724495308576335817.jar>
<https://builds.apache.org/job/HBase-0.94-security/ws/trunk/target/surefire/surefire5603334290995468701tmp>
<https://builds.apache.org/job/HBase-0.94-security/ws/trunk/target/surefire/surefire_1425455905842695385808tmp>
Running org.apache.hadoop.hbase.io.hfile.slab.TestSingleSizeCache
Tests run: 5, Failures: 0, Errors: 0, Skipped: 0, Time elapsed: 26.896 sec
Forking command line: /bin/sh -c cd <https://builds.apache.org/job/HBase-0.94-security/ws/trunk>
&& /home/jenkins/tools/java/jdk1.6.0_45-32/jre/bin/java -enableassertions -Xmx1900m
-Djava.security.egd=file:/dev/./urandom -jar <https://builds.apache.org/job/HBase-0.94-security/ws/trunk/target/surefire/surefirebooter5856366997500153256.jar>
<https://builds.apache.org/job/HBase-0.94-security/ws/trunk/target/surefire/surefire4428499326315853718tmp>
<https://builds.apache.org/job/HBase-0.94-security/ws/trunk/target/surefire/surefire_1437880635649721205318tmp>
Running org.apache.hadoop.hbase.io.hfile.TestLruBlockCache
Tests run: 16, Failures: 0, Errors: 0, Skipped: 0, Time elapsed: 1.007 sec
Forking command line: /bin/sh -c cd <https://builds.apache.org/job/HBase-0.94-security/ws/trunk>
&& /home/jenkins/tools/java/jdk1.6.0_45-32/jre/bin/java -enableassertions -Xmx1900m
-Djava.security.egd=file:/dev/./urandom -jar <https://builds.apache.org/job/HBase-0.94-security/ws/trunk/target/surefire/surefirebooter4114823476923104074.jar>
<https://builds.apache.org/job/HBase-0.94-security/ws/trunk/target/surefire/surefire2057109374701629967tmp>
<https://builds.apache.org/job/HBase-0.94-security/ws/trunk/target/surefire/surefire_1442525766207986628588tmp>
Running org.apache.hadoop.hbase.io.hfile.TestHFileBlockIndex
Tests run: 10, Failures: 0, Errors: 0, Skipped: 0, Time elapsed: 9.424 sec
Forking command line: /bin/sh -c cd <https://builds.apache.org/job/HBase-0.94-security/ws/trunk>
&& /home/jenkins/tools/java/jdk1.6.0_45-32/jre/bin/java -enableassertions -Xmx1900m
-Djava.security.egd=file:/dev/./urandom -jar <https://builds.apache.org/job/HBase-0.94-security/ws/trunk/target/surefire/surefirebooter4517240476793300703.jar>
<https://builds.apache.org/job/HBase-0.94-security/ws/trunk/target/surefire/surefire3164434993799454500tmp>
<https://builds.apache.org/job/HBase-0.94-security/ws/trunk/target/surefire/surefire_1454481204874761553997tmp>
Running org.apache.hadoop.hbase.io.hfile.TestHFilePerformance
Tests run: 1, Failures: 0, Errors: 0, Skipped: 0, Time elapsed: 6.021 sec
Forking command line: /bin/sh -c cd <https://builds.apache.org/job/HBase-0.94-security/ws/trunk>
&& /home/jenkins/tools/java/jdk1.6.0_45-32/jre/bin/java -enableassertions -Xmx1900m
-Djava.security.egd=file:/dev/./urandom -jar <https://builds.apache.org/job/HBase-0.94-security/ws/trunk/target/surefire/surefirebooter5923219135483046252.jar>
<https://builds.apache.org/job/HBase-0.94-security/ws/trunk/target/surefire/surefire4263338146475855996tmp>
<https://builds.apache.org/job/HBase-0.94-security/ws/trunk/target/surefire/surefire_1468825355192624032618tmp>
Running org.apache.hadoop.hbase.io.hfile.TestFixedFileTrailer
Tests run: 2, Failures: 0, Errors: 0, Skipped: 0, Time elapsed: 0.538 sec
Forking command line: /bin/sh -c cd <https://builds.apache.org/job/HBase-0.94-security/ws/trunk>
&& /home/jenkins/tools/java/jdk1.6.0_45-32/jre/bin/java -enableassertions -Xmx1900m
-Djava.security.egd=file:/dev/./urandom -jar <https://builds.apache.org/job/HBase-0.94-security/ws/trunk/target/surefire/surefirebooter3693787893137131697.jar>
<https://builds.apache.org/job/HBase-0.94-security/ws/trunk/target/surefire/surefire3261310687959950624tmp>
<https://builds.apache.org/job/HBase-0.94-security/ws/trunk/target/surefire/surefire_1475318394875183320993tmp>
Running org.apache.hadoop.hbase.io.hfile.TestHFileBlockCompatibility
Tests run: 10, Failures: 0, Errors: 0, Skipped: 0, Time elapsed: 1.001 sec
Forking command line: /bin/sh -c cd <https://builds.apache.org/job/HBase-0.94-security/ws/trunk>
&& /home/jenkins/tools/java/jdk1.6.0_45-32/jre/bin/java -enableassertions -Xmx1900m
-Djava.security.egd=file:/dev/./urandom -jar <https://builds.apache.org/job/HBase-0.94-security/ws/trunk/target/surefire/surefirebooter3194842180793812053.jar>
<https://builds.apache.org/job/HBase-0.94-security/ws/trunk/target/surefire/surefire2927714035686886579tmp>
<https://builds.apache.org/job/HBase-0.94-security/ws/trunk/target/surefire/surefire_1486509626474393073553tmp>
Running org.apache.hadoop.hbase.io.hfile.TestHFileBlock
Tests run: 16, Failures: 0, Errors: 0, Skipped: 0, Time elapsed: 51.668 sec
Forking command line: /bin/sh -c cd <https://builds.apache.org/job/HBase-0.94-security/ws/trunk>
&& /home/jenkins/tools/java/jdk1.6.0_45-32/jre/bin/java -enableassertions -Xmx1900m
-Djava.security.egd=file:/dev/./urandom -jar <https://builds.apache.org/job/HBase-0.94-security/ws/trunk/target/surefire/surefirebooter8935959074097817842.jar>
<https://builds.apache.org/job/HBase-0.94-security/ws/trunk/target/surefire/surefire4105134849021770101tmp>
<https://builds.apache.org/job/HBase-0.94-security/ws/trunk/target/surefire/surefire_1492515635922796035652tmp>
Running org.apache.hadoop.hbase.io.hfile.TestForceCacheImportantBlocks
Tests run: 4, Failures: 0, Errors: 0, Skipped: 0, Time elapsed: 67.094 sec
Forking command line: /bin/sh -c cd <https://builds.apache.org/job/HBase-0.94-security/ws/trunk>
&& /home/jenkins/tools/java/jdk1.6.0_45-32/jre/bin/java -enableassertions -Xmx1900m
-Djava.security.egd=file:/dev/./urandom -jar <https://builds.apache.org/job/HBase-0.94-security/ws/trunk/target/surefire/surefirebooter3680402006277457847.jar>
<https://builds.apache.org/job/HBase-0.94-security/ws/trunk/target/surefire/surefire8579345381536644980tmp>
<https://builds.apache.org/job/HBase-0.94-security/ws/trunk/target/surefire/surefire_1502036250091326861074tmp>
Running org.apache.hadoop.hbase.io.hfile.TestCacheOnWrite
Tests run: 36, Failures: 0, Errors: 0, Skipped: 0, Time elapsed: 34.626 sec
Forking command line: /bin/sh -c cd <https://builds.apache.org/job/HBase-0.94-security/ws/trunk>
&& /home/jenkins/tools/java/jdk1.6.0_45-32/jre/bin/java -enableassertions -Xmx1900m
-Djava.security.egd=file:/dev/./urandom -jar <https://builds.apache.org/job/HBase-0.94-security/ws/trunk/target/surefire/surefirebooter1555788408825505742.jar>
<https://builds.apache.org/job/HBase-0.94-security/ws/trunk/target/surefire/surefire7775486160347037659tmp>
<https://builds.apache.org/job/HBase-0.94-security/ws/trunk/target/surefire/surefire_1515560027410498401067tmp>
Running org.apache.hadoop.hbase.io.TestFileLink
Tests run: 3, Failures: 0, Errors: 0, Skipped: 0, Time elapsed: 27.344 sec
Forking command line: /bin/sh -c cd <https://builds.apache.org/job/HBase-0.94-security/ws/trunk>
&& /home/jenkins/tools/java/jdk1.6.0_45-32/jre/bin/java -enableassertions -Xmx1900m
-Djava.security.egd=file:/dev/./urandom -jar <https://builds.apache.org/job/HBase-0.94-security/ws/trunk/target/surefire/surefirebooter3454764386769175646.jar>
<https://builds.apache.org/job/HBase-0.94-security/ws/trunk/target/surefire/surefire7334244929059102128tmp>
<https://builds.apache.org/job/HBase-0.94-security/ws/trunk/target/surefire/surefire_1522457571999536949734tmp>
Running org.apache.hadoop.hbase.TestClusterBootOrder
Tests run: 2, Failures: 0, Errors: 0, Skipped: 0, Time elapsed: 40.511 sec
Forking command line: /bin/sh -c cd <https://builds.apache.org/job/HBase-0.94-security/ws/trunk>
&& /home/jenkins/tools/java/jdk1.6.0_45-32/jre/bin/java -enableassertions -Xmx1900m
-Djava.security.egd=file:/dev/./urandom -jar <https://builds.apache.org/job/HBase-0.94-security/ws/trunk/target/surefire/surefirebooter8503058147196105425.jar>
<https://builds.apache.org/job/HBase-0.94-security/ws/trunk/target/surefire/surefire9122615432242902831tmp>
<https://builds.apache.org/job/HBase-0.94-security/ws/trunk/target/surefire/surefire_1535853556447621943326tmp>
Running org.apache.hadoop.hbase.avro.TestAvroServer
Tests run: 3, Failures: 0, Errors: 0, Skipped: 0, Time elapsed: 35.392 sec
Forking command line: /bin/sh -c cd <https://builds.apache.org/job/HBase-0.94-security/ws/trunk>
&& /home/jenkins/tools/java/jdk1.6.0_45-32/jre/bin/java -enableassertions -Xmx1900m
-Djava.security.egd=file:/dev/./urandom -jar <https://builds.apache.org/job/HBase-0.94-security/ws/trunk/target/surefire/surefirebooter525599965106534707.jar>
<https://builds.apache.org/job/HBase-0.94-security/ws/trunk/target/surefire/surefire7393397486460873660tmp>
<https://builds.apache.org/job/HBase-0.94-security/ws/trunk/target/surefire/surefire_1546075932184920499487tmp>
Running org.apache.hadoop.hbase.replication.regionserver.TestReplicationSourceManager
Tests run: 3, Failures: 0, Errors: 0, Skipped: 0, Time elapsed: 2.309 sec
Forking command line: /bin/sh -c cd <https://builds.apache.org/job/HBase-0.94-security/ws/trunk>
&& /home/jenkins/tools/java/jdk1.6.0_45-32/jre/bin/java -enableassertions -Xmx1900m
-Djava.security.egd=file:/dev/./urandom -jar <https://builds.apache.org/job/HBase-0.94-security/ws/trunk/target/surefire/surefirebooter8042033348863845918.jar>
<https://builds.apache.org/job/HBase-0.94-security/ws/trunk/target/surefire/surefire6093198480749487540tmp>
<https://builds.apache.org/job/HBase-0.94-security/ws/trunk/target/surefire/surefire_1558546073553319541064tmp>
Running org.apache.hadoop.hbase.replication.TestReplicationSource
Tests run: 1, Failures: 0, Errors: 0, Skipped: 0, Time elapsed: 5.012 sec
Forking command line: /bin/sh -c cd <https://builds.apache.org/job/HBase-0.94-security/ws/trunk>
&& /home/jenkins/tools/java/jdk1.6.0_45-32/jre/bin/java -enableassertions -Xmx1900m
-Djava.security.egd=file:/dev/./urandom -jar <https://builds.apache.org/job/HBase-0.94-security/ws/trunk/target/surefire/surefirebooter6216107372866690285.jar>
<https://builds.apache.org/job/HBase-0.94-security/ws/trunk/target/surefire/surefire4532875371246412900tmp>
<https://builds.apache.org/job/HBase-0.94-security/ws/trunk/target/surefire/surefire_156227002952495357429tmp>
Running org.apache.hadoop.hbase.replication.TestReplicationZookeeper
Tests run: 1, Failures: 0, Errors: 0, Skipped: 0, Time elapsed: 0.865 sec
Forking command line: /bin/sh -c cd <https://builds.apache.org/job/HBase-0.94-security/ws/trunk>
&& /home/jenkins/tools/java/jdk1.6.0_45-32/jre/bin/java -enableassertions -Xmx1900m
-Djava.security.egd=file:/dev/./urandom -jar <https://builds.apache.org/job/HBase-0.94-security/ws/trunk/target/surefire/surefirebooter1294592266522425827.jar>
<https://builds.apache.org/job/HBase-0.94-security/ws/trunk/target/surefire/surefire2057115932461866636tmp>
<https://builds.apache.org/job/HBase-0.94-security/ws/trunk/target/surefire/surefire_1575872095014465766781tmp>
Running org.apache.hadoop.hbase.ipc.TestDelayedRpc
Tests run: 4, Failures: 0, Errors: 0, Skipped: 0, Time elapsed: 2.862 sec
Forking command line: /bin/sh -c cd <https://builds.apache.org/job/HBase-0.94-security/ws/trunk>
&& /home/jenkins/tools/java/jdk1.6.0_45-32/jre/bin/java -enableassertions -Xmx1900m
-Djava.security.egd=file:/dev/./urandom -jar <https://builds.apache.org/job/HBase-0.94-security/ws/trunk/target/surefire/surefirebooter5919020532600927825.jar>
<https://builds.apache.org/job/HBase-0.94-security/ws/trunk/target/surefire/surefire5450352796765649438tmp>
<https://builds.apache.org/job/HBase-0.94-security/ws/trunk/target/surefire/surefire_1588672997278342105302tmp>
Running org.apache.hadoop.hbase.ipc.TestPBOnWritableRpc
Tests run: 1, Failures: 0, Errors: 0, Skipped: 0, Time elapsed: 0.948 sec
Running org.apache.hadoop.hbase.replication.regionserver.TestReplicationSink
Tests run: 5, Failures: 0, Errors: 0, Skipped: 0, Time elapsed: 22.606 sec

Results :

Failed tests:   testRetrying(org.apache.hadoop.hbase.catalog.TestMetaReaderEditor): reader:
count=2, t=null

Tests in error: 
  testTableExists(org.apache.hadoop.hbase.catalog.TestMetaReaderEditor): Failed after attempts=10,
exceptions:(..)
  testGetRegion(org.apache.hadoop.hbase.catalog.TestMetaReaderEditor): Failed after attempts=10,
exceptions:(..)
  testScanMetaForTable(org.apache.hadoop.hbase.catalog.TestMetaReaderEditor)

Tests run: 911, Failures: 1, Errors: 3, Skipped: 2

[INFO] ------------------------------------------------------------------------
[INFO] BUILD FAILURE
[INFO] ------------------------------------------------------------------------
[INFO] Total time: 47:32.213s
[INFO] Finished at: Thu Nov 28 23:18:32 UTC 2013
[INFO] Final Memory: 51M/735M
[INFO] ------------------------------------------------------------------------
[ERROR] Failed to execute goal org.apache.maven.plugins:maven-surefire-plugin:2.12-TRUNK-HBASE-2:test
(secondPartTestsExecution) on project hbase: There are test failures.
[ERROR] 
[ERROR] Please refer to <https://builds.apache.org/job/HBase-0.94-security/ws/trunk/target/surefire-reports>
for the individual test results.
[ERROR] -> [Help 1]
org.apache.maven.lifecycle.LifecycleExecutionException: Failed to execute goal org.apache.maven.plugins:maven-surefire-plugin:2.12-TRUNK-HBASE-2:test
(secondPartTestsExecution) on project hbase: There are test failures.

Please refer to <https://builds.apache.org/job/HBase-0.94-security/ws/trunk/target/surefire-reports>
for the individual test results.
	at org.apache.maven.lifecycle.internal.MojoExecutor.execute(MojoExecutor.java:213)
	at org.apache.maven.lifecycle.internal.MojoExecutor.execute(MojoExecutor.java:153)
	at org.apache.maven.lifecycle.internal.MojoExecutor.execute(MojoExecutor.java:145)
	at org.apache.maven.lifecycle.internal.MojoExecutor.executeForkedExecutions(MojoExecutor.java:365)
	at org.apache.maven.lifecycle.internal.MojoExecutor.execute(MojoExecutor.java:199)
	at org.apache.maven.lifecycle.internal.MojoExecutor.execute(MojoExecutor.java:153)
	at org.apache.maven.lifecycle.internal.MojoExecutor.execute(MojoExecutor.java:145)
	at org.apache.maven.lifecycle.internal.LifecycleModuleBuilder.buildProject(LifecycleModuleBuilder.java:84)
	at org.apache.maven.lifecycle.internal.LifecycleModuleBuilder.buildProject(LifecycleModuleBuilder.java:59)
	at org.apache.maven.lifecycle.internal.LifecycleStarter.singleThreadedBuild(LifecycleStarter.java:183)
	at org.apache.maven.lifecycle.internal.LifecycleStarter.execute(LifecycleStarter.java:161)
	at org.apache.maven.DefaultMaven.doExecute(DefaultMaven.java:320)
	at org.apache.maven.DefaultMaven.execute(DefaultMaven.java:156)
	at org.apache.maven.cli.MavenCli.execute(MavenCli.java:537)
	at org.apache.maven.cli.MavenCli.doMain(MavenCli.java:196)
	at org.apache.maven.cli.MavenCli.main(MavenCli.java:141)
	at sun.reflect.NativeMethodAccessorImpl.invoke0(Native Method)
	at sun.reflect.NativeMethodAccessorImpl.invoke(NativeMethodAccessorImpl.java:39)
	at sun.reflect.DelegatingMethodAccessorImpl.invoke(DelegatingMethodAccessorImpl.java:25)
	at java.lang.reflect.Method.invoke(Method.java:597)
	at org.codehaus.plexus.classworlds.launcher.Launcher.launchEnhanced(Launcher.java:290)
	at org.codehaus.plexus.classworlds.launcher.Launcher.launch(Launcher.java:230)
	at org.codehaus.plexus.classworlds.launcher.Launcher.mainWithExitCode(Launcher.java:409)
	at org.codehaus.plexus.classworlds.launcher.Launcher.main(Launcher.java:352)
Caused by: org.apache.maven.plugin.MojoFailureException: There are test failures.

Please refer to <https://builds.apache.org/job/HBase-0.94-security/ws/trunk/target/surefire-reports>
for the individual test results.
	at org.apache.maven.plugin.surefire.SurefireHelper.reportExecution(SurefireHelper.java:87)
	at org.apache.maven.plugin.surefire.SurefirePlugin.writeSummary(SurefirePlugin.java:651)
	at org.apache.maven.plugin.surefire.SurefirePlugin.handleSummary(SurefirePlugin.java:625)
	at org.apache.maven.plugin.surefire.AbstractSurefireMojo.executeAfterPreconditionsChecked(AbstractSurefireMojo.java:137)
	at org.apache.maven.plugin.surefire.AbstractSurefireMojo.execute(AbstractSurefireMojo.java:98)
	at org.apache.maven.plugin.DefaultBuildPluginManager.executeMojo(DefaultBuildPluginManager.java:101)
	at org.apache.maven.lifecycle.internal.MojoExecutor.execute(MojoExecutor.java:209)
	... 23 more
[ERROR] 
[ERROR] 
[ERROR] For more information about the errors and possible solutions, please read the following
articles:
[ERROR] [Help 1] http://cwiki.apache.org/confluence/display/MAVEN/MojoFailureException
Build step 'Invoke top-level Maven targets' marked build as failure
Archiving artifacts
Updating HBASE-10049
Updating HBASE-10057
Recording test results

Mime
View raw message