hbase-builds mailing list archives

Site index · List index
Message view « Date » · « Thread »
Top « Date » · « Thread »
From Apache Jenkins Server <jenk...@builds.apache.org>
Subject Build failed in Jenkins: HBase-0.94 #1188
Date Tue, 29 Oct 2013 08:23:03 GMT
See <https://builds.apache.org/job/HBase-0.94/1188/changes>

Changes:

[larsh] HBASE-9842 Backport HBASE-9593 and HBASE-8667 to 0.94 (rajeshbabu)

[larsh] HBASE-9847 HConnectionImplementation does not connect to new active master (rajeshbabu)

------------------------------------------
[...truncated 9514 lines...]
Building index for all the packages and classes...
Generating /x1/jenkins/jenkins-slave/workspace/HBase-0.94/trunk/target/site/apidocs/overview-tree.html...
Generating /x1/jenkins/jenkins-slave/workspace/HBase-0.94/trunk/target/site/apidocs/index-all.html...
Generating /x1/jenkins/jenkins-slave/workspace/HBase-0.94/trunk/target/site/apidocs/deprecated-list.html...
Building index for all classes...
Generating /x1/jenkins/jenkins-slave/workspace/HBase-0.94/trunk/target/site/apidocs/allclasses-frame.html...
Generating /x1/jenkins/jenkins-slave/workspace/HBase-0.94/trunk/target/site/apidocs/allclasses-noframe.html...
Generating /x1/jenkins/jenkins-slave/workspace/HBase-0.94/trunk/target/site/apidocs/index.html...
Generating /x1/jenkins/jenkins-slave/workspace/HBase-0.94/trunk/target/site/apidocs/overview-summary.html...
Generating /x1/jenkins/jenkins-slave/workspace/HBase-0.94/trunk/target/site/apidocs/help-doc.html...
Generating /x1/jenkins/jenkins-slave/workspace/HBase-0.94/trunk/target/site/apidocs/stylesheet.css...
89 warnings
[WARNING] Javadoc Warnings
[WARNING] /x1/jenkins/jenkins-slave/workspace/HBase-0.94/trunk/src/main/java/org/apache/hadoop/hbase/util/Bytes.java:44:
warning: sun.misc.Unsafe is Sun proprietary API and may be removed in a future release
[WARNING] import sun.misc.Unsafe;
[WARNING] ^
[WARNING] /x1/jenkins/jenkins-slave/workspace/HBase-0.94/trunk/src/main/java/org/apache/hadoop/hbase/util/Bytes.java:1051:
warning: sun.misc.Unsafe is Sun proprietary API and may be removed in a future release
[WARNING] static final Unsafe theUnsafe;
[WARNING] ^
[WARNING] /x1/jenkins/jenkins-slave/workspace/HBase-0.94/trunk/src/main/java/org/apache/hadoop/hbase/client/HConnectionManager.java:1501:
warning - @returns is an unknown tag.
[WARNING] /x1/jenkins/jenkins-slave/workspace/HBase-0.94/trunk/src/main/java/org/apache/hadoop/hbase/client/HBaseAdmin.java:545:
warning - @link: is an unknown tag.
[WARNING] /x1/jenkins/jenkins-slave/workspace/HBase-0.94/trunk/src/main/java/org/apache/hadoop/hbase/client/HBaseAdmin.java:545:
warning - @link: is an unknown tag.
[WARNING] /x1/jenkins/jenkins-slave/workspace/HBase-0.94/trunk/src/main/java/org/apache/hadoop/hbase/client/HConnection.java:351:
warning - Tag @link: can't find withoutRetries(ServerCallable) in org.apache.hadoop.hbase.client.HConnectionManager
[WARNING] /x1/jenkins/jenkins-slave/workspace/HBase-0.94/trunk/src/main/java/org/apache/hadoop/hbase/client/HConnection.java:338:
warning - Tag @link: can't find withoutRetries(ServerCallable) in org.apache.hadoop.hbase.client.HConnectionManager
[WARNING] /x1/jenkins/jenkins-slave/workspace/HBase-0.94/trunk/src/main/java/org/apache/hadoop/hbase/client/HTable.java:514:
warning - @param argument "startRow" is not a parameter name.
[WARNING] /x1/jenkins/jenkins-slave/workspace/HBase-0.94/trunk/src/main/java/org/apache/hadoop/hbase/client/HTable.java:514:
warning - @param argument "endRow" is not a parameter name.
[WARNING] /x1/jenkins/jenkins-slave/workspace/HBase-0.94/trunk/src/main/java/org/apache/hadoop/hbase/client/HTableInterface.java:512:
warning - Tag @link: can't find autoFlush in org.apache.hadoop.hbase.client.HTableInterface
[WARNING] /x1/jenkins/jenkins-slave/workspace/HBase-0.94/trunk/src/main/java/org/apache/hadoop/hbase/client/HTableInterface.java:512:
warning - Tag @link: can't find autoFlush in org.apache.hadoop.hbase.client.HTableInterface
[WARNING] /x1/jenkins/jenkins-slave/workspace/HBase-0.94/trunk/src/main/java/org/apache/hadoop/hbase/client/HTableInterface.java:512:
warning - Tag @link: can't find clearBufferOnFail in org.apache.hadoop.hbase.client.HTableInterface
[WARNING] /x1/jenkins/jenkins-slave/workspace/HBase-0.94/trunk/src/main/java/org/apache/hadoop/hbase/client/HTableInterface.java:274:
warning - @param argument "arm" is not a parameter name.
[WARNING] /x1/jenkins/jenkins-slave/workspace/HBase-0.94/trunk/src/main/java/org/apache/hadoop/hbase/client/MetaScanner.java:276:
warning - @Deprecated is an unknown tag -- same as a known tag except for case.
[WARNING] /x1/jenkins/jenkins-slave/workspace/HBase-0.94/trunk/src/main/java/org/apache/hadoop/hbase/client/MetaScanner.java:276:
warning - @param argument "connection" is not a parameter name.
[WARNING] /x1/jenkins/jenkins-slave/workspace/HBase-0.94/trunk/src/main/java/org/apache/hadoop/hbase/client/ServerCallable.java:148:
warning - @param argument "<T>" is not a type parameter name.
[WARNING] /x1/jenkins/jenkins-slave/workspace/HBase-0.94/trunk/src/main/java/org/apache/hadoop/hbase/client/ServerCallable.java:223:
warning - @param argument "<T>" is not a type parameter name.
[WARNING] /x1/jenkins/jenkins-slave/workspace/HBase-0.94/trunk/src/main/java/org/apache/hadoop/hbase/HBaseFileSystem.java:175:
warning - @return tag has no arguments.
[WARNING] /x1/jenkins/jenkins-slave/workspace/HBase-0.94/trunk/src/main/java/org/apache/hadoop/hbase/HBaseFileSystem.java:203:
warning - @return tag has no arguments.
[WARNING] /x1/jenkins/jenkins-slave/workspace/HBase-0.94/trunk/src/main/java/org/apache/hadoop/hbase/HBaseFileSystem.java:228:
warning - @param argument "dir" is not a parameter name.
[WARNING] /x1/jenkins/jenkins-slave/workspace/HBase-0.94/trunk/src/main/java/org/apache/hadoop/hbase/HBaseIOException.java:36:
warning - Tag @inheritDoc cannot be used in constructor documentation.  It can only be used
in the following types of documentation: method, inline text.
[WARNING] /x1/jenkins/jenkins-slave/workspace/HBase-0.94/trunk/src/main/java/org/apache/hadoop/hbase/HBaseIOException.java:43:
warning - Tag @inheritDoc cannot be used in constructor documentation.  It can only be used
in the following types of documentation: method, inline text.
[WARNING] /x1/jenkins/jenkins-slave/workspace/HBase-0.94/trunk/src/main/java/org/apache/hadoop/hbase/HBaseIOException.java:50:
warning - Tag @inheritDoc cannot be used in constructor documentation.  It can only be used
in the following types of documentation: method, inline text.
[WARNING] /x1/jenkins/jenkins-slave/workspace/HBase-0.94/trunk/src/main/java/org/apache/hadoop/hbase/HBaseIOException.java:36:
warning - Tag @inheritDoc cannot be used in constructor documentation.  It can only be used
in the following types of documentation: method, inline text.
[WARNING] /x1/jenkins/jenkins-slave/workspace/HBase-0.94/trunk/src/main/java/org/apache/hadoop/hbase/HBaseIOException.java:36:
warning - Tag @inheritDoc cannot be used in constructor documentation.  It can only be used
in the following types of documentation: method, inline text.
[WARNING] /x1/jenkins/jenkins-slave/workspace/HBase-0.94/trunk/src/main/java/org/apache/hadoop/hbase/HBaseIOException.java:43:
warning - Tag @inheritDoc cannot be used in constructor documentation.  It can only be used
in the following types of documentation: method, inline text.
[WARNING] /x1/jenkins/jenkins-slave/workspace/HBase-0.94/trunk/src/main/java/org/apache/hadoop/hbase/HBaseIOException.java:43:
warning - Tag @inheritDoc cannot be used in constructor documentation.  It can only be used
in the following types of documentation: method, inline text.
[WARNING] /x1/jenkins/jenkins-slave/workspace/HBase-0.94/trunk/src/main/java/org/apache/hadoop/hbase/HBaseIOException.java:50:
warning - Tag @inheritDoc cannot be used in constructor documentation.  It can only be used
in the following types of documentation: method, inline text.
[WARNING] /x1/jenkins/jenkins-slave/workspace/HBase-0.94/trunk/src/main/java/org/apache/hadoop/hbase/HBaseIOException.java:50:
warning - Tag @inheritDoc cannot be used in constructor documentation.  It can only be used
in the following types of documentation: method, inline text.
[WARNING] /x1/jenkins/jenkins-slave/workspace/HBase-0.94/trunk/src/main/java/org/apache/hadoop/hbase/fs/HFileSystem.java:56:
warning - @param argument "useHBaseChecksums" is not a parameter name.
[WARNING] /x1/jenkins/jenkins-slave/workspace/HBase-0.94/trunk/src/main/java/org/apache/hadoop/hbase/zookeeper/ZKTableReadOnly.java:52:
warning - Tag @link: can't find isDisabledTable(String) in org.apache.hadoop.hbase.zookeeper.ZKTableReadOnly
[WARNING] /x1/jenkins/jenkins-slave/workspace/HBase-0.94/trunk/src/main/java/org/apache/hadoop/hbase/zookeeper/ZKUtil.java:1274:
warning - Tag @link: reference not found: ZKOp
[WARNING] /x1/jenkins/jenkins-slave/workspace/HBase-0.94/trunk/src/main/java/org/apache/hadoop/hbase/zookeeper/ZKUtil.java:1356:
warning - Tag @return cannot be used in class documentation.  It can only be used in the following
types of documentation: method.
[WARNING] /x1/jenkins/jenkins-slave/workspace/HBase-0.94/trunk/src/main/java/org/apache/hadoop/hbase/coprocessor/RegionObserver.java:244:
warning - @param argument "scantype" is not a parameter name.
[WARNING] /x1/jenkins/jenkins-slave/workspace/HBase-0.94/trunk/src/main/java/org/apache/hadoop/hbase/coprocessor/example/BulkDeleteProtocol.java:82:
warning - @return tag has no arguments.
[WARNING] /x1/jenkins/jenkins-slave/workspace/HBase-0.94/trunk/src/main/java/org/apache/hadoop/hbase/master/SplitLogManager.java:138:
warning - Tag @link: can't find SplitLogManager(ZooKeeperWatcher, Configuration,
[WARNING] Stoppable, String, TaskFinisher) in org.apache.hadoop.hbase.master.SplitLogManager
[WARNING] /x1/jenkins/jenkins-slave/workspace/HBase-0.94/trunk/src/main/java/org/apache/hadoop/hbase/master/cleaner/TimeToLiveHFileCleaner.java:32:
warning - TimeToLiveHFileCleaner#DEFAULT_TTL (referenced by @value tag) is an unknown reference.
[WARNING] /x1/jenkins/jenkins-slave/workspace/HBase-0.94/trunk/src/main/java/org/apache/hadoop/hbase/master/handler/ServerShutdownHandler.java:381:
warning - @param argument "hris" is not a parameter name.
[WARNING] /x1/jenkins/jenkins-slave/workspace/HBase-0.94/trunk/src/main/java/org/apache/hadoop/hbase/mapreduce/MultithreadedTableMapper.java:62:
warning - Tag @link: can't find setMapperClass(Configuration, Class) in org.apache.hadoop.hbase.mapreduce.MultithreadedTableMapper
[WARNING] /x1/jenkins/jenkins-slave/workspace/HBase-0.94/trunk/src/main/java/org/apache/hadoop/hbase/mapreduce/MultithreadedTableMapper.java:62:
warning - Missing closing '}' character for inline tag: "{@link #getNumberOfThreads(Configuration)
method. The default
[WARNING] value is 10 threads.
[WARNING] <p>"
[WARNING] /x1/jenkins/jenkins-slave/workspace/HBase-0.94/trunk/src/main/java/org/apache/hadoop/hbase/regionserver/ExplicitColumnTracker.java:81:
warning - @param argument "ttl" is not a parameter name.
[WARNING] /x1/jenkins/jenkins-slave/workspace/HBase-0.94/trunk/src/main/java/org/apache/hadoop/hbase/regionserver/HRegion.java:439:
warning - @param argument "conf" is not a parameter name.
[WARNING] /x1/jenkins/jenkins-slave/workspace/HBase-0.94/trunk/src/main/java/org/apache/hadoop/hbase/regionserver/HRegion.java:4290:
warning - @param argument "boolean" is not a parameter name.
[WARNING] /x1/jenkins/jenkins-slave/workspace/HBase-0.94/trunk/src/main/java/org/apache/hadoop/hbase/regionserver/HRegion.java:4318:
warning - @param argument "boolean" is not a parameter name.
[WARNING] /x1/jenkins/jenkins-slave/workspace/HBase-0.94/trunk/src/main/java/org/apache/hadoop/hbase/regionserver/HRegion.java:4318:
warning - @param argument "boolean" is not a parameter name.
[WARNING] /x1/jenkins/jenkins-slave/workspace/HBase-0.94/trunk/src/main/java/org/apache/hadoop/hbase/regionserver/RegionCoprocessorHost.java:531:
warning - Tag @link: can't find preFlush(ObserverContext, Store, KeyValueScanner) in org.apache.hadoop.hbase.coprocessor.RegionObserver
[WARNING] /x1/jenkins/jenkins-slave/workspace/HBase-0.94/trunk/src/main/java/org/apache/hadoop/hbase/regionserver/RegionSplitPolicy.java:98:
warning - @return tag has no arguments.
[WARNING] /x1/jenkins/jenkins-slave/workspace/HBase-0.94/trunk/src/main/java/org/apache/hadoop/hbase/regionserver/RegionSplitPolicy.java:98:
warning - @param argument "htd" is not a parameter name.
[WARNING] /x1/jenkins/jenkins-slave/workspace/HBase-0.94/trunk/src/main/java/org/apache/hadoop/hbase/regionserver/StoreFile.java:94:
warning - Tag @link: can't find WriterBuilder in org.apache.hadoop.hbase.regionserver.StoreFile
[WARNING] /x1/jenkins/jenkins-slave/workspace/HBase-0.94/trunk/src/main/java/org/apache/hadoop/hbase/regionserver/StoreFile.java:254:
warning - @param argument "blockcache" is not a parameter name.
[WARNING] /x1/jenkins/jenkins-slave/workspace/HBase-0.94/trunk/src/main/java/org/apache/hadoop/hbase/regionserver/StoreFileScanner.java:221:
warning - @return tag has no arguments.
[WARNING] /x1/jenkins/jenkins-slave/workspace/HBase-0.94/trunk/src/main/java/org/apache/hadoop/hbase/regionserver/metrics/OperationMetrics.java:99:
warning - @param argument "conf" is not a parameter name.
[WARNING] /x1/jenkins/jenkins-slave/workspace/HBase-0.94/trunk/src/main/java/org/apache/hadoop/hbase/regionserver/compactions/CompactionRequest.java:124:
warning - @return tag has no arguments.
[WARNING] /x1/jenkins/jenkins-slave/workspace/HBase-0.94/trunk/src/main/java/org/apache/hadoop/hbase/regionserver/compactions/CompactSelection.java:129:
warning - @return tag has no arguments.
[WARNING] /x1/jenkins/jenkins-slave/workspace/HBase-0.94/trunk/src/main/java/org/apache/hadoop/hbase/regionserver/compactions/CompactSelection.java:129:
warning - @param argument "currentHour" is not a parameter name.
[WARNING] /x1/jenkins/jenkins-slave/workspace/HBase-0.94/trunk/src/main/java/org/apache/hadoop/hbase/ipc/HRegionInterface.java:91:
warning - @param argument "region" is not a parameter name.
[WARNING] /x1/jenkins/jenkins-slave/workspace/HBase-0.94/trunk/src/main/java/org/apache/hadoop/hbase/ipc/HRegionInterface.java:99:
warning - @param argument "region" is not a parameter name.
[WARNING] /x1/jenkins/jenkins-slave/workspace/HBase-0.94/trunk/src/main/java/org/apache/hadoop/hbase/ipc/HRegionInterface.java:99:
warning - @param argument "timestamp" is not a parameter name.
[WARNING] /x1/jenkins/jenkins-slave/workspace/HBase-0.94/trunk/src/main/java/org/apache/hadoop/hbase/ipc/HRegionInterface.java:114:
warning - @param argument "region" is not a parameter name.
[WARNING] /x1/jenkins/jenkins-slave/workspace/HBase-0.94/trunk/src/main/java/org/apache/hadoop/hbase/ipc/HRegionInterface.java:114:
warning - @param argument "CF" is not a parameter name.
[WARNING] /x1/jenkins/jenkins-slave/workspace/HBase-0.94/trunk/src/main/java/org/apache/hadoop/hbase/ipc/HRegionInterface.java:123:
warning - @param argument "region" is not a parameter name.
[WARNING] /x1/jenkins/jenkins-slave/workspace/HBase-0.94/trunk/src/main/java/org/apache/hadoop/hbase/ipc/HRegionInterface.java:123:
warning - @param argument "CF" is not a parameter name.
[WARNING] /x1/jenkins/jenkins-slave/workspace/HBase-0.94/trunk/src/main/java/org/apache/hadoop/hbase/ipc/HRegionInterface.java:131:
warning - @param argument "region" is not a parameter name.
[WARNING] /x1/jenkins/jenkins-slave/workspace/HBase-0.94/trunk/src/main/java/org/apache/hadoop/hbase/ipc/HRegionInterface.java:676:
warning - @param argument "Scan" is not a parameter name.
[WARNING] /x1/jenkins/jenkins-slave/workspace/HBase-0.94/trunk/src/main/java/org/apache/hadoop/hbase/io/FileLink.java:89:
warning - Tag @link: reference not found: CleanerChore
[WARNING] /x1/jenkins/jenkins-slave/workspace/HBase-0.94/trunk/src/main/java/org/apache/hadoop/hbase/io/hfile/BlockCache.java:56:
warning - Tag @see cannot be used in inline documentation.  It can only be used in the following
types of documentation: overview, package, class/interface, constructor, field, method.
[WARNING] /x1/jenkins/jenkins-slave/workspace/HBase-0.94/trunk/src/main/java/org/apache/hadoop/hbase/io/hfile/BlockCache.java:56:
warning - Tag @see cannot be used in inline documentation.  It can only be used in the following
types of documentation: overview, package, class/interface, constructor, field, method.
[WARNING] /x1/jenkins/jenkins-slave/workspace/HBase-0.94/trunk/src/main/java/org/apache/hadoop/hbase/io/hfile/HFileBlock.java:628:
warning - Tag @link: can't find startWriting(BlockType, boolean) in org.apache.hadoop.hbase.io.hfile.HFileBlock.Writer
[WARNING] /x1/jenkins/jenkins-slave/workspace/HBase-0.94/trunk/src/main/java/org/apache/hadoop/hbase/io/hfile/HFileBlock.java:628:
warning - Tag @link: can't find getHeaderAndData() in org.apache.hadoop.hbase.io.hfile.HFileBlock.Writer
[WARNING] /x1/jenkins/jenkins-slave/workspace/HBase-0.94/trunk/src/main/java/org/apache/hadoop/hbase/io/hfile/HFileBlock.java:734:
warning - @param argument "dataBlockEncoderAlgo" is not a parameter name.
[WARNING] /x1/jenkins/jenkins-slave/workspace/HBase-0.94/trunk/src/main/java/org/apache/hadoop/hbase/io/hfile/HFileReaderV1.java:418:
warning - @return tag has no arguments.
[WARNING] /x1/jenkins/jenkins-slave/workspace/HBase-0.94/trunk/src/main/java/org/apache/hadoop/hbase/io/hfile/LruBlockCache.java:355:
warning - Tag @see cannot be used in inline documentation.  It can only be used in the following
types of documentation: overview, package, class/interface, constructor, field, method.
[WARNING] /x1/jenkins/jenkins-slave/workspace/HBase-0.94/trunk/src/main/java/org/apache/hadoop/hbase/io/hfile/BlockCache.java:56:
warning - Tag @see cannot be used in inline documentation.  It can only be used in the following
types of documentation: overview, package, class/interface, constructor, field, method.
[WARNING] /x1/jenkins/jenkins-slave/workspace/HBase-0.94/trunk/src/main/java/org/apache/hadoop/hbase/io/hfile/BlockCache.java:56:
warning - Tag @see cannot be used in inline documentation.  It can only be used in the following
types of documentation: overview, package, class/interface, constructor, field, method.
[WARNING] /x1/jenkins/jenkins-slave/workspace/HBase-0.94/trunk/src/main/java/org/apache/hadoop/hbase/replication/regionserver/ReplicationHLogReaderManager.java:64:
warning - @return tag has no arguments.
[WARNING] /x1/jenkins/jenkins-slave/workspace/HBase-0.94/trunk/src/main/java/org/apache/hadoop/hbase/util/ByteBufferUtils.java:409:
warning - @return tag has no arguments.
[WARNING] /x1/jenkins/jenkins-slave/workspace/HBase-0.94/trunk/src/main/java/org/apache/hadoop/hbase/util/ByteBufferUtils.java:386:
warning - @param argument "rightArray" is not a parameter name.
[WARNING] /x1/jenkins/jenkins-slave/workspace/HBase-0.94/trunk/src/main/java/org/apache/hadoop/hbase/util/ChecksumFactory.java:57:
warning - @param argument "theClass" is not a parameter name.
[WARNING] /x1/jenkins/jenkins-slave/workspace/HBase-0.94/trunk/src/main/java/org/apache/hadoop/hbase/util/ChecksumType.java:172:
warning - @param argument "b" is not a parameter name.
[WARNING] /x1/jenkins/jenkins-slave/workspace/HBase-0.94/trunk/src/main/java/org/apache/hadoop/hbase/util/FSUtils.java:1300:
warning - @return tag has no arguments.
[WARNING] /x1/jenkins/jenkins-slave/workspace/HBase-0.94/trunk/src/main/java/org/apache/hadoop/hbase/util/FSUtils.java:1351:
warning - @return tag has no arguments.
[WARNING] /x1/jenkins/jenkins-slave/workspace/HBase-0.94/trunk/src/main/java/org/apache/hadoop/hbase/util/FSUtils.java:131:
warning - DEFAULT_BUFFER_SIZE (referenced by @value tag) is an unknown reference.
[WARNING] /x1/jenkins/jenkins-slave/workspace/HBase-0.94/trunk/src/main/java/org/apache/hadoop/hbase/util/FSUtils.java:154:
warning - DEFAULT_BUFFER_SIZE (referenced by @value tag) is an unknown reference.
[WARNING] /x1/jenkins/jenkins-slave/workspace/HBase-0.94/trunk/src/main/java/org/apache/hadoop/hbase/util/HBaseFsckRepair.java:87:
warning - @param argument "conf" is not a parameter name.
[WARNING] /x1/jenkins/jenkins-slave/workspace/HBase-0.94/trunk/src/main/java/org/apache/hadoop/hbase/util/HFileArchiveUtil.java:50:
warning - @param argument "family" is not a parameter name.
[WARNING] /x1/jenkins/jenkins-slave/workspace/HBase-0.94/trunk/src/main/java/org/apache/hadoop/hbase/util/RegionSplitter.java:149:
warning - Tag @link: can't find rollingSplit(String, String, Configuration) in org.apache.hadoop.hbase.util.RegionSplitter
[WARNING] /x1/jenkins/jenkins-slave/workspace/HBase-0.94/trunk/src/main/java/org/apache/hadoop/hbase/HBaseIOException.java:36:
warning - Tag @inheritDoc cannot be used in constructor documentation.  It can only be used
in the following types of documentation: method, inline text.
[WARNING] /x1/jenkins/jenkins-slave/workspace/HBase-0.94/trunk/src/main/java/org/apache/hadoop/hbase/HBaseIOException.java:43:
warning - Tag @inheritDoc cannot be used in constructor documentation.  It can only be used
in the following types of documentation: method, inline text.
[WARNING] /x1/jenkins/jenkins-slave/workspace/HBase-0.94/trunk/src/main/java/org/apache/hadoop/hbase/HBaseIOException.java:50:
warning - Tag @inheritDoc cannot be used in constructor documentation.  It can only be used
in the following types of documentation: method, inline text.
[INFO] 
[INFO] --- maven-jar-plugin:2.3:jar (default-jar) @ hbase ---
[INFO] Building jar: /x1/jenkins/jenkins-slave/workspace/HBase-0.94/trunk/target/hbase-0.94.13-SNAPSHOT.jar
[INFO] 
[INFO] --- maven-assembly-plugin:2.2-beta-5:single (tarball) @ hbase ---
[INFO] Reading assembly descriptor: src/assembly/all.xml
[INFO] Copying files to /x1/jenkins/jenkins-slave/workspace/HBase-0.94/trunk/target/hbase-0.94.13-SNAPSHOT
[WARNING] Assembly file: /x1/jenkins/jenkins-slave/workspace/HBase-0.94/trunk/target/hbase-0.94.13-SNAPSHOT
is not a regular file (it may be a directory). It cannot be attached to the project build
for installation or deployment.
[INFO] 
[INFO] --- maven-antrun-plugin:1.6:run (package) @ hbase ---
[INFO] Executing tasks

main:
    [mkdir] Created dir: /x1/jenkins/jenkins-slave/workspace/HBase-0.94/trunk/target/hbase-0.94.13-SNAPSHOT/hbase-0.94.13-SNAPSHOT/lib/native/Linux-i386-32
[INFO] Executed tasks
[INFO] 
[INFO] --- apache-rat-plugin:0.8:check (default) @ hbase ---
[INFO] Exclude: **/*.log
[INFO] Exclude: **/.*
[INFO] Exclude: **/*.tgz
[INFO] Exclude: **/*.orig
[INFO] Exclude: test/**
[INFO] Exclude: **/8e8ab58dcf39412da19833fcd8f687ac
[INFO] Exclude: **/.git/**
[INFO] Exclude: **/target/**
[INFO] Exclude: **/CHANGES.txt
[INFO] Exclude: **/generated/**
[INFO] Exclude: **/conf/*
[INFO] Exclude: **/*.avpr
[INFO] Exclude: **/*.svg
[INFO] Exclude: **/*.vm
[INFO] Exclude: **/control
[INFO] Exclude: **/conffile
[INFO] Exclude: docs/*
[INFO] Exclude: **/src/site/resources/css/freebsd_docbook.css
[INFO] Exclude: .git/**
[INFO] Exclude: .svn/**
[INFO] 
[INFO] --- maven-failsafe-plugin:2.12-TRUNK-HBASE-2:integration-test (integration-test) @
hbase ---
[INFO] Tests are skipped.
[INFO] 
[INFO] --- maven-failsafe-plugin:2.12-TRUNK-HBASE-2:verify (verify) @ hbase ---
[INFO] Tests are skipped.
[INFO] 
[INFO] --- maven-install-plugin:2.3:install (default-install) @ hbase ---
[INFO] Installing /x1/jenkins/jenkins-slave/workspace/HBase-0.94/trunk/target/hbase-0.94.13-SNAPSHOT.jar
to /home/jenkins/.m2/repository/org/apache/hbase/hbase/0.94.13-SNAPSHOT/hbase-0.94.13-SNAPSHOT.jar
[INFO] Installing /x1/jenkins/jenkins-slave/workspace/HBase-0.94/trunk/pom.xml to /home/jenkins/.m2/repository/org/apache/hbase/hbase/0.94.13-SNAPSHOT/hbase-0.94.13-SNAPSHOT.pom
[INFO] Installing /x1/jenkins/jenkins-slave/workspace/HBase-0.94/trunk/target/hbase-0.94.13-SNAPSHOT-tests.jar
to /home/jenkins/.m2/repository/org/apache/hbase/hbase/0.94.13-SNAPSHOT/hbase-0.94.13-SNAPSHOT-tests.jar
[INFO] Installing /x1/jenkins/jenkins-slave/workspace/HBase-0.94/trunk/target/hbase-0.94.13-SNAPSHOT-sources.jar
to /home/jenkins/.m2/repository/org/apache/hbase/hbase/0.94.13-SNAPSHOT/hbase-0.94.13-SNAPSHOT-sources.jar
[INFO] 
[INFO] --- maven-assembly-plugin:2.2-beta-5:single (default-cli) @ hbase ---
[INFO] Reading assembly descriptor: src/assembly/all.xml
[INFO] Copying files to /x1/jenkins/jenkins-slave/workspace/HBase-0.94/trunk/target/hbase-0.94.13-SNAPSHOT
[WARNING] Assembly file: /x1/jenkins/jenkins-slave/workspace/HBase-0.94/trunk/target/hbase-0.94.13-SNAPSHOT
is not a regular file (it may be a directory). It cannot be attached to the project build
for installation or deployment.
[INFO] ------------------------------------------------------------------------
[INFO] BUILD SUCCESS
[INFO] ------------------------------------------------------------------------
[INFO] Total time: 1:01:36.957s
[INFO] Finished at: Tue Oct 29 08:21:55 UTC 2013
[INFO] Final Memory: 39M/1149M
[INFO] ------------------------------------------------------------------------
Archiving artifacts
ERROR: Failed to archive artifacts: **/surefire-reports/*,**/site/*,**/*.tar.gz,**/*.txt
hudson.util.IOException2: hudson.util.IOException2: Failed to extract <https://builds.apache.org/job/HBase-0.94/1188/artifact/**/surefire-reports/*,**/site/*,**/*.tar.gz,**/*.txt>
	at hudson.FilePath.readFromTar(FilePath.java:2050)
	at hudson.FilePath.copyRecursiveTo(FilePath.java:1962)
	at hudson.tasks.ArtifactArchiver.perform(ArtifactArchiver.java:137)
	at hudson.tasks.BuildStepMonitor$1.perform(BuildStepMonitor.java:20)
	at hudson.model.AbstractBuild$AbstractBuildExecution.perform(AbstractBuild.java:782)
	at hudson.model.AbstractBuild$AbstractBuildExecution.performAllBuildSteps(AbstractBuild.java:754)
	at hudson.model.Build$BuildExecution.post2(Build.java:183)
	at hudson.model.AbstractBuild$AbstractBuildExecution.post(AbstractBuild.java:707)
	at hudson.model.Run.execute(Run.java:1628)
	at hudson.model.FreeStyleBuild.run(FreeStyleBuild.java:46)
	at hudson.model.ResourceController.execute(ResourceController.java:88)
	at hudson.model.Executor.run(Executor.java:246)
Caused by: java.io.EOFException: Unexpected end of ZLIB input stream
	at com.jcraft.jzlib.InflaterInputStream.fill(InflaterInputStream.java:186)
	at com.jcraft.jzlib.InflaterInputStream.read(InflaterInputStream.java:106)
	at org.apache.tools.tar.TarBuffer.readBlock(TarBuffer.java:257)
	at org.apache.tools.tar.TarBuffer.readRecord(TarBuffer.java:223)
	at hudson.org.apache.tools.tar.TarInputStream.read(TarInputStream.java:345)
	at java.io.FilterInputStream.read(FilterInputStream.java:107)
	at org.apache.commons.io.IOUtils.copyLarge(IOUtils.java:1025)
	at org.apache.commons.io.IOUtils.copy(IOUtils.java:999)
	at hudson.util.IOUtils.copy(IOUtils.java:37)
	at hudson.FilePath.readFromTar(FilePath.java:2040)
	... 11 more

	at hudson.FilePath.copyRecursiveTo(FilePath.java:1969)
	at hudson.tasks.ArtifactArchiver.perform(ArtifactArchiver.java:137)
	at hudson.tasks.BuildStepMonitor$1.perform(BuildStepMonitor.java:20)
	at hudson.model.AbstractBuild$AbstractBuildExecution.perform(AbstractBuild.java:782)
	at hudson.model.AbstractBuild$AbstractBuildExecution.performAllBuildSteps(AbstractBuild.java:754)
	at hudson.model.Build$BuildExecution.post2(Build.java:183)
	at hudson.model.AbstractBuild$AbstractBuildExecution.post(AbstractBuild.java:707)
	at hudson.model.Run.execute(Run.java:1628)
	at hudson.model.FreeStyleBuild.run(FreeStyleBuild.java:46)
	at hudson.model.ResourceController.execute(ResourceController.java:88)
	at hudson.model.Executor.run(Executor.java:246)
Caused by: java.util.concurrent.ExecutionException: java.lang.ArrayIndexOutOfBoundsException:
65536
	at hudson.remoting.Channel$3.adapt(Channel.java:747)
	at hudson.remoting.Channel$3.adapt(Channel.java:742)
	at hudson.remoting.FutureAdapter.get(FutureAdapter.java:59)
	at hudson.FilePath.copyRecursiveTo(FilePath.java:1965)
	... 10 more
Caused by: java.lang.ArrayIndexOutOfBoundsException: 65536
	at com.jcraft.jzlib.Deflate._tr_tally(Deflate.java:635)
	at com.jcraft.jzlib.Deflate.deflate_slow(Deflate.java:1177)
	at com.jcraft.jzlib.Deflate.deflate(Deflate.java:1586)
	at com.jcraft.jzlib.Deflater.deflate(Deflater.java:140)
	at com.jcraft.jzlib.DeflaterOutputStream.deflate(DeflaterOutputStream.java:129)
	at com.jcraft.jzlib.DeflaterOutputStream.write(DeflaterOutputStream.java:102)
	at java.io.BufferedOutputStream.write(BufferedOutputStream.java:122)
	at org.apache.tools.tar.TarBuffer.writeBlock(TarBuffer.java:410)
	at org.apache.tools.tar.TarBuffer.writeRecord(TarBuffer.java:351)
	at hudson.org.apache.tools.tar.TarOutputStream.writeEOFRecord(TarOutputStream.java:356)
	at hudson.org.apache.tools.tar.TarOutputStream.finish(TarOutputStream.java:137)
	at hudson.org.apache.tools.tar.TarOutputStream.close(TarOutputStream.java:149)
	at hudson.util.io.TarArchiver.close(TarArchiver.java:126)
	at hudson.FilePath.writeToTar(FilePath.java:2016)
	at hudson.FilePath.access$1000(FilePath.java:173)
	at hudson.FilePath$38.invoke(FilePath.java:1955)
	at hudson.FilePath$38.invoke(FilePath.java:1951)
	at hudson.FilePath$FileCallableWrapper.call(FilePath.java:2423)
	at hudson.remoting.UserRequest.perform(UserRequest.java:118)
	at hudson.remoting.UserRequest.perform(UserRequest.java:48)
	at hudson.remoting.Request$2.run(Request.java:326)
	at hudson.remoting.InterceptingExecutorService$1.call(InterceptingExecutorService.java:72)
	at java.util.concurrent.FutureTask$Sync.innerRun(FutureTask.java:334)
	at java.util.concurrent.FutureTask.run(FutureTask.java:166)
	at java.util.concurrent.ThreadPoolExecutor.runWorker(ThreadPoolExecutor.java:1146)
	at java.util.concurrent.ThreadPoolExecutor$Worker.run(ThreadPoolExecutor.java:615)
	at java.lang.Thread.run(Thread.java:679)
Build step 'Archive the artifacts' changed build result to FAILURE
Updating HBASE-8667
Updating HBASE-9847
Updating HBASE-9593
Updating HBASE-9842
Recording test results

Mime
View raw message