hbase-builds mailing list archives

Site index · List index
Message view « Date » · « Thread »
Top « Date » · « Thread »
From Apache Jenkins Server <jenk...@builds.apache.org>
Subject Build failed in Jenkins: HBase-TRUNK #4574
Date Mon, 30 Sep 2013 20:16:41 GMT
See <https://builds.apache.org/job/HBase-TRUNK/4574/changes>

Changes:

[stack] HBASE-9612 Ability to batch edits destined to different regions

------------------------------------------
[...truncated 4259 lines...]
Running org.apache.hadoop.hbase.client.TestCloneSnapshotFromClient
Tests run: 4, Failures: 0, Errors: 0, Skipped: 0, Time elapsed: 312.525 sec
Running org.apache.hadoop.hbase.client.TestFromClientSideNoCodec
Tests run: 2, Failures: 0, Errors: 0, Skipped: 0, Time elapsed: 18.781 sec
Running org.apache.hadoop.hbase.client.TestMultiParallel
Tests run: 11, Failures: 8, Errors: 2, Skipped: 0, Time elapsed: 653.758 sec <<<
FAILURE!
Running org.apache.hadoop.hbase.rest.TestGzipFilter
Tests run: 2, Failures: 0, Errors: 0, Skipped: 0, Time elapsed: 18.735 sec
Running org.apache.hadoop.hbase.rest.TestMultiRowResource
Tests run: 3, Failures: 0, Errors: 0, Skipped: 0, Time elapsed: 20.219 sec
Running org.apache.hadoop.hbase.rest.TestScannersWithFilters
Tests run: 10, Failures: 0, Errors: 0, Skipped: 0, Time elapsed: 24.642 sec
Running org.apache.hadoop.hbase.constraint.TestConstraint
Tests run: 5, Failures: 1, Errors: 1, Skipped: 0, Time elapsed: 92.14 sec <<< FAILURE!
Running org.apache.hadoop.hbase.rest.client.TestRemoteTable
Tests run: 5, Failures: 0, Errors: 0, Skipped: 0, Time elapsed: 20.876 sec
Running org.apache.hadoop.hbase.rest.TestVersionResource
Tests run: 7, Failures: 0, Errors: 0, Skipped: 0, Time elapsed: 20.387 sec
Running org.apache.hadoop.hbase.rest.TestRowResource
Tests run: 15, Failures: 0, Errors: 0, Skipped: 0, Time elapsed: 68.292 sec
Running org.apache.hadoop.hbase.rest.TestScannerResource
Tests run: 5, Failures: 0, Errors: 0, Skipped: 0, Time elapsed: 30.95 sec
Running org.apache.hadoop.hbase.rest.TestStatusResource
Tests run: 2, Failures: 0, Errors: 0, Skipped: 0, Time elapsed: 19.686 sec
Running org.apache.hadoop.hbase.rest.TestTableResource
Tests run: 8, Failures: 0, Errors: 0, Skipped: 0, Time elapsed: 30.503 sec
Running org.apache.hadoop.hbase.rest.TestSchemaResource
Tests run: 2, Failures: 0, Errors: 0, Skipped: 0, Time elapsed: 24.428 sec
Running org.apache.hadoop.hbase.io.encoding.TestLoadAndSwitchEncodeOnDisk
Tests run: 1, Failures: 0, Errors: 0, Skipped: 0, Time elapsed: 48.183 sec
Running org.apache.hadoop.hbase.TestIOFencing
Tests run: 2, Failures: 0, Errors: 0, Skipped: 0, Time elapsed: 122.48 sec
Running org.apache.hadoop.hbase.io.encoding.TestEncodedSeekers
Tests run: 20, Failures: 0, Errors: 0, Skipped: 0, Time elapsed: 75.882 sec
Running org.apache.hadoop.hbase.io.encoding.TestBufferedDataBlockEncoder
Tests run: 1, Failures: 0, Errors: 0, Skipped: 0, Time elapsed: 22.856 sec
Running org.apache.hadoop.hbase.io.encoding.TestChangingEncoding
Tests run: 4, Failures: 0, Errors: 0, Skipped: 0, Time elapsed: 188.482 sec
Running org.apache.hadoop.hbase.io.hfile.TestHFileSeek
Tests run: 1, Failures: 0, Errors: 0, Skipped: 0, Time elapsed: 4.273 sec
Running org.apache.hadoop.hbase.io.hfile.slab.TestSlabCache
Tests run: 7, Failures: 0, Errors: 0, Skipped: 0, Time elapsed: 20.339 sec
Running org.apache.hadoop.hbase.io.hfile.slab.TestSingleSizeCache
Tests run: 5, Failures: 0, Errors: 0, Skipped: 0, Time elapsed: 27.137 sec
Running org.apache.hadoop.hbase.io.hfile.TestHFileBlockIndex
Tests run: 10, Failures: 0, Errors: 0, Skipped: 0, Time elapsed: 10.851 sec
Running org.apache.hadoop.hbase.io.hfile.TestHFilePerformance
Tests run: 1, Failures: 0, Errors: 0, Skipped: 0, Time elapsed: 5.816 sec
Running org.apache.hadoop.hbase.io.encoding.TestDataBlockEncoders
Tests run: 24, Failures: 0, Errors: 0, Skipped: 0, Time elapsed: 235.47 sec
Running org.apache.hadoop.hbase.io.hfile.TestForceCacheImportantBlocks
Tests run: 2, Failures: 0, Errors: 0, Skipped: 0, Time elapsed: 28.158 sec
Running org.apache.hadoop.hbase.io.hfile.TestScannerSelectionUsingTTL
Tests run: 6, Failures: 0, Errors: 0, Skipped: 0, Time elapsed: 61.665 sec
Running org.apache.hadoop.hbase.io.hfile.TestHFileBlock
Tests run: 28, Failures: 0, Errors: 0, Skipped: 0, Time elapsed: 101.567 sec
Running org.apache.hadoop.hbase.io.hfile.TestCacheOnWrite
Tests run: 36, Failures: 0, Errors: 0, Skipped: 0, Time elapsed: 106.326 sec
Running org.apache.hadoop.hbase.io.TestFileLink
Tests run: 3, Failures: 0, Errors: 0, Skipped: 0, Time elapsed: 28.862 sec
Running org.apache.hadoop.hbase.TestClusterBootOrder
Tests run: 2, Failures: 0, Errors: 0, Skipped: 0, Time elapsed: 46.26 sec
Running org.apache.hadoop.hbase.migration.TestUpgradeTo96
Tests run: 5, Failures: 0, Errors: 0, Skipped: 0, Time elapsed: 42.75 sec
Running org.apache.hadoop.hbase.migration.TestNamespaceUpgrade
Tests run: 4, Failures: 0, Errors: 0, Skipped: 0, Time elapsed: 100.81 sec
Running org.apache.hadoop.hbase.replication.TestReplicationKillMasterRSCompressed
Tests run: 1, Failures: 1, Errors: 0, Skipped: 0, Time elapsed: 99.765 sec <<< FAILURE!
Running org.apache.hadoop.hbase.replication.TestReplicationChangingPeerRegionservers
Tests run: 1, Failures: 0, Errors: 0, Skipped: 0, Time elapsed: 66.101 sec
Running org.apache.hadoop.hbase.replication.TestReplicationDisableInactivePeer
Tests run: 1, Failures: 0, Errors: 0, Skipped: 0, Time elapsed: 85.663 sec
Running org.apache.hadoop.hbase.replication.TestMultiSlaveReplication
Tests run: 1, Failures: 0, Errors: 0, Skipped: 0, Time elapsed: 63.001 sec
Running org.apache.hadoop.hbase.replication.TestReplicationKillMasterRS
Tests run: 1, Failures: 1, Errors: 0, Skipped: 0, Time elapsed: 101.517 sec <<< FAILURE!
Running org.apache.hadoop.hbase.replication.regionserver.TestReplicationSourceManager
Tests run: 3, Failures: 0, Errors: 0, Skipped: 0, Time elapsed: 2.3 sec
Running org.apache.hadoop.hbase.replication.regionserver.TestReplicationSink
Tests run: 5, Failures: 0, Errors: 0, Skipped: 0, Time elapsed: 26.868 sec
Running org.apache.hadoop.hbase.replication.TestReplicationTrackerZKImpl
Tests run: 4, Failures: 0, Errors: 0, Skipped: 2, Time elapsed: 1.316 sec
Running org.apache.hadoop.hbase.replication.TestReplicationStateZKImpl
Tests run: 6, Failures: 0, Errors: 0, Skipped: 0, Time elapsed: 4.665 sec
Running org.apache.hadoop.hbase.replication.regionserver.TestReplicationHLogReaderManager
Tests run: 8, Failures: 0, Errors: 0, Skipped: 0, Time elapsed: 186.246 sec
Running org.apache.hadoop.hbase.replication.TestReplicationSource
Tests run: 1, Failures: 0, Errors: 0, Skipped: 0, Time elapsed: 7.64 sec
Running org.apache.hadoop.hbase.replication.TestMasterReplication
Tests run: 3, Failures: 0, Errors: 0, Skipped: 0, Time elapsed: 183.139 sec
Running org.apache.hadoop.hbase.replication.TestReplicationSmallTests
Tests run: 9, Failures: 0, Errors: 0, Skipped: 0, Time elapsed: 107.5 sec
Running org.apache.hadoop.hbase.ipc.TestDelayedRpc
Tests run: 4, Failures: 0, Errors: 0, Skipped: 0, Time elapsed: 3.132 sec
Running org.apache.hadoop.hbase.ipc.TestProtoBufRpc
Tests run: 1, Failures: 0, Errors: 0, Skipped: 0, Time elapsed: 1.28 sec
Running org.apache.hadoop.hbase.ipc.TestHBaseClient
Tests run: 1, Failures: 0, Errors: 0, Skipped: 0, Time elapsed: 0.248 sec
Running org.apache.hadoop.hbase.replication.TestReplicationKillSlaveRS
Tests run: 1, Failures: 1, Errors: 0, Skipped: 0, Time elapsed: 100.935 sec <<< FAILURE!
Running org.apache.hadoop.hbase.TestZooKeeper
Tests run: 10, Failures: 0, Errors: 0, Skipped: 0, Time elapsed: 53.436 sec
Running org.apache.hadoop.hbase.TestHBaseTestingUtility
Tests run: 7, Failures: 0, Errors: 0, Skipped: 0, Time elapsed: 124.21 sec

Results :

Failed tests:   testDisallowWritesInRecovering(org.apache.hadoop.hbase.master.TestDistributedLogSplitting):
No RegionInRecoveryException. Following exceptions returned=[java.io.IOException: java.io.IOException:
Index: 0, Size: 0]
  testReconstruction(org.apache.hadoop.hbase.TestFullLogReconstruction): expected:<17576>
but was:<6720>
  testHBaseFsckClean(org.apache.hadoop.hbase.util.TestHBaseFsck): expected:<8> but was:<6>
  testCoveredStartKey(org.apache.hadoop.hbase.util.TestHBaseFsck): expected:<8> but
was:<6>
  testFixHdfsHolesNotWorkingWithNoHdfsChecking(org.apache.hadoop.hbase.util.TestHBaseFsck):
expected:<8> but was:<6>
  testQuarantineMissingHFile(org.apache.hadoop.hbase.util.TestHBaseFsck): expected:<8>
but was:<6>
  testQuarantineCorruptHFile(org.apache.hadoop.hbase.util.TestHBaseFsck): expected:<8>
but was:<6>
  testLingeringSplitParent(org.apache.hadoop.hbase.util.TestHBaseFsck): expected:<8>
but was:<6>
  testValidLingeringSplitParent(org.apache.hadoop.hbase.util.TestHBaseFsck): expected:<8>
but was:<6>
  testFixMetaNotWorkingWithNoHdfsChecking(org.apache.hadoop.hbase.util.TestHBaseFsck): expected:<8>
but was:<6>
  testHDFSRegioninfoMissing(org.apache.hadoop.hbase.util.TestHBaseFsck): expected:<8>
but was:<6>
  testNoHdfsTable(org.apache.hadoop.hbase.util.TestHBaseFsck): expected:<8> but was:<6>
  testDupeRegion(org.apache.hadoop.hbase.util.TestHBaseFsck): expected:<8> but was:<6>
  testContainedRegionOverlap(org.apache.hadoop.hbase.util.TestHBaseFsck): expected:<8>
but was:<6>
  testDupeStartKey(org.apache.hadoop.hbase.util.TestHBaseFsck): expected:<8> but was:<6>
  testNotInMetaHole(org.apache.hadoop.hbase.util.TestHBaseFsck): expected:<8> but was:<6>
  testMissingLastRegion(org.apache.hadoop.hbase.util.TestHBaseFsck): expected:<8> but
was:<6>
  testSidelineOverlapRegion(org.apache.hadoop.hbase.util.TestHBaseFsck): expected:<8>
but was:<6>
  testFixAssignmentsAndNoHdfsChecking(org.apache.hadoop.hbase.util.TestHBaseFsck): expected:<8>
but was:<6>
  testLingeringReferenceFile(org.apache.hadoop.hbase.util.TestHBaseFsck): expected:<8>
but was:<6>
  testSplitDaughtersNotInMeta(org.apache.hadoop.hbase.util.TestHBaseFsck): expected:<8>
but was:<6>
  testOverlapAndOrphan(org.apache.hadoop.hbase.util.TestHBaseFsck): expected:<8> but
was:<6>
  testRegionHole(org.apache.hadoop.hbase.util.TestHBaseFsck): expected:<8> but was:<6>
  testNotInHdfs(org.apache.hadoop.hbase.util.TestHBaseFsck): expected:<8> but was:<6>
  testNotInMetaOrDeployedHole(org.apache.hadoop.hbase.util.TestHBaseFsck): expected:<8>
but was:<6>
  testDegenerateRegions(org.apache.hadoop.hbase.util.TestHBaseFsck): expected:<8> but
was:<6>
  testMissingFirstRegion(org.apache.hadoop.hbase.util.TestHBaseFsck): expected:<8> but
was:<6>
  testQuarantineMissingRegionDir(org.apache.hadoop.hbase.util.TestHBaseFsck): expected:<8>
but was:<6>
  testExceptionFromCoprocessorDuringPut(org.apache.hadoop.hbase.coprocessor.TestRegionServerCoprocessorExceptionWithRemove)
  testMultiRegionTable(org.apache.hadoop.hbase.mapred.TestTableMapReduce)
  testCombiner(org.apache.hadoop.hbase.mapreduce.TestTableMapReduce)
  testMultiRegionTable(org.apache.hadoop.hbase.mapreduce.TestTableMapReduce)
  testScanEmptyToOPP(org.apache.hadoop.hbase.mapreduce.TestTableInputFormatScan1)
  testMultithreadedTableMapper(org.apache.hadoop.hbase.mapreduce.TestMultithreadedTableMapper)
  testScanOPPToEmpty(org.apache.hadoop.hbase.mapreduce.TestTableInputFormatScan2)
  testScanYYXToEmpty(org.apache.hadoop.hbase.mapreduce.TestTableInputFormatScan2)
  testScanOBBToOPP(org.apache.hadoop.hbase.mapreduce.TestTableInputFormatScan2)
  testScanOBBToQPP(org.apache.hadoop.hbase.mapreduce.TestTableInputFormatScan2)
  testScanFromConfiguration(org.apache.hadoop.hbase.mapreduce.TestTableInputFormatScan2)
  testFlushCreateListDestroy(org.apache.hadoop.hbase.snapshot.TestFlushSnapshotFromClient):
Missing region 1
  testSnapshotStateAfterMerge(org.apache.hadoop.hbase.snapshot.TestFlushSnapshotFromClient):
expected:<100> but was:<8>
  testTakeSnapshotAfterMerge(org.apache.hadoop.hbase.snapshot.TestFlushSnapshotFromClient):
expected:<100> but was:<13>
  testFlushTableSnapshot(org.apache.hadoop.hbase.snapshot.TestFlushSnapshotFromClient): expected:<15>
but was:<2>
  testPutNoCF(org.apache.hadoop.hbase.client.TestFromClientSide): Should throw NoSuchColumnFamilyException
  testHTableMultiplexer(org.apache.hadoop.hbase.client.TestHTableMultiplexer)
  testPutNoCF(org.apache.hadoop.hbase.client.TestFromClientSideWithCoprocessor): Should throw
NoSuchColumnFamilyException
  testRestoreSchemaChange(org.apache.hadoop.hbase.client.TestRestoreSnapshotFromClient): expected:<694>
but was:<278>
  testForceSplit(org.apache.hadoop.hbase.client.TestAdmin): expected:<6000> but was:<3003>
  testForceSplitMultiFamily(org.apache.hadoop.hbase.client.TestAdmin)
  testBatchWithPut(org.apache.hadoop.hbase.client.TestMultiParallel)
  testFlushCommitsWithAbort(org.apache.hadoop.hbase.client.TestMultiParallel)
  testBatchWithManyColsInOneRowGetAndPut(org.apache.hadoop.hbase.client.TestMultiParallel)
  testHTableDeleteWithList(org.apache.hadoop.hbase.client.TestMultiParallel)
  testBadFam(org.apache.hadoop.hbase.client.TestMultiParallel)
  testFlushCommitsNoAbort(org.apache.hadoop.hbase.client.TestMultiParallel)
  testBatchWithDelete(org.apache.hadoop.hbase.client.TestMultiParallel)
  testBatchWithMixedActions(org.apache.hadoop.hbase.client.TestMultiParallel)
  testIsUnloaded(org.apache.hadoop.hbase.constraint.TestConstraint): RuntimeFailConstraint
wasn't triggered - this put shouldn't work!
  killOneMasterRS(org.apache.hadoop.hbase.replication.TestReplicationKillMasterRSCompressed):
Waited too much time for queueFailover replication. Waited 17857ms.
  killOneMasterRS(org.apache.hadoop.hbase.replication.TestReplicationKillMasterRS): Waited
too much time for queueFailover replication. Waited 15605ms.
  killOneSlaveRS(org.apache.hadoop.hbase.replication.TestReplicationKillSlaveRS): Waited too
much time for queueFailover replication. Waited 16112ms.

Tests in error: 
  testBatchWithIncrementAndAppend(org.apache.hadoop.hbase.client.TestMultiParallel): Failed
2 actions: IOException: 2 times, 
  testBatchWithGet(org.apache.hadoop.hbase.client.TestMultiParallel)
  testConstraintFails(org.apache.hadoop.hbase.constraint.TestConstraint): test timed out after
60000 milliseconds

Tests run: 1591, Failures: 61, Errors: 3, Skipped: 22

[INFO] ------------------------------------------------------------------------
[INFO] Reactor Summary:
[INFO] 
[INFO] HBase ............................................. SUCCESS [17.928s]
[INFO] HBase - Common .................................... SUCCESS [24.273s]
[INFO] HBase - Protocol .................................. SUCCESS [18.855s]
[INFO] HBase - Client .................................... SUCCESS [14.856s]
[INFO] HBase - Hadoop Compatibility ...................... SUCCESS [5.458s]
[INFO] HBase - Hadoop One Compatibility .................. SUCCESS [2.435s]
[INFO] HBase - Prefix Tree ............................... SUCCESS [3.867s]
[INFO] HBase - Server .................................... FAILURE [2:43:27.984s]
[INFO] HBase - Thrift .................................... SKIPPED
[INFO] HBase - Shell ..................................... SKIPPED
[INFO] HBase - Integration Tests ......................... SKIPPED
[INFO] HBase - Examples .................................. SKIPPED
[INFO] HBase - Assembly .................................. SKIPPED
[INFO] ------------------------------------------------------------------------
[INFO] BUILD FAILURE
[INFO] ------------------------------------------------------------------------
[INFO] Total time: 2:44:56.431s
[INFO] Finished at: Mon Sep 30 20:15:20 UTC 2013
[INFO] Final Memory: 31M/394M
[INFO] ------------------------------------------------------------------------
[ERROR] Failed to execute goal org.apache.maven.plugins:maven-surefire-plugin:2.12-TRUNK-HBASE-2:test
(secondPartTestsExecution) on project hbase-server: Failure or timeout -> [Help 1]
[ERROR] 
[ERROR] To see the full stack trace of the errors, re-run Maven with the -e switch.
[ERROR] Re-run Maven using the -X switch to enable full debug logging.
[ERROR] 
[ERROR] For more information about the errors and possible solutions, please read the following
articles:
[ERROR] [Help 1] http://cwiki.apache.org/confluence/display/MAVEN/MojoExecutionException
[ERROR] 
[ERROR] After correcting the problems, you can resume the build with the command
[ERROR]   mvn <goals> -rf :hbase-server
Build step 'Invoke top-level Maven targets' marked build as failure
Performing Post build task...
Match found for :.* : True
Logical operation result is TRUE
Running script  :   ZOMBIE_TESTS_COUNT=`jps | grep surefirebooter | wc -l`
  if [[ $ZOMBIE_TESTS_COUNT != 0 ]] ; then
    #It seems sometimes the tests are not dying immediately. Let's give them 10s
    echo "Suspicious java process found - waiting 10s to see if there are just slow to stop"
    sleep 10   
    ZOMBIE_TESTS_COUNT=`jps | grep surefirebooter | wc -l`
    if [[ $ZOMBIE_TESTS_COUNT != 0 ]] ; then
      echo "There are $ZOMBIE_TESTS_COUNT zombie tests, they should have been killed by surefire
but survived"
      echo "************ BEGIN zombies jstack extract"
      ZB_STACK=`jps | grep surefirebooter | cut -d ' ' -f 1 | xargs -n 1 jstack | grep ".test"
| grep "\.java"`
      jps | grep surefirebooter | cut -d ' ' -f 1 | xargs -n 1 jstack
      echo "************ END  zombies jstack extract"
      JIRA_COMMENT="$JIRA_COMMENT

     {color:red}-1 core zombie tests{color}.  There are ${ZOMBIE_TESTS_COUNT} zombie test(s):
${ZB_STACK}"
      BAD=1
      jps | grep surefirebooter | cut -d ' ' -f 1 | xargs kill -9
    else
      echo "We're ok: there is no zombie test, but some tests took some time to stop"
    fi
  else
    echo "We're ok: there is no zombie test"
  fi
[HBase-TRUNK] $ /bin/bash -xe /tmp/hudson5019093346311786173.sh
++ jps
++ grep surefirebooter
++ wc -l
+ ZOMBIE_TESTS_COUNT=0
+ [[ 0 != 0 ]]
+ echo 'We'\''re ok: there is no zombie test'
We're ok: there is no zombie test
POST BUILD TASK : SUCCESS
END OF POST BUILD TASK : 0
Archiving artifacts
Recording test results
Updating HBASE-9612

Mime
View raw message