hbase-builds mailing list archives

Site index · List index
Message view « Date » · « Thread »
Top « Date » · « Thread »
From Apache Jenkins Server <jenk...@builds.apache.org>
Subject Build failed in Jenkins: HBase-TRUNK-on-Hadoop-2.0.0 #763
Date Thu, 26 Sep 2013 13:05:45 GMT
See <https://builds.apache.org/job/HBase-TRUNK-on-Hadoop-2.0.0/763/changes>

Changes:

[jmhsieh] HBASE-9660 Release source tarball should contain ./dev-support contents

[enis] Added svn:ignore for hbase-thrift and hbase-shell

------------------------------------------
[...truncated 4602 lines...]
	at java.util.concurrent.FutureTask$Sync.innerGet(FutureTask.java:218)
	at java.util.concurrent.FutureTask.get(FutureTask.java:83)
	at org.apache.maven.surefire.junitcore.AsynchronousRunner.waitForCompletion(AsynchronousRunner.java:73)
	at org.apache.maven.surefire.junitcore.AsynchronousRunner.finished(AsynchronousRunner.java:58)
	at org.junit.runners.ParentRunner.runChildren(ParentRunner.java:242)
	at org.junit.runners.ParentRunner.access$000(ParentRunner.java:53)
	at org.junit.runners.ParentRunner$2.evaluate(ParentRunner.java:229)
	at org.junit.runners.ParentRunner.run(ParentRunner.java:309)
	at org.junit.runner.JUnitCore.run(JUnitCore.java:160)
	at org.junit.runner.JUnitCore.run(JUnitCore.java:138)
	at org.apache.maven.surefire.junitcore.JUnitCoreWrapper.execute(JUnitCoreWrapper.java:61)
	at org.apache.maven.surefire.junitcore.JUnitCoreProvider.invoke(JUnitCoreProvider.java:137)
	at sun.reflect.NativeMethodAccessorImpl.invoke0(Native Method)
	at sun.reflect.NativeMethodAccessorImpl.invoke(NativeMethodAccessorImpl.java:39)
	at sun.reflect.DelegatingMethodAccessorImpl.invoke(DelegatingMethodAccessorImpl.java:25)
	at java.lang.reflect.Method.invoke(Method.java:597)
	at org.apache.maven.surefire.util.ReflectionUtils.invokeMethodWithArray(ReflectionUtils.java:188)
	at org.apache.maven.surefire.booter.ProviderFactory$ProviderProxy.invoke(ProviderFactory.java:166)
	at org.apache.maven.surefire.booter.ProviderFactory.invokeProvider(ProviderFactory.java:86)
	at org.apache.maven.surefire.booter.ForkedBooter.runSuitesInProcess(ForkedBooter.java:101)
	at org.apache.maven.surefire.booter.ForkedBooter.main(ForkedBooter.java:74)

"VM Thread" prio=10 tid=0xf67ea000 nid=0x2a98 runnable 

"GC task thread#0 (ParallelGC)" prio=10 tid=0xf670cc00 nid=0x2a90 runnable 

"GC task thread#1 (ParallelGC)" prio=10 tid=0xf670e000 nid=0x2a91 runnable 

"GC task thread#2 (ParallelGC)" prio=10 tid=0xf670f800 nid=0x2a92 runnable 

"GC task thread#3 (ParallelGC)" prio=10 tid=0xf6711000 nid=0x2a93 runnable 

"GC task thread#4 (ParallelGC)" prio=10 tid=0xf6712400 nid=0x2a94 runnable 

"GC task thread#5 (ParallelGC)" prio=10 tid=0xf6713c00 nid=0x2a95 runnable 

"GC task thread#6 (ParallelGC)" prio=10 tid=0xf6715000 nid=0x2a96 runnable 

"GC task thread#7 (ParallelGC)" prio=10 tid=0xf6716800 nid=0x2a97 runnable 

"VM Periodic Task Thread" prio=10 tid=0x74811000 nid=0x2a9f waiting on condition 

JNI global references: 987

2013-09-26 13:04:27
Full thread dump Java HotSpot(TM) Server VM (20.45-b01 mixed mode):

"Attach Listener" daemon prio=10 tid=0x74901000 nid=0x2b5f waiting on condition [0x00000000]
   java.lang.Thread.State: RUNNABLE

"pool-1-thread-1" prio=10 tid=0x74045c00 nid=0x1b39 runnable [0x7477d000]
   java.lang.Thread.State: RUNNABLE
	at org.apache.hadoop.hbase.io.encoding.FastDiffDeltaEncoder$1.decode(FastDiffDeltaEncoder.java:523)
	at org.apache.hadoop.hbase.io.encoding.FastDiffDeltaEncoder$1.decodeNext(FastDiffDeltaEncoder.java:541)
	at org.apache.hadoop.hbase.io.encoding.BufferedDataBlockEncoder$BufferedEncodedSeeker.seekToKeyInBlock(BufferedDataBlockEncoder.java:277)
	at org.apache.hadoop.hbase.io.encoding.TestDataBlockEncoders.checkSeekingConsistency(TestDataBlockEncoders.java:360)
	at org.apache.hadoop.hbase.io.encoding.TestDataBlockEncoders.testSeekingOnSample(TestDataBlockEncoders.java:244)
	at sun.reflect.NativeMethodAccessorImpl.invoke0(Native Method)
	at sun.reflect.NativeMethodAccessorImpl.invoke(NativeMethodAccessorImpl.java:39)
	at sun.reflect.DelegatingMethodAccessorImpl.invoke(DelegatingMethodAccessorImpl.java:25)
	at java.lang.reflect.Method.invoke(Method.java:597)
	at org.junit.runners.model.FrameworkMethod$1.runReflectiveCall(FrameworkMethod.java:47)
	at org.junit.internal.runners.model.ReflectiveCallable.run(ReflectiveCallable.java:12)
	at org.junit.runners.model.FrameworkMethod.invokeExplosively(FrameworkMethod.java:44)
	at org.junit.internal.runners.statements.InvokeMethod.evaluate(InvokeMethod.java:17)
	at org.junit.runners.ParentRunner.runLeaf(ParentRunner.java:271)
	at org.junit.runners.BlockJUnit4ClassRunner.runChild(BlockJUnit4ClassRunner.java:70)
	at org.junit.runners.BlockJUnit4ClassRunner.runChild(BlockJUnit4ClassRunner.java:50)
	at org.junit.runners.ParentRunner$3.run(ParentRunner.java:238)
	at org.junit.runners.ParentRunner$1.schedule(ParentRunner.java:63)
	at org.junit.runners.ParentRunner.runChildren(ParentRunner.java:236)
	at org.junit.runners.ParentRunner.access$000(ParentRunner.java:53)
	at org.junit.runners.ParentRunner$2.evaluate(ParentRunner.java:229)
	at org.junit.runners.ParentRunner.run(ParentRunner.java:309)
	at org.junit.runners.Suite.runChild(Suite.java:127)
	at org.junit.runners.Suite.runChild(Suite.java:26)
	at org.junit.runners.ParentRunner$3.run(ParentRunner.java:238)
	at org.junit.runners.ParentRunner$1.schedule(ParentRunner.java:63)
	at org.junit.runners.ParentRunner.runChildren(ParentRunner.java:236)
	at org.junit.runners.ParentRunner.access$000(ParentRunner.java:53)
	at org.junit.runners.ParentRunner$2.evaluate(ParentRunner.java:229)
	at org.junit.runners.ParentRunner.run(ParentRunner.java:309)
	at org.junit.runners.Suite.runChild(Suite.java:127)
	at org.junit.runners.Suite.runChild(Suite.java:26)
	at org.junit.runners.ParentRunner$3.run(ParentRunner.java:238)
	at java.util.concurrent.Executors$RunnableAdapter.call(Executors.java:439)
	at java.util.concurrent.FutureTask$Sync.innerRun(FutureTask.java:303)
	at java.util.concurrent.FutureTask.run(FutureTask.java:138)
	at java.util.concurrent.ThreadPoolExecutor$Worker.runTask(ThreadPoolExecutor.java:895)
	at java.util.concurrent.ThreadPoolExecutor$Worker.run(ThreadPoolExecutor.java:918)
	at java.lang.Thread.run(Thread.java:662)

"Low Memory Detector" daemon prio=10 tid=0x74807000 nid=0x1b22 runnable [0x00000000]
   java.lang.Thread.State: RUNNABLE

"C2 CompilerThread1" daemon prio=10 tid=0x74805400 nid=0x1b21 waiting on condition [0x00000000]
   java.lang.Thread.State: RUNNABLE

"C2 CompilerThread0" daemon prio=10 tid=0x74803800 nid=0x1b20 waiting on condition [0x00000000]
   java.lang.Thread.State: RUNNABLE

"Signal Dispatcher" daemon prio=10 tid=0x74802400 nid=0x1b1f runnable [0x00000000]
   java.lang.Thread.State: RUNNABLE

"Finalizer" daemon prio=10 tid=0xf67ef400 nid=0x1b1c in Object.wait() [0x75d7d000]
   java.lang.Thread.State: WAITING (on object monitor)
	at java.lang.Object.wait(Native Method)
	- waiting on <0x7d3122c0> (a java.lang.ref.ReferenceQueue$Lock)
	at java.lang.ref.ReferenceQueue.remove(ReferenceQueue.java:118)
	- locked <0x7d3122c0> (a java.lang.ref.ReferenceQueue$Lock)
	at java.lang.ref.ReferenceQueue.remove(ReferenceQueue.java:134)
	at java.lang.ref.Finalizer$FinalizerThread.run(Finalizer.java:171)

"Reference Handler" daemon prio=10 tid=0xf67edc00 nid=0x1b1b in Object.wait() [0x74de4000]
   java.lang.Thread.State: WAITING (on object monitor)
	at java.lang.Object.wait(Native Method)
	- waiting on <0x7d30dca0> (a java.lang.ref.Reference$Lock)
	at java.lang.Object.wait(Object.java:485)
	at java.lang.ref.Reference$ReferenceHandler.run(Reference.java:116)
	- locked <0x7d30dca0> (a java.lang.ref.Reference$Lock)

"main" prio=10 tid=0xf6705800 nid=0x1b11 waiting on condition [0xf6909000]
   java.lang.Thread.State: WAITING (parking)
	at sun.misc.Unsafe.park(Native Method)
	- parking to wait for  <0x7d312318> (a java.util.concurrent.FutureTask$Sync)
	at java.util.concurrent.locks.LockSupport.park(LockSupport.java:156)
	at java.util.concurrent.locks.AbstractQueuedSynchronizer.parkAndCheckInterrupt(AbstractQueuedSynchronizer.java:811)
	at java.util.concurrent.locks.AbstractQueuedSynchronizer.doAcquireSharedInterruptibly(AbstractQueuedSynchronizer.java:969)
	at java.util.concurrent.locks.AbstractQueuedSynchronizer.acquireSharedInterruptibly(AbstractQueuedSynchronizer.java:1281)
	at java.util.concurrent.FutureTask$Sync.innerGet(FutureTask.java:218)
	at java.util.concurrent.FutureTask.get(FutureTask.java:83)
	at org.apache.maven.surefire.junitcore.AsynchronousRunner.waitForCompletion(AsynchronousRunner.java:73)
	at org.apache.maven.surefire.junitcore.AsynchronousRunner.finished(AsynchronousRunner.java:58)
	at org.junit.runners.ParentRunner.runChildren(ParentRunner.java:242)
	at org.junit.runners.ParentRunner.access$000(ParentRunner.java:53)
	at org.junit.runners.ParentRunner$2.evaluate(ParentRunner.java:229)
	at org.junit.runners.ParentRunner.run(ParentRunner.java:309)
	at org.junit.runner.JUnitCore.run(JUnitCore.java:160)
	at org.junit.runner.JUnitCore.run(JUnitCore.java:138)
	at org.apache.maven.surefire.junitcore.JUnitCoreWrapper.execute(JUnitCoreWrapper.java:61)
	at org.apache.maven.surefire.junitcore.JUnitCoreProvider.invoke(JUnitCoreProvider.java:137)
	at sun.reflect.NativeMethodAccessorImpl.invoke0(Native Method)
	at sun.reflect.NativeMethodAccessorImpl.invoke(NativeMethodAccessorImpl.java:39)
	at sun.reflect.DelegatingMethodAccessorImpl.invoke(DelegatingMethodAccessorImpl.java:25)
	at java.lang.reflect.Method.invoke(Method.java:597)
	at org.apache.maven.surefire.util.ReflectionUtils.invokeMethodWithArray(ReflectionUtils.java:188)
	at org.apache.maven.surefire.booter.ProviderFactory$ProviderProxy.invoke(ProviderFactory.java:166)
	at org.apache.maven.surefire.booter.ProviderFactory.invokeProvider(ProviderFactory.java:86)
	at org.apache.maven.surefire.booter.ForkedBooter.runSuitesInProcess(ForkedBooter.java:101)
	at org.apache.maven.surefire.booter.ForkedBooter.main(ForkedBooter.java:74)

"VM Thread" prio=10 tid=0xf67ea000 nid=0x1b1a runnable 

"GC task thread#0 (ParallelGC)" prio=10 tid=0xf670cc00 nid=0x1b12 runnable 

"GC task thread#1 (ParallelGC)" prio=10 tid=0xf670e000 nid=0x1b13 runnable 

"GC task thread#2 (ParallelGC)" prio=10 tid=0xf670f800 nid=0x1b14 runnable 

"GC task thread#3 (ParallelGC)" prio=10 tid=0xf6711000 nid=0x1b15 runnable 

"GC task thread#4 (ParallelGC)" prio=10 tid=0xf6712400 nid=0x1b16 runnable 

"GC task thread#5 (ParallelGC)" prio=10 tid=0xf6713c00 nid=0x1b17 runnable 

"GC task thread#6 (ParallelGC)" prio=10 tid=0xf6715000 nid=0x1b18 runnable 

"GC task thread#7 (ParallelGC)" prio=10 tid=0xf6716800 nid=0x1b19 runnable 

"VM Periodic Task Thread" prio=10 tid=0x74809000 nid=0x1b23 waiting on condition 

JNI global references: 1434

+ echo '************ END  zombies jstack extract'
************ END  zombies jstack extract
+ JIRA_COMMENT='

     {color:red}-1 core zombie tests{color}.  There are 2 zombie test(s): 	at org.apache.hadoop.hbase.io.hfile.CacheTestUtils.testCacheMultiThreaded(CacheTestUtils.java:81)
	at org.apache.hadoop.hbase.io.hfile.slab.TestSingleSizeCache.testCacheMultiThreaded(TestSingleSizeCache.java:62)
	at org.apache.hadoop.hbase.io.encoding.TestDataBlockEncoders.testSeekingOnSample(TestDataBlockEncoders.java:244)'
+ BAD=1
+ jps
+ grep surefirebooter
+ cut -d ' ' -f 1
+ xargs kill -9
POST BUILD TASK : SUCCESS
END OF POST BUILD TASK : 0
Archiving artifacts
ERROR: Failed to archive artifacts: **/surefire-reports/*,**/site/*,**/*.tar.gz,**/*.txt,**/org.apache.hadoop.mapred.MiniMRCluster*/*
hudson.util.IOException2: hudson.util.IOException2: Failed to extract <https://builds.apache.org/job/HBase-TRUNK-on-Hadoop-2.0.0/763/artifact/**/surefire-reports/*,**/site/*,**/*.tar.gz,**/*.txt,**/org.apache.hadoop.mapred.MiniMRCluster*/*>
	at hudson.FilePath.readFromTar(FilePath.java:2050)
	at hudson.FilePath.copyRecursiveTo(FilePath.java:1962)
	at hudson.tasks.ArtifactArchiver.perform(ArtifactArchiver.java:137)
	at hudson.tasks.BuildStepMonitor$1.perform(BuildStepMonitor.java:20)
	at hudson.model.AbstractBuild$AbstractBuildExecution.perform(AbstractBuild.java:782)
	at hudson.model.AbstractBuild$AbstractBuildExecution.performAllBuildSteps(AbstractBuild.java:754)
	at hudson.model.Build$BuildExecution.post2(Build.java:183)
	at hudson.model.AbstractBuild$AbstractBuildExecution.post(AbstractBuild.java:707)
	at hudson.model.Run.execute(Run.java:1628)
	at hudson.model.FreeStyleBuild.run(FreeStyleBuild.java:46)
	at hudson.model.ResourceController.execute(ResourceController.java:88)
	at hudson.model.Executor.run(Executor.java:246)
Caused by: java.io.IOException: unexpected EOF with 1536 bytes unread
	at hudson.org.apache.tools.tar.TarInputStream.read(TarInputStream.java:349)
	at java.io.FilterInputStream.read(FilterInputStream.java:107)
	at org.apache.commons.io.IOUtils.copyLarge(IOUtils.java:1025)
	at org.apache.commons.io.IOUtils.copy(IOUtils.java:999)
	at hudson.util.IOUtils.copy(IOUtils.java:37)
	at hudson.FilePath.readFromTar(FilePath.java:2040)
	... 11 more

	at hudson.FilePath.copyRecursiveTo(FilePath.java:1969)
	at hudson.tasks.ArtifactArchiver.perform(ArtifactArchiver.java:137)
	at hudson.tasks.BuildStepMonitor$1.perform(BuildStepMonitor.java:20)
	at hudson.model.AbstractBuild$AbstractBuildExecution.perform(AbstractBuild.java:782)
	at hudson.model.AbstractBuild$AbstractBuildExecution.performAllBuildSteps(AbstractBuild.java:754)
	at hudson.model.Build$BuildExecution.post2(Build.java:183)
	at hudson.model.AbstractBuild$AbstractBuildExecution.post(AbstractBuild.java:707)
	at hudson.model.Run.execute(Run.java:1628)
	at hudson.model.FreeStyleBuild.run(FreeStyleBuild.java:46)
	at hudson.model.ResourceController.execute(ResourceController.java:88)
	at hudson.model.Executor.run(Executor.java:246)
Caused by: java.util.concurrent.ExecutionException: java.io.IOException: Input/output error
	at hudson.remoting.Channel$3.adapt(Channel.java:747)
	at hudson.remoting.Channel$3.adapt(Channel.java:742)
	at hudson.remoting.FutureAdapter.get(FutureAdapter.java:59)
	at hudson.FilePath.copyRecursiveTo(FilePath.java:1965)
	... 10 more
Caused by: java.io.IOException: Input/output error
	at java.io.FileInputStream.readBytes(Native Method)
	at java.io.FileInputStream.read(FileInputStream.java:214)
	at hudson.util.io.TarArchiver.visit(TarArchiver.java:114)
	at hudson.util.DirScanner$Glob.scan(DirScanner.java:133)
	at hudson.FilePath.writeToTar(FilePath.java:2014)
	at hudson.FilePath.access$1000(FilePath.java:173)
	at hudson.FilePath$38.invoke(FilePath.java:1955)
	at hudson.FilePath$38.invoke(FilePath.java:1951)
	at hudson.FilePath$FileCallableWrapper.call(FilePath.java:2423)
	at hudson.remoting.UserRequest.perform(UserRequest.java:118)
	at hudson.remoting.UserRequest.perform(UserRequest.java:48)
	at hudson.remoting.Request$2.run(Request.java:326)
	at hudson.remoting.InterceptingExecutorService$1.call(InterceptingExecutorService.java:72)
	at java.util.concurrent.FutureTask$Sync.innerRun(FutureTask.java:334)
	at java.util.concurrent.FutureTask.run(FutureTask.java:166)
	at java.util.concurrent.ThreadPoolExecutor.runWorker(ThreadPoolExecutor.java:1146)
	at java.util.concurrent.ThreadPoolExecutor$Worker.run(ThreadPoolExecutor.java:615)
	at java.lang.Thread.run(Thread.java:679)
Recording test results
Updating HBASE-9660

Mime
View raw message