hbase-builds mailing list archives

Site index · List index
Message view « Date » · « Thread »
Top « Date » · « Thread »
From Apache Jenkins Server <jenk...@builds.apache.org>
Subject Build failed in Jenkins: HBase-0.94 #1159
Date Sun, 22 Sep 2013 14:12:07 GMT
See <https://builds.apache.org/job/HBase-0.94/1159/changes>

Changes:

[mbertozzi] HBASE-9607 Data loss after snapshot restore into cloned table

------------------------------------------
[...truncated 6119 lines...]
Tests run: 12, Failures: 0, Errors: 0, Skipped: 0, Time elapsed: 18.203 sec
Running org.apache.hadoop.hbase.regionserver.wal.TestHLogBench
Tests run: 1, Failures: 0, Errors: 0, Skipped: 0, Time elapsed: 1.179 sec
Running org.apache.hadoop.hbase.regionserver.TestSplitTransactionOnCluster
Tests run: 11, Failures: 0, Errors: 0, Skipped: 0, Time elapsed: 68.248 sec
Running org.apache.hadoop.hbase.regionserver.wal.TestHLog
Tests run: 10, Failures: 0, Errors: 0, Skipped: 0, Time elapsed: 55.811 sec
Running org.apache.hadoop.hbase.regionserver.wal.TestLogRollingNoCluster
Tests run: 1, Failures: 0, Errors: 0, Skipped: 0, Time elapsed: 2.794 sec
Running org.apache.hadoop.hbase.regionserver.wal.TestLogRollAbort
Tests run: 1, Failures: 0, Errors: 0, Skipped: 0, Time elapsed: 18.988 sec
Running org.apache.hadoop.hbase.regionserver.wal.TestHLogSplitCompressed
Tests run: 31, Failures: 0, Errors: 0, Skipped: 1, Time elapsed: 97.058 sec
Running org.apache.hadoop.hbase.regionserver.wal.TestDurability
Tests run: 1, Failures: 0, Errors: 0, Skipped: 0, Time elapsed: 3.66 sec
Running org.apache.hadoop.hbase.regionserver.wal.TestWALReplay
Tests run: 8, Failures: 0, Errors: 0, Skipped: 0, Time elapsed: 46.14 sec
Running org.apache.hadoop.hbase.regionserver.wal.TestHLogSplit
Tests run: 31, Failures: 0, Errors: 0, Skipped: 1, Time elapsed: 94.901 sec
Running org.apache.hadoop.hbase.regionserver.wal.TestWALReplayCompressed
Tests run: 8, Failures: 0, Errors: 0, Skipped: 0, Time elapsed: 45.92 sec
Running org.apache.hadoop.hbase.regionserver.TestCacheOnWriteInSchema
Tests run: 3, Failures: 0, Errors: 0, Skipped: 0, Time elapsed: 1.26 sec
Running org.apache.hadoop.hbase.regionserver.TestCompactionState
Tests run: 5, Failures: 0, Errors: 0, Skipped: 0, Time elapsed: 82.778 sec
Running org.apache.hadoop.hbase.mapreduce.TestHFileOutputFormat
Tests run: 10, Failures: 0, Errors: 0, Skipped: 0, Time elapsed: 460.489 sec
Running org.apache.hadoop.hbase.regionserver.wal.TestLogRolling
Tests run: 2, Failures: 0, Errors: 0, Skipped: 0, Time elapsed: 274.238 sec
Running org.apache.hadoop.hbase.regionserver.TestMXBean
Tests run: 1, Failures: 0, Errors: 0, Skipped: 0, Time elapsed: 11.272 sec
Running org.apache.hadoop.hbase.regionserver.TestAtomicOperation
Tests run: 5, Failures: 0, Errors: 0, Skipped: 0, Time elapsed: 14.732 sec
Running org.apache.hadoop.hbase.regionserver.TestRegionServerMetrics
Tests run: 4, Failures: 0, Errors: 0, Skipped: 0, Time elapsed: 71.408 sec
Running org.apache.hadoop.hbase.regionserver.TestRSKilledWhenMasterInitializing
Tests run: 2, Failures: 0, Errors: 0, Skipped: 0, Time elapsed: 75.776 sec
Running org.apache.hadoop.hbase.regionserver.TestHRegionOnCluster
Tests run: 1, Failures: 0, Errors: 0, Skipped: 0, Time elapsed: 24.277 sec
Running org.apache.hadoop.hbase.regionserver.TestServerCustomProtocol
Tests run: 7, Failures: 0, Errors: 0, Skipped: 0, Time elapsed: 15.295 sec
Running org.apache.hadoop.hbase.regionserver.TestFSErrorsExposed
Tests run: 3, Failures: 0, Errors: 0, Skipped: 0, Time elapsed: 32.445 sec
Running org.apache.hadoop.hbase.regionserver.TestParallelPut
Tests run: 2, Failures: 0, Errors: 0, Skipped: 0, Time elapsed: 3.975 sec
Running org.apache.hadoop.hbase.regionserver.TestRpcMetrics
Tests run: 1, Failures: 0, Errors: 0, Skipped: 0, Time elapsed: 2.125 sec
Running org.apache.hadoop.hbase.regionserver.handler.TestCloseRegionHandler
Tests run: 3, Failures: 0, Errors: 0, Skipped: 0, Time elapsed: 1.314 sec
Running org.apache.hadoop.hbase.regionserver.TestSeekOptimizations
Tests run: 6, Failures: 0, Errors: 0, Skipped: 0, Time elapsed: 2.28 sec
Running org.apache.hadoop.hbase.regionserver.TestBlocksRead
Tests run: 4, Failures: 0, Errors: 0, Skipped: 0, Time elapsed: 0.946 sec
Running org.apache.hadoop.hbase.regionserver.TestStoreScanner
Tests run: 16, Failures: 0, Errors: 0, Skipped: 0, Time elapsed: 0.041 sec
Running org.apache.hadoop.hbase.regionserver.TestSplitLogWorker
Tests run: 5, Failures: 0, Errors: 0, Skipped: 0, Time elapsed: 2.893 sec
Running org.apache.hadoop.hbase.regionserver.handler.TestOpenRegionHandler
Tests run: 4, Failures: 0, Errors: 0, Skipped: 0, Time elapsed: 12.363 sec
Running org.apache.hadoop.hbase.regionserver.metrics.TestSchemaMetrics
Tests run: 6, Failures: 0, Errors: 0, Skipped: 0, Time elapsed: 13.076 sec
Running org.apache.hadoop.hbase.regionserver.TestHRegionBusyWait
Running org.apache.hadoop.hbase.regionserver.TestStoreFileBlockCacheSummary
Tests run: 1, Failures: 0, Errors: 0, Skipped: 0, Time elapsed: 13.001 sec
Tests run: 74, Failures: 0, Errors: 0, Skipped: 0, Time elapsed: 57.362 sec
Running org.apache.hadoop.hbase.regionserver.TestMasterAddressManager
Tests run: 1, Failures: 0, Errors: 0, Skipped: 0, Time elapsed: 0.719 sec
Running org.apache.hadoop.hbase.regionserver.TestMultiColumnScanner
Tests run: 12, Failures: 0, Errors: 0, Skipped: 0, Time elapsed: 30.922 sec
Running org.apache.hadoop.hbase.regionserver.TestHRegionServerBulkLoad
Tests run: 1, Failures: 0, Errors: 0, Skipped: 0, Time elapsed: 42.991 sec
Running org.apache.hadoop.hbase.regionserver.TestHRegion
Tests run: 73, Failures: 0, Errors: 0, Skipped: 0, Time elapsed: 39.559 sec
Running org.apache.hadoop.hbase.TestLocalHBaseCluster
Tests run: 1, Failures: 0, Errors: 0, Skipped: 0, Time elapsed: 9.826 sec
Running org.apache.hadoop.hbase.ipc.TestDelayedRpc
Tests run: 4, Failures: 0, Errors: 0, Skipped: 0, Time elapsed: 2.938 sec
Running org.apache.hadoop.hbase.ipc.TestPBOnWritableRpc
Tests run: 1, Failures: 0, Errors: 0, Skipped: 0, Time elapsed: 0.923 sec
Running org.apache.hadoop.hbase.regionserver.TestEndToEndSplitTransaction
Tests run: 2, Failures: 0, Errors: 0, Skipped: 0, Time elapsed: 59.318 sec
Running org.apache.hadoop.hbase.TestGlobalMemStoreSize
Tests run: 1, Failures: 0, Errors: 0, Skipped: 0, Time elapsed: 18.105 sec
Running org.apache.hadoop.hbase.constraint.TestConstraint
Tests run: 5, Failures: 0, Errors: 0, Skipped: 0, Time elapsed: 28.3 sec
Running org.apache.hadoop.hbase.TestFullLogReconstruction
Tests run: 1, Failures: 0, Errors: 0, Skipped: 0, Time elapsed: 45.35 sec
Running org.apache.hadoop.hbase.rest.TestSchemaResource
Tests run: 2, Failures: 0, Errors: 0, Skipped: 0, Time elapsed: 19.933 sec
Running org.apache.hadoop.hbase.rest.client.TestRemoteTable
Tests run: 5, Failures: 0, Errors: 0, Skipped: 0, Time elapsed: 16.195 sec
Running org.apache.hadoop.hbase.rest.client.TestRemoteAdmin
Tests run: 5, Failures: 0, Errors: 0, Skipped: 0, Time elapsed: 19.004 sec
Running org.apache.hadoop.hbase.rest.TestMultiRowResource
Tests run: 3, Failures: 0, Errors: 0, Skipped: 0, Time elapsed: 13.547 sec
Running org.apache.hadoop.hbase.rest.TestGzipFilter
Tests run: 2, Failures: 0, Errors: 0, Skipped: 0, Time elapsed: 14.402 sec
Running org.apache.hadoop.hbase.rest.TestTableResource
Tests run: 8, Failures: 0, Errors: 0, Skipped: 0, Time elapsed: 28.577 sec
Running org.apache.hadoop.hbase.rest.TestVersionResource
Tests run: 7, Failures: 0, Errors: 0, Skipped: 0, Time elapsed: 12.015 sec
Running org.apache.hadoop.hbase.rest.TestRowResource
Tests run: 12, Failures: 0, Errors: 0, Skipped: 0, Time elapsed: 15.975 sec
Running org.apache.hadoop.hbase.rest.TestStatusResource
Tests run: 2, Failures: 0, Errors: 0, Skipped: 0, Time elapsed: 12.721 sec
Running org.apache.hadoop.hbase.rest.TestScannersWithFilters
Tests run: 10, Failures: 0, Errors: 0, Skipped: 0, Time elapsed: 19.039 sec
Running org.apache.hadoop.hbase.rest.TestScannerResource
Tests run: 5, Failures: 0, Errors: 0, Skipped: 0, Time elapsed: 34.089 sec
Running org.apache.hadoop.hbase.metrics.TestMetricsMBeanBase
Tests run: 3, Failures: 0, Errors: 0, Skipped: 0, Time elapsed: 1.361 sec
Running org.apache.hadoop.hbase.io.hfile.TestHFileSeek
Tests run: 1, Failures: 0, Errors: 0, Skipped: 0, Time elapsed: 4.53 sec
Running org.apache.hadoop.hbase.io.hfile.TestLruBlockCache
Tests run: 16, Failures: 0, Errors: 0, Skipped: 0, Time elapsed: 1.096 sec
Running org.apache.hadoop.hbase.io.hfile.TestHFileBlockIndex
Tests run: 10, Failures: 0, Errors: 0, Skipped: 0, Time elapsed: 7.881 sec
Running org.apache.hadoop.hbase.io.hfile.TestFixedFileTrailer
Tests run: 2, Failures: 0, Errors: 0, Skipped: 0, Time elapsed: 0.66 sec
Running org.apache.hadoop.hbase.backup.TestHFileArchiving
Tests run: 5, Failures: 0, Errors: 0, Skipped: 0, Time elapsed: 137.96 sec
Running org.apache.hadoop.hbase.TestHBaseFileSystem
Tests run: 2, Failures: 0, Errors: 0, Skipped: 0, Time elapsed: 20.695 sec
Running org.apache.hadoop.hbase.io.hfile.TestHFileBlockCompatibility
Tests run: 10, Failures: 0, Errors: 0, Skipped: 0, Time elapsed: 0.978 sec
Running org.apache.hadoop.hbase.io.hfile.TestHFilePerformance
Tests run: 1, Failures: 0, Errors: 0, Skipped: 0, Time elapsed: 4.361 sec
Running org.apache.hadoop.hbase.io.hfile.TestChecksum
Tests run: 3, Failures: 0, Errors: 0, Skipped: 0, Time elapsed: 0.828 sec
Running org.apache.hadoop.hbase.io.hfile.slab.TestSlabCache
Tests run: 7, Failures: 0, Errors: 0, Skipped: 0, Time elapsed: 14.621 sec
Running org.apache.hadoop.hbase.io.hfile.TestCacheOnWrite
Tests run: 36, Failures: 0, Errors: 0, Skipped: 0, Time elapsed: 36.058 sec
Running org.apache.hadoop.hbase.io.hfile.slab.TestSingleSizeCache
Tests run: 5, Failures: 0, Errors: 0, Skipped: 0, Time elapsed: 25.876 sec
Running org.apache.hadoop.hbase.io.hfile.TestForceCacheImportantBlocks
Tests run: 4, Failures: 0, Errors: 0, Skipped: 0, Time elapsed: 51.279 sec
Running org.apache.hadoop.hbase.io.hfile.TestHFileBlock
Tests run: 16, Failures: 0, Errors: 0, Skipped: 0, Time elapsed: 49.642 sec
Running org.apache.hadoop.hbase.io.TestFileLink
Tests run: 3, Failures: 0, Errors: 0, Skipped: 0, Time elapsed: 17.992 sec
Running org.apache.hadoop.hbase.io.encoding.TestLoadAndSwitchEncodeOnDisk
Tests run: 1, Failures: 0, Errors: 0, Skipped: 0, Time elapsed: 22.8 sec
Running org.apache.hadoop.hbase.TestRegionRebalancing
Tests run: 1, Failures: 0, Errors: 0, Skipped: 0, Time elapsed: 29.03 sec
Running org.apache.hadoop.hbase.mapred.TestTableInputFormat
Tests run: 10, Failures: 0, Errors: 0, Skipped: 0, Time elapsed: 25.945 sec
Running org.apache.hadoop.hbase.io.encoding.TestUpgradeFromHFileV1ToEncoding
Tests run: 1, Failures: 0, Errors: 0, Skipped: 0, Time elapsed: 98.055 sec
Running org.apache.hadoop.hbase.io.encoding.TestDataBlockEncoders
Tests run: 12, Failures: 0, Errors: 0, Skipped: 0, Time elapsed: 102.697 sec
Running org.apache.hadoop.hbase.replication.TestReplicationQueueFailoverCompressed
Tests run: 1, Failures: 0, Errors: 0, Skipped: 0, Time elapsed: 68.638 sec
Running org.apache.hadoop.hbase.replication.TestReplicationDisableInactivePeer
Tests run: 1, Failures: 0, Errors: 0, Skipped: 0, Time elapsed: 81.98 sec
Running org.apache.hadoop.hbase.replication.TestReplicationZookeeper
Tests run: 1, Failures: 0, Errors: 0, Skipped: 0, Time elapsed: 0.86 sec
Running org.apache.hadoop.hbase.replication.regionserver.TestReplicationSink
Tests run: 5, Failures: 0, Errors: 0, Skipped: 0, Time elapsed: 17.875 sec
Running org.apache.hadoop.hbase.replication.regionserver.TestReplicationSourceManager
Tests run: 3, Failures: 0, Errors: 0, Skipped: 0, Time elapsed: 1.291 sec
Running org.apache.hadoop.hbase.replication.TestReplicationSource
Tests run: 1, Failures: 0, Errors: 0, Skipped: 0, Time elapsed: 2.889 sec
Running org.apache.hadoop.hbase.replication.TestMultiSlaveReplication
Tests run: 1, Failures: 0, Errors: 0, Skipped: 0, Time elapsed: 40.477 sec
Running org.apache.hadoop.hbase.replication.TestReplicationQueueFailover
Tests run: 1, Failures: 0, Errors: 0, Skipped: 0, Time elapsed: 68.18 sec
Running org.apache.hadoop.hbase.mapred.TestTableMapReduce
Tests run: 1, Failures: 0, Errors: 0, Skipped: 0, Time elapsed: 159.554 sec
Running org.apache.hadoop.hbase.io.encoding.TestChangingEncoding
Tests run: 4, Failures: 0, Errors: 0, Skipped: 0, Time elapsed: 275.187 sec
Running org.apache.hadoop.hbase.util.TestFSTableDescriptors
Tests run: 11, Failures: 0, Errors: 0, Skipped: 0, Time elapsed: 0.956 sec
Running org.apache.hadoop.hbase.util.TestIdLock
Tests run: 1, Failures: 0, Errors: 0, Skipped: 0, Time elapsed: 15.602 sec
Running org.apache.hadoop.hbase.replication.TestMasterReplication
Tests run: 3, Failures: 0, Errors: 0, Skipped: 0, Time elapsed: 104.593 sec
Running org.apache.hadoop.hbase.util.TestEnvironmentEdgeManager
Tests run: 2, Failures: 0, Errors: 0, Skipped: 0, Time elapsed: 0.368 sec
Running org.apache.hadoop.hbase.util.TestMergeTable
Tests run: 1, Failures: 0, Errors: 0, Skipped: 0, Time elapsed: 27.898 sec
Running org.apache.hadoop.hbase.util.TestMiniClusterLoadSequential
Tests run: 4, Failures: 0, Errors: 0, Skipped: 0, Time elapsed: 95.848 sec
Running org.apache.hadoop.hbase.util.TestMiniClusterLoadParallel
Tests run: 4, Failures: 0, Errors: 0, Skipped: 0, Time elapsed: 89.828 sec
Running org.apache.hadoop.hbase.util.TestFSUtils
Tests run: 4, Failures: 0, Errors: 0, Skipped: 0, Time elapsed: 20.229 sec
Running org.apache.hadoop.hbase.util.TestPoolMap$TestRoundRobinPoolType
Tests run: 3, Failures: 0, Errors: 0, Skipped: 0, Time elapsed: 0.011 sec
Running org.apache.hadoop.hbase.util.TestPoolMap$TestThreadLocalPoolType
Tests run: 3, Failures: 0, Errors: 0, Skipped: 0, Time elapsed: 0.008 sec
Running org.apache.hadoop.hbase.util.TestPoolMap$TestReusablePoolType
Tests run: 3, Failures: 0, Errors: 0, Skipped: 0, Time elapsed: 0.037 sec
Running org.apache.hadoop.hbase.util.TestRegionSplitter
Tests run: 5, Failures: 0, Errors: 0, Skipped: 0, Time elapsed: 15.372 sec
Running org.apache.hadoop.hbase.util.TestMergeTool
Tests run: 1, Failures: 0, Errors: 0, Skipped: 0, Time elapsed: 269.537 sec
Running org.apache.hadoop.hbase.replication.TestReplicationSmallTests
Tests run: 9, Failures: 0, Errors: 0, Skipped: 0, Time elapsed: 288.737 sec
Running org.apache.hadoop.hbase.util.TestFSVisitor
Tests run: 3, Failures: 0, Errors: 0, Skipped: 0, Time elapsed: 1.518 sec
Running org.apache.hadoop.hbase.util.TestCoprocessorScanPolicy
Tests run: 2, Failures: 0, Errors: 0, Skipped: 0, Time elapsed: 15.643 sec
Running org.apache.hadoop.hbase.util.hbck.TestOfflineMetaRebuildBase
Tests run: 1, Failures: 0, Errors: 0, Skipped: 0, Time elapsed: 27.533 sec
Running org.apache.hadoop.hbase.util.hbck.TestOfflineMetaRebuildOverlap
Tests run: 1, Failures: 0, Errors: 0, Skipped: 0, Time elapsed: 31.051 sec
Running org.apache.hadoop.hbase.util.TestDefaultEnvironmentEdge
Tests run: 1, Failures: 0, Errors: 0, Skipped: 0, Time elapsed: 0.291 sec
Running org.apache.hadoop.hbase.util.TestFSHDFSUtils
Tests run: 2, Failures: 0, Errors: 0, Skipped: 0, Time elapsed: 4.019 sec
Running org.apache.hadoop.hbase.util.TestMiniClusterLoadEncoded
Tests run: 4, Failures: 0, Errors: 0, Skipped: 0, Time elapsed: 64.378 sec
Running org.apache.hadoop.hbase.TestInfoServers
Tests run: 3, Failures: 0, Errors: 0, Skipped: 0, Time elapsed: 12.461 sec
Running org.apache.hadoop.hbase.util.hbck.TestOfflineMetaRebuildHole
Tests run: 1, Failures: 0, Errors: 0, Skipped: 0, Time elapsed: 30.074 sec
Running org.apache.hadoop.hbase.util.TestSizeBasedThrottler
Tests run: 3, Failures: 0, Errors: 0, Skipped: 0, Time elapsed: 57.616 sec
Running org.apache.hadoop.hbase.util.TestHBaseFsck
Tests run: 34, Failures: 0, Errors: 0, Skipped: 0, Time elapsed: 244.715 sec

Results :

Failed tests:   testWorkerAbort(org.apache.hadoop.hbase.master.TestDistributedLogSplitting):
none of the following counters went up in 80000 milliseconds - tot_wkr_task_resigned, tot_wkr_task_err,
tot_wkr_final_transistion_failed, tot_wkr_task_done, tot_wkr_preempt_task

Tests run: 1384, Failures: 1, Errors: 0, Skipped: 13

[INFO] ------------------------------------------------------------------------
[INFO] BUILD FAILURE
[INFO] ------------------------------------------------------------------------
[INFO] Total time: 51:19.262s
[INFO] Finished at: Sun Sep 22 14:08:33 UTC 2013
[INFO] Final Memory: 42M/848M
[INFO] ------------------------------------------------------------------------
[ERROR] Failed to execute goal org.apache.maven.plugins:maven-surefire-plugin:2.12-TRUNK-HBASE-2:test
(secondPartTestsExecution) on project hbase: There are test failures.
[ERROR] 
[ERROR] Please refer to /x1/jenkins/jenkins-slave/workspace/HBase-0.94/trunk/target/surefire-reports
for the individual test results.
[ERROR] -> [Help 1]
[ERROR] 
[ERROR] To see the full stack trace of the errors, re-run Maven with the -e switch.
[ERROR] Re-run Maven using the -X switch to enable full debug logging.
[ERROR] 
[ERROR] For more information about the errors and possible solutions, please read the following
articles:
[ERROR] [Help 1] http://cwiki.apache.org/confluence/display/MAVEN/MojoFailureException
Build step 'Invoke top-level Maven targets' marked build as failure
Archiving artifacts
Updating HBASE-9607
Recording test results

Mime
View raw message