hbase-builds mailing list archives

Site index · List index
Message view « Date » · « Thread »
Top « Date » · « Thread »
From apurt...@apache.org
Subject Build failed in Jenkins: hbase-0.96 #170
Date Fri, 27 Sep 2013 05:43:38 GMT
See <http://jenkins-public.iridiant.net/job/hbase-0.96/170/>

------------------------------------------
[...truncated 5542 lines...]
Tests run: 1, Failures: 0, Errors: 0, Skipped: 0, Time elapsed: 49.647 sec
Running org.apache.hadoop.hbase.regionserver.TestCompactionState
Tests run: 5, Failures: 0, Errors: 0, Skipped: 0, Time elapsed: 109.484 sec
Running org.apache.hadoop.hbase.regionserver.TestCompoundBloomFilter
Tests run: 3, Failures: 0, Errors: 0, Skipped: 0, Time elapsed: 31.256 sec
Running org.apache.hadoop.hbase.regionserver.wal.TestDurability
Tests run: 1, Failures: 0, Errors: 0, Skipped: 0, Time elapsed: 7.491 sec
Running org.apache.hadoop.hbase.regionserver.TestHRegionBusyWait
Tests run: 65, Failures: 0, Errors: 0, Skipped: 0, Time elapsed: 109.855 sec
Running org.apache.hadoop.hbase.regionserver.wal.TestWALReplayCompressed
Tests run: 8, Failures: 0, Errors: 0, Skipped: 0, Time elapsed: 59.038 sec
Running org.apache.hadoop.hbase.regionserver.wal.TestLogRollAbort
Tests run: 1, Failures: 0, Errors: 0, Skipped: 0, Time elapsed: 196.05 sec
Running org.apache.hadoop.hbase.regionserver.wal.TestHLogSplitCompressed
Tests run: 33, Failures: 0, Errors: 0, Skipped: 1, Time elapsed: 157.742 sec
Running org.apache.hadoop.hbase.regionserver.wal.TestHLogSplit
Tests run: 33, Failures: 0, Errors: 0, Skipped: 1, Time elapsed: 166.052 sec
Running org.apache.hadoop.hbase.regionserver.wal.TestReadOldRootAndMetaEdits
Tests run: 1, Failures: 0, Errors: 0, Skipped: 0, Time elapsed: 1.578 sec
Running org.apache.hadoop.hbase.regionserver.TestBlocksRead
Tests run: 4, Failures: 0, Errors: 0, Skipped: 0, Time elapsed: 2.732 sec
Running org.apache.hadoop.hbase.regionserver.wal.TestHLogFiltering
Tests run: 1, Failures: 0, Errors: 0, Skipped: 0, Time elapsed: 23.861 sec
Running org.apache.hadoop.hbase.regionserver.TestMasterAddressManager
Tests run: 1, Failures: 0, Errors: 0, Skipped: 0, Time elapsed: 2.038 sec
Running org.apache.hadoop.hbase.regionserver.TestRegionMergeTransactionOnCluster
Tests run: 3, Failures: 0, Errors: 0, Skipped: 0, Time elapsed: 26.145 sec
Running org.apache.hadoop.hbase.regionserver.TestMultiColumnScanner
Tests run: 12, Failures: 0, Errors: 0, Skipped: 0, Time elapsed: 48.901 sec
Running org.apache.hadoop.hbase.regionserver.TestFSErrorsExposed
Tests run: 3, Failures: 0, Errors: 0, Skipped: 0, Time elapsed: 26.253 sec
Running org.apache.hadoop.hbase.regionserver.wal.TestWALReplay
Tests run: 8, Failures: 0, Errors: 0, Skipped: 0, Time elapsed: 65.317 sec
Running org.apache.hadoop.hbase.regionserver.wal.TestHLog
Running org.apache.hadoop.hbase.regionserver.TestRegionServerMetrics
Tests run: 9, Failures: 0, Errors: 0, Skipped: 0, Time elapsed: 19.642 sec
Tests run: 13, Failures: 0, Errors: 0, Skipped: 0, Time elapsed: 78.15 sec
Running org.apache.hadoop.hbase.master.TestMasterStatusServlet
Tests run: 4, Failures: 0, Errors: 0, Skipped: 0, Time elapsed: 3.796 sec
Running org.apache.hadoop.hbase.regionserver.TestHRegionServerBulkLoad
Tests run: 1, Failures: 0, Errors: 0, Skipped: 0, Time elapsed: 45.724 sec
Running org.apache.hadoop.hbase.master.handler.TestTableDeleteFamilyHandler
Tests run: 1, Failures: 0, Errors: 0, Skipped: 0, Time elapsed: 15.727 sec
Running org.apache.hadoop.hbase.master.handler.TestCreateTableHandler
Tests run: 3, Failures: 0, Errors: 0, Skipped: 0, Time elapsed: 41.77 sec
Running org.apache.hadoop.hbase.master.TestClusterStatusPublisher
Tests run: 3, Failures: 0, Errors: 0, Skipped: 0, Time elapsed: 0.58 sec
Running org.apache.hadoop.hbase.master.handler.TestTableDescriptorModification
Tests run: 3, Failures: 0, Errors: 0, Skipped: 0, Time elapsed: 13.094 sec
Running org.apache.hadoop.hbase.regionserver.TestCompaction
Tests run: 18, Failures: 0, Errors: 0, Skipped: 0, Time elapsed: 74.631 sec
Running org.apache.hadoop.hbase.master.balancer.TestDefaultLoadBalancer
Tests run: 1, Failures: 0, Errors: 0, Skipped: 0, Time elapsed: 3.26 sec
Running org.apache.hadoop.hbase.master.balancer.TestBaseLoadBalancer
Tests run: 3, Failures: 0, Errors: 0, Skipped: 0, Time elapsed: 1.004 sec
Running org.apache.hadoop.hbase.master.TestMaster
Tests run: 4, Failures: 0, Errors: 0, Skipped: 0, Time elapsed: 22.34 sec
Running org.apache.hadoop.hbase.master.TestMasterMetricsWrapper
Tests run: 1, Failures: 0, Errors: 0, Skipped: 0, Time elapsed: 17.539 sec
Running org.apache.hadoop.hbase.master.TestAssignmentManager
Tests run: 17, Failures: 0, Errors: 0, Skipped: 0, Time elapsed: 12.002 sec
Running org.apache.hadoop.hbase.master.TestMasterRestartAfterDisablingTable
Tests run: 1, Failures: 0, Errors: 0, Skipped: 0, Time elapsed: 16.362 sec
Running org.apache.hadoop.hbase.master.TestRegionPlacement
Tests run: 4, Failures: 0, Errors: 0, Skipped: 0, Time elapsed: 38.892 sec
Running org.apache.hadoop.hbase.master.balancer.TestStochasticLoadBalancer
Tests run: 13, Failures: 0, Errors: 0, Skipped: 0, Time elapsed: 118.598 sec
Running org.apache.hadoop.hbase.master.TestMasterFileSystem
Tests run: 2, Failures: 0, Errors: 0, Skipped: 0, Time elapsed: 11.856 sec
Running org.apache.hadoop.hbase.master.TestTableLockManager
Tests run: 5, Failures: 0, Errors: 0, Skipped: 0, Time elapsed: 118.16 sec
Running org.apache.hadoop.hbase.master.TestHMasterRPCException
Tests run: 1, Failures: 0, Errors: 0, Skipped: 0, Time elapsed: 2.511 sec
Running org.apache.hadoop.hbase.master.cleaner.TestHFileCleaner
Tests run: 3, Failures: 0, Errors: 0, Skipped: 0, Time elapsed: 5.728 sec
Running org.apache.hadoop.hbase.master.TestRestartCluster
Tests run: 2, Failures: 0, Errors: 0, Skipped: 0, Time elapsed: 31.123 sec
Running org.apache.hadoop.hbase.master.cleaner.TestSnapshotFromMaster
Tests run: 4, Failures: 0, Errors: 0, Skipped: 0, Time elapsed: 24.325 sec
Running org.apache.hadoop.hbase.master.cleaner.TestLogsCleaner
Tests run: 1, Failures: 0, Errors: 0, Skipped: 0, Time elapsed: 12.035 sec
Running org.apache.hadoop.hbase.master.snapshot.TestSnapshotFileCache
Tests run: 4, Failures: 0, Errors: 0, Skipped: 0, Time elapsed: 5.145 sec
Running org.apache.hadoop.hbase.master.TestMasterNoCluster
Tests run: 4, Failures: 0, Errors: 0, Skipped: 0, Time elapsed: 9.688 sec
Running org.apache.hadoop.hbase.master.TestDeadServer
Tests run: 3, Failures: 0, Errors: 0, Skipped: 0, Time elapsed: 0.568 sec
Running org.apache.hadoop.hbase.master.TestSplitLogManager
Tests run: 14, Failures: 0, Errors: 0, Skipped: 0, Time elapsed: 84.415 sec
Running org.apache.hadoop.hbase.master.TestDistributedLogSplitting
Tests run: 14, Failures: 0, Errors: 0, Skipped: 0, Time elapsed: 222.317 sec
Running org.apache.hadoop.hbase.master.TestAssignmentManagerOnCluster
Tests run: 11, Failures: 0, Errors: 0, Skipped: 0, Time elapsed: 27.318 sec
Running org.apache.hadoop.hbase.master.TestActiveMasterManager
Tests run: 2, Failures: 0, Errors: 0, Skipped: 0, Time elapsed: 1.961 sec
Running org.apache.hadoop.hbase.master.TestOpenedRegionHandler
Tests run: 2, Failures: 0, Errors: 0, Skipped: 0, Time elapsed: 14.305 sec
Running org.apache.hadoop.hbase.master.TestMasterTransitions
Tests run: 3, Failures: 0, Errors: 0, Skipped: 3, Time elapsed: 16.56 sec
Running org.apache.hadoop.hbase.master.TestMasterFailoverBalancerPersistence
Tests run: 1, Failures: 0, Errors: 0, Skipped: 0, Time elapsed: 15.857 sec
Running org.apache.hadoop.hbase.master.TestMasterFailover
Tests run: 4, Failures: 0, Errors: 0, Skipped: 0, Time elapsed: 61.791 sec
Running org.apache.hadoop.hbase.master.TestZKBasedOpenCloseRegion
Tests run: 4, Failures: 0, Errors: 0, Skipped: 0, Time elapsed: 17.491 sec
Running org.apache.hadoop.hbase.master.TestMasterShutdown
Tests run: 2, Failures: 0, Errors: 0, Skipped: 0, Time elapsed: 23.183 sec
Running org.apache.hadoop.hbase.master.TestRollingRestart
Tests run: 1, Failures: 0, Errors: 0, Skipped: 0, Time elapsed: 34.818 sec
Running org.apache.hadoop.hbase.master.TestMasterMetrics
Tests run: 2, Failures: 0, Errors: 0, Skipped: 0, Time elapsed: 23.904 sec
Running org.apache.hadoop.hbase.TestIOFencing
Tests run: 2, Failures: 0, Errors: 0, Skipped: 0, Time elapsed: 111.973 sec
Running org.apache.hadoop.hbase.regionserver.wal.TestLogRolling
Tests run: 4, Failures: 0, Errors: 0, Skipped: 0, Time elapsed: 731.857 sec

Results :

Tests run: 1482, Failures: 0, Errors: 0, Skipped: 22

[JENKINS] Recording test results
[INFO] ------------------------------------------------------------------------
[INFO] Reactor Summary:
[INFO] 
[INFO] HBase ............................................. SUCCESS [17.175s]
[INFO] HBase - Common .................................... SUCCESS [35.894s]
[INFO] HBase - Protocol .................................. SUCCESS [21.115s]
[INFO] HBase - Client .................................... SUCCESS [23.680s]
[INFO] HBase - Hadoop Compatibility ...................... SUCCESS [5.597s]
[INFO] HBase - Hadoop One Compatibility .................. SUCCESS [3.348s]
[INFO] HBase - Prefix Tree ............................... SUCCESS [4.141s]
[INFO] HBase - Server .................................... FAILURE [58:06.963s]
[INFO] HBase - Thrift .................................... SKIPPED
[INFO] HBase - Shell ..................................... SKIPPED
[INFO] HBase - Integration Tests ......................... SKIPPED
[INFO] HBase - Examples .................................. SKIPPED
[INFO] HBase - Assembly .................................. SKIPPED
[INFO] ------------------------------------------------------------------------
[INFO] BUILD FAILURE
[INFO] ------------------------------------------------------------------------
[INFO] Total time: 1:00:14.587s
[INFO] Finished at: Fri Sep 27 05:43:27 UTC 2013
[INFO] Final Memory: 109M/630M
[INFO] ------------------------------------------------------------------------
[JENKINS] Archiving <http://jenkins-public.iridiant.net/job/hbase-0.96/ws/hbase-common/pom.xml>
to /var/lib/jenkins/jobs/hbase-0.96/modules/org.apache.hbase$hbase-common/builds/2013-09-27_04-43-07/archive/org.apache.hbase/hbase-common/0.96.0/hbase-common-0.96.0.pom
[JENKINS] Archiving <http://jenkins-public.iridiant.net/job/hbase-0.96/ws/hbase-hadoop-compat/pom.xml>
to /var/lib/jenkins/jobs/hbase-0.96/modules/org.apache.hbase$hbase-hadoop-compat/builds/2013-09-27_04-43-07/archive/org.apache.hbase/hbase-hadoop-compat/0.96.0/hbase-hadoop-compat-0.96.0.pom
[JENKINS] Archiving <http://jenkins-public.iridiant.net/job/hbase-0.96/ws/hbase-examples/pom.xml>
to /var/lib/jenkins/jobs/hbase-0.96/modules/org.apache.hbase$hbase-examples/builds/2013-09-27_04-43-07/archive/org.apache.hbase/hbase-examples/0.96.0/hbase-examples-0.96.0.pom
[JENKINS] Archiving <http://jenkins-public.iridiant.net/job/hbase-0.96/ws/hbase-it/pom.xml>
to /var/lib/jenkins/jobs/hbase-0.96/modules/org.apache.hbase$hbase-it/builds/2013-09-27_04-43-07/archive/org.apache.hbase/hbase-it/0.96.0/hbase-it-0.96.0.pom
[JENKINS] Archiving <http://jenkins-public.iridiant.net/job/hbase-0.96/ws/pom.xml> to
/var/lib/jenkins/jobs/hbase-0.96/modules/org.apache.hbase$hbase/builds/2013-09-27_04-43-06/archive/org.apache.hbase/hbase/0.96.0/hbase-0.96.0.pom
[JENKINS] Archiving <http://jenkins-public.iridiant.net/job/hbase-0.96/ws/hbase-assembly/pom.xml>
to /var/lib/jenkins/jobs/hbase-0.96/modules/org.apache.hbase$hbase-assembly/builds/2013-09-27_04-43-07/archive/org.apache.hbase/hbase-assembly/0.96.0/hbase-assembly-0.96.0.pom
[JENKINS] Archiving <http://jenkins-public.iridiant.net/job/hbase-0.96/ws/hbase-thrift/pom.xml>
to /var/lib/jenkins/jobs/hbase-0.96/modules/org.apache.hbase$hbase-thrift/builds/2013-09-27_04-43-07/archive/org.apache.hbase/hbase-thrift/0.96.0/hbase-thrift-0.96.0.pom
[JENKINS] Archiving <http://jenkins-public.iridiant.net/job/hbase-0.96/ws/hbase-client/pom.xml>
to /var/lib/jenkins/jobs/hbase-0.96/modules/org.apache.hbase$hbase-client/builds/2013-09-27_04-43-07/archive/org.apache.hbase/hbase-client/0.96.0/hbase-client-0.96.0.pom
[JENKINS] Archiving <http://jenkins-public.iridiant.net/job/hbase-0.96/ws/hbase-prefix-tree/pom.xml>
to /var/lib/jenkins/jobs/hbase-0.96/modules/org.apache.hbase$hbase-prefix-tree/builds/2013-09-27_04-43-07/archive/org.apache.hbase/hbase-prefix-tree/0.96.0/hbase-prefix-tree-0.96.0.pom
[JENKINS] Archiving <http://jenkins-public.iridiant.net/job/hbase-0.96/ws/hbase-protocol/pom.xml>
to /var/lib/jenkins/jobs/hbase-0.96/modules/org.apache.hbase$hbase-protocol/builds/2013-09-27_04-43-07/archive/org.apache.hbase/hbase-protocol/0.96.0/hbase-protocol-0.96.0.pom
[JENKINS] Archiving <http://jenkins-public.iridiant.net/job/hbase-0.96/ws/hbase-hadoop1-compat/pom.xml>
to /var/lib/jenkins/jobs/hbase-0.96/modules/org.apache.hbase$hbase-hadoop1-compat/builds/2013-09-27_04-43-07/archive/org.apache.hbase/hbase-hadoop1-compat/0.96.0/hbase-hadoop1-compat-0.96.0.pom
[JENKINS] Archiving <http://jenkins-public.iridiant.net/job/hbase-0.96/ws/hbase-shell/pom.xml>
to /var/lib/jenkins/jobs/hbase-0.96/modules/org.apache.hbase$hbase-shell/builds/2013-09-27_04-43-07/archive/org.apache.hbase/hbase-shell/0.96.0/hbase-shell-0.96.0.pom
[JENKINS] Archiving <http://jenkins-public.iridiant.net/job/hbase-0.96/ws/hbase-server/pom.xml>
to /var/lib/jenkins/jobs/hbase-0.96/modules/org.apache.hbase$hbase-server/builds/2013-09-27_04-43-07/archive/org.apache.hbase/hbase-server/0.96.0/hbase-server-0.96.0.pom
Waiting for Jenkins to finish collecting data
mavenExecutionResult exceptions not empty
message : Failed to execute goal org.apache.maven.plugins:maven-surefire-plugin:2.12-TRUNK-HBASE-2:test
(secondPartTestsExecution) on project hbase-server: Failure or timeout
cause : Failure or timeout
Stack trace : 
org.apache.maven.lifecycle.LifecycleExecutionException: Failed to execute goal org.apache.maven.plugins:maven-surefire-plugin:2.12-TRUNK-HBASE-2:test
(secondPartTestsExecution) on project hbase-server: Failure or timeout
	at org.apache.maven.lifecycle.internal.MojoExecutor.execute(MojoExecutor.java:217)
	at org.apache.maven.lifecycle.internal.MojoExecutor.execute(MojoExecutor.java:153)
	at org.apache.maven.lifecycle.internal.MojoExecutor.execute(MojoExecutor.java:145)
	at org.apache.maven.lifecycle.internal.LifecycleModuleBuilder.buildProject(LifecycleModuleBuilder.java:84)
	at org.apache.maven.lifecycle.internal.LifecycleModuleBuilder.buildProject(LifecycleModuleBuilder.java:59)
	at org.apache.maven.lifecycle.internal.LifecycleStarter.singleThreadedBuild(LifecycleStarter.java:183)
	at org.apache.maven.lifecycle.internal.LifecycleStarter.execute(LifecycleStarter.java:161)
	at org.apache.maven.DefaultMaven.doExecute(DefaultMaven.java:320)
	at org.apache.maven.DefaultMaven.execute(DefaultMaven.java:156)
	at org.jvnet.hudson.maven3.launcher.Maven3Launcher.main(Maven3Launcher.java:79)
	at sun.reflect.NativeMethodAccessorImpl.invoke0(Native Method)
	at sun.reflect.NativeMethodAccessorImpl.invoke(NativeMethodAccessorImpl.java:39)
	at sun.reflect.DelegatingMethodAccessorImpl.invoke(DelegatingMethodAccessorImpl.java:25)
	at java.lang.reflect.Method.invoke(Method.java:597)
	at org.codehaus.plexus.classworlds.launcher.Launcher.launchStandard(Launcher.java:329)
	at org.codehaus.plexus.classworlds.launcher.Launcher.launch(Launcher.java:239)
	at org.jvnet.hudson.maven3.agent.Maven3Main.launch(Maven3Main.java:158)
	at hudson.maven.Maven3Builder.call(Maven3Builder.java:100)
	at hudson.maven.Maven3Builder.call(Maven3Builder.java:66)
	at hudson.remoting.UserRequest.perform(UserRequest.java:118)
	at hudson.remoting.UserRequest.perform(UserRequest.java:48)
	at hudson.remoting.Request$2.run(Request.java:326)
	at hudson.remoting.InterceptingExecutorService$1.call(InterceptingExecutorService.java:72)
	at java.util.concurrent.FutureTask$Sync.innerRun(FutureTask.java:303)
	at java.util.concurrent.FutureTask.run(FutureTask.java:138)
	at java.util.concurrent.ThreadPoolExecutor$Worker.runTask(ThreadPoolExecutor.java:895)
	at java.util.concurrent.ThreadPoolExecutor$Worker.run(ThreadPoolExecutor.java:918)
	at java.lang.Thread.run(Thread.java:662)
Caused by: org.apache.maven.plugin.MojoExecutionException: Failure or timeout
	at org.apache.maven.plugin.surefire.SurefirePlugin.assertNoFailureOrTimeout(SurefirePlugin.java:643)
	at org.apache.maven.plugin.surefire.SurefirePlugin.handleSummary(SurefirePlugin.java:624)
	at org.apache.maven.plugin.surefire.AbstractSurefireMojo.executeAfterPreconditionsChecked(AbstractSurefireMojo.java:137)
	at org.apache.maven.plugin.surefire.AbstractSurefireMojo.execute(AbstractSurefireMojo.java:98)
	at org.apache.maven.plugin.DefaultBuildPluginManager.executeMojo(DefaultBuildPluginManager.java:101)
	at org.apache.maven.lifecycle.internal.MojoExecutor.execute(MojoExecutor.java:209)
	... 27 more
channel stopped
Performing Post build task...
Match found for :.* : True
Logical operation result is TRUE
Running script  :  ZOMBIE_TESTS_COUNT=`jps | grep surefirebooter | wc -l`
  if [[ $ZOMBIE_TESTS_COUNT != 0 ]] ; then
    ZOMBIE_TESTS_COUNT=`jps | grep surefirebooter | wc -l`
    if [[ $ZOMBIE_TESTS_COUNT != 0 ]] ; then
      echo "There are $ZOMBIE_TESTS_COUNT zombie tests, they should have been killed by surefire
but survived"
      echo "************ BEGIN zombies jstack extract"
      ZB_STACK=`jps | grep surefirebooter | cut -d ' ' -f 1 | xargs -n 1 jstack | grep ".test"
| grep "\.java"`
      jps | grep surefirebooter | cut -d ' ' -f 1 | xargs -n 1 jstack
      echo "************ END  zombies jstack extract"
      JIRA_COMMENT="$JIRA_COMMENT

     {color:red}-1 core zombie tests{color}.  There are ${ZOMBIE_TESTS_COUNT} zombie test(s):
${ZB_STACK}"
      BAD=1
      jps | grep surefirebooter | cut -d ' ' -f 1 | xargs kill -9
    else
      echo "We're ok: there is no zombie test, but some tests took some time to stop"
    fi
  else
    echo "We're ok: there is no zombie test"
  fi
[hbase-0.96] $ /bin/bash -xe /tmp/hudson208200347880766250.sh
++ jps
++ grep surefirebooter
++ wc -l
+ ZOMBIE_TESTS_COUNT=1
+ [[ 1 != 0 ]]
++ jps
++ grep surefirebooter
++ wc -l
+ ZOMBIE_TESTS_COUNT=1
+ [[ 1 != 0 ]]
+ echo 'There are 1 zombie tests, they should have been killed by surefire but survived'
There are 1 zombie tests, they should have been killed by surefire but survived
+ echo '************ BEGIN zombies jstack extract'
************ BEGIN zombies jstack extract
++ jps
++ grep surefirebooter
++ cut -d ' ' -f 1
++ xargs -n 1 jstack
++ grep .test
++ grep '\.java'
17929: Unable to open socket file: target process not responding or HotSpot VM not loaded
The -F option can be used when the target process is not responding
+ ZB_STACK=
POST BUILD TASK : FAILURE
END OF POST BUILD TASK : 0

Mime
View raw message