hbase-builds mailing list archives

Site index · List index
Message view « Date » · « Thread »
Top « Date » · « Thread »
From Apache Jenkins Server <jenk...@builds.apache.org>
Subject Build failed in Jenkins: hbase-0.96-hadoop2 #2
Date Sun, 01 Sep 2013 01:18:01 GMT
See <https://builds.apache.org/job/hbase-0.96-hadoop2/2/changes>

Changes:

[stack] HBASE-9042 initCause() uses wrong exception in ProtobufLogReader#readNext(HLog); REVERT
AGAIN -- WAIT BEFORE ADDING MORE PATCHES TO 0.96 BRANCH

[stack] HBASE-9042 initCause() uses wrong exception in ProtobufLogReader#readNext(HLog); REAPPLY

[stack] HBASE-9042 initCause() uses wrong exception in ProtobufLogReader#readNext(HLog); REVERT

[stack] HBASE-9042 initCause() uses wrong exception in ProtobufLogReader#readNext(HLog)

------------------------------------------
[...truncated 4437 lines...]
Running org.apache.hadoop.hbase.rest.TestMultiRowResource
Tests run: 3, Failures: 0, Errors: 0, Skipped: 0, Time elapsed: 39.489 sec
Running org.apache.hadoop.hbase.coprocessor.TestWALObserver
Tests run: 3, Failures: 0, Errors: 0, Skipped: 0, Time elapsed: 36.097 sec
Running org.apache.hadoop.hbase.backup.TestHFileArchiving
Tests run: 5, Failures: 0, Errors: 0, Skipped: 0, Time elapsed: 199.587 sec
Running org.apache.hadoop.hbase.coprocessor.TestRowProcessorEndpoint
Tests run: 4, Failures: 0, Errors: 0, Skipped: 0, Time elapsed: 54.985 sec
Running org.apache.hadoop.hbase.mapreduce.TestImportTsv
Tests run: 7, Failures: 0, Errors: 0, Skipped: 0, Time elapsed: 374.498 sec
Running org.apache.hadoop.hbase.coprocessor.TestOpenTableInCoprocessor
Tests run: 1, Failures: 0, Errors: 0, Skipped: 0, Time elapsed: 39.361 sec
Running org.apache.hadoop.hbase.coprocessor.TestClassLoading
Tests run: 8, Failures: 0, Errors: 0, Skipped: 0, Time elapsed: 65.757 sec
Running org.apache.hadoop.hbase.coprocessor.TestCoprocessorEndpoint
Tests run: 6, Failures: 0, Errors: 0, Skipped: 0, Time elapsed: 42.502 sec
Running org.apache.hadoop.hbase.coprocessor.TestRegionObserverBypass
Tests run: 2, Failures: 0, Errors: 0, Skipped: 0, Time elapsed: 35.197 sec
Running org.apache.hadoop.hbase.coprocessor.TestRegionObserverScannerOpenHook
Tests run: 3, Failures: 0, Errors: 0, Skipped: 0, Time elapsed: 33.768 sec
Running org.apache.hadoop.hbase.coprocessor.TestRegionServerCoprocessorExceptionWithAbort
Tests run: 1, Failures: 0, Errors: 0, Skipped: 0, Time elapsed: 35.587 sec
Running org.apache.hadoop.hbase.coprocessor.TestRegionServerCoprocessorExceptionWithRemove
Tests run: 1, Failures: 0, Errors: 0, Skipped: 0, Time elapsed: 39.689 sec
Running org.apache.hadoop.hbase.coprocessor.TestRegionObserverInterface
Tests run: 7, Failures: 0, Errors: 0, Skipped: 0, Time elapsed: 95.115 sec
Running org.apache.hadoop.hbase.coprocessor.TestMasterObserver
Tests run: 6, Failures: 0, Errors: 0, Skipped: 0, Time elapsed: 91.119 sec
Running org.apache.hadoop.hbase.catalog.TestMetaReaderEditorNoCluster
Tests run: 2, Failures: 0, Errors: 0, Skipped: 0, Time elapsed: 6.13 sec
Running org.apache.hadoop.hbase.coprocessor.TestMasterCoprocessorExceptionWithRemove
Tests run: 1, Failures: 0, Errors: 0, Skipped: 0, Time elapsed: 36.928 sec
Running org.apache.hadoop.hbase.TestGlobalMemStoreSize
Tests run: 1, Failures: 0, Errors: 0, Skipped: 0, Time elapsed: 33.883 sec
Running org.apache.hadoop.hbase.coprocessor.TestMasterCoprocessorExceptionWithAbort
Tests run: 1, Failures: 0, Errors: 0, Skipped: 0, Time elapsed: 35.33 sec
Running org.apache.hadoop.hbase.catalog.TestCatalogTracker
Tests run: 7, Failures: 0, Errors: 0, Skipped: 0, Time elapsed: 4.615 sec
Running org.apache.hadoop.hbase.regionserver.TestCompaction
Running org.apache.hadoop.hbase.regionserver.TestMemStore
Running org.apache.hadoop.hbase.catalog.TestMetaReaderEditor
Running org.apache.hadoop.hbase.catalog.TestMetaMigrationConvertingToPB
Tests run: 23, Failures: 0, Errors: 0, Skipped: 0, Time elapsed: 47.374 sec
Tests run: 3, Failures: 0, Errors: 0, Skipped: 0, Time elapsed: 73.165 sec
Tests run: 18, Failures: 0, Errors: 0, Skipped: 0, Time elapsed: 51.561 sec
Tests run: 5, Failures: 0, Errors: 0, Skipped: 0, Time elapsed: 53.403 sec
Running org.apache.hadoop.hbase.regionserver.TestStoreScanner
Tests run: 16, Failures: 0, Errors: 0, Skipped: 0, Time elapsed: 1.029 sec
Running org.apache.hadoop.hbase.regionserver.TestPriorityRpc
Tests run: 3, Failures: 0, Errors: 0, Skipped: 0, Time elapsed: 2.435 sec
Running org.apache.hadoop.hbase.regionserver.TestParallelPut
Tests run: 2, Failures: 0, Errors: 0, Skipped: 0, Time elapsed: 7.625 sec
Running org.apache.hadoop.hbase.regionserver.TestRegionMergeTransactionOnCluster
Tests run: 3, Failures: 0, Errors: 0, Skipped: 0, Time elapsed: 65.476 sec
Running org.apache.hadoop.hbase.regionserver.TestCacheOnWriteInSchema
Tests run: 3, Failures: 0, Errors: 0, Skipped: 0, Time elapsed: 2.731 sec
Running org.apache.hadoop.hbase.regionserver.TestStore
Tests run: 15, Failures: 0, Errors: 0, Skipped: 0, Time elapsed: 14.164 sec
Running org.apache.hadoop.hbase.regionserver.TestClusterId
Tests run: 2, Failures: 0, Errors: 0, Skipped: 0, Time elapsed: 69.88 sec
Running org.apache.hadoop.hbase.regionserver.wal.TestHLog
Tests run: 13, Failures: 0, Errors: 0, Skipped: 0, Time elapsed: 54.006 sec
Running org.apache.hadoop.hbase.regionserver.TestHRegionBusyWait
Tests run: 65, Failures: 0, Errors: 0, Skipped: 0, Time elapsed: 90.662 sec
Running org.apache.hadoop.hbase.regionserver.wal.TestHLogFiltering
Tests run: 1, Failures: 0, Errors: 0, Skipped: 0, Time elapsed: 62.712 sec
Running org.apache.hadoop.hbase.regionserver.TestSplitTransactionOnCluster
Tests run: 10, Failures: 0, Errors: 0, Skipped: 0, Time elapsed: 128.187 sec
Running org.apache.hadoop.hbase.regionserver.TestServerCustomProtocol
Tests run: 7, Failures: 0, Errors: 0, Skipped: 0, Time elapsed: 129.633 sec
Running org.apache.hadoop.hbase.regionserver.wal.TestReadOldRootAndMetaEdits
Tests run: 1, Failures: 0, Errors: 0, Skipped: 0, Time elapsed: 1.598 sec
Running org.apache.hadoop.hbase.regionserver.wal.TestDurability
Tests run: 1, Failures: 0, Errors: 0, Skipped: 0, Time elapsed: 12.639 sec
Running org.apache.hadoop.hbase.regionserver.wal.TestWALReplay
Tests run: 8, Failures: 0, Errors: 0, Skipped: 0, Time elapsed: 104.178 sec
Running org.apache.hadoop.hbase.regionserver.wal.TestLogRollAbort
Tests run: 1, Failures: 0, Errors: 0, Skipped: 0, Time elapsed: 54.624 sec
Running org.apache.hadoop.hbase.regionserver.TestJoinedScanners
Tests run: 1, Failures: 0, Errors: 0, Skipped: 0, Time elapsed: 62.336 sec
Running org.apache.hadoop.hbase.regionserver.TestGetClosestAtOrBefore
Tests run: 3, Failures: 0, Errors: 0, Skipped: 0, Time elapsed: 1.905 sec
Running org.apache.hadoop.hbase.regionserver.wal.TestHLogSplitCompressed
Running org.apache.hadoop.hbase.regionserver.wal.TestWALReplayCompressed
Running org.apache.hadoop.hbase.regionserver.TestHRegionOnCluster
Tests run: 8, Failures: 0, Errors: 0, Skipped: 0, Time elapsed: 114.935 sec
Tests run: 1, Failures: 0, Errors: 0, Skipped: 0, Time elapsed: 31.499 sec
Tests run: 33, Failures: 0, Errors: 0, Skipped: 1, Time elapsed: 228.866 sec
Running org.apache.hadoop.hbase.regionserver.handler.TestCloseRegionHandler
Tests run: 3, Failures: 0, Errors: 0, Skipped: 0, Time elapsed: 3.849 sec
Running org.apache.hadoop.hbase.regionserver.handler.TestOpenRegionHandler
Tests run: 5, Failures: 0, Errors: 0, Skipped: 0, Time elapsed: 4.122 sec
Running org.apache.hadoop.hbase.regionserver.TestCompoundBloomFilter
Tests run: 3, Failures: 0, Errors: 0, Skipped: 0, Time elapsed: 25.224 sec
Running org.apache.hadoop.hbase.regionserver.wal.TestHLogSplit
Tests run: 33, Failures: 0, Errors: 0, Skipped: 1, Time elapsed: 210.514 sec
Running org.apache.hadoop.hbase.regionserver.TestHRegionServerBulkLoad
Tests run: 1, Failures: 0, Errors: 0, Skipped: 0, Time elapsed: 50.291 sec
Running org.apache.hadoop.hbase.regionserver.TestBlocksRead
Tests run: 4, Failures: 0, Errors: 0, Skipped: 0, Time elapsed: 2.433 sec
Running org.apache.hadoop.hbase.regionserver.TestStoreFileBlockCacheSummary
Tests run: 1, Failures: 0, Errors: 0, Skipped: 0, Time elapsed: 22.693 sec
Running org.apache.hadoop.hbase.regionserver.TestRegionFavoredNodes
Tests run: 1, Failures: 0, Errors: 0, Skipped: 0, Time elapsed: 59 sec
Running org.apache.hadoop.hbase.regionserver.TestMultiColumnScanner
Tests run: 12, Failures: 0, Errors: 0, Skipped: 0, Time elapsed: 41.425 sec
Running org.apache.hadoop.hbase.regionserver.TestRegionServerMetrics
Tests run: 9, Failures: 0, Errors: 0, Skipped: 0, Time elapsed: 39.436 sec
Running org.apache.hadoop.hbase.regionserver.wal.TestLogRolling
Tests run: 4, Failures: 0, Errors: 0, Skipped: 0, Time elapsed: 283.603 sec
Running org.apache.hadoop.hbase.regionserver.TestCompactionState
Tests run: 5, Failures: 0, Errors: 0, Skipped: 0, Time elapsed: 103.415 sec
Running org.apache.hadoop.hbase.regionserver.TestSplitLogWorker
Tests run: 5, Failures: 0, Errors: 0, Skipped: 0, Time elapsed: 5.277 sec
Running org.apache.hadoop.hbase.regionserver.TestHRegion
Tests run: 64, Failures: 0, Errors: 0, Skipped: 0, Time elapsed: 76.152 sec
Running org.apache.hadoop.hbase.regionserver.TestRegionServerNoMaster
Tests run: 8, Failures: 0, Errors: 0, Skipped: 0, Time elapsed: 46.056 sec
Running org.apache.hadoop.hbase.regionserver.TestFSErrorsExposed
Tests run: 3, Failures: 0, Errors: 0, Skipped: 0, Time elapsed: 56.365 sec
Running org.apache.hadoop.hbase.regionserver.TestMasterAddressManager
Tests run: 1, Failures: 0, Errors: 0, Skipped: 0, Time elapsed: 1.802 sec
Running org.apache.hadoop.hbase.regionserver.TestSeekOptimizations
Tests run: 6, Failures: 0, Errors: 0, Skipped: 0, Time elapsed: 5.493 sec
Running org.apache.hadoop.hbase.regionserver.TestCompactionWithCoprocessor
Tests run: 18, Failures: 0, Errors: 0, Skipped: 0, Time elapsed: 60.995 sec
Running org.apache.hadoop.hbase.regionserver.TestAtomicOperation
Tests run: 6, Failures: 0, Errors: 0, Skipped: 0, Time elapsed: 42.115 sec
Running org.apache.hadoop.hbase.regionserver.TestEndToEndSplitTransaction
Tests run: 2, Failures: 0, Errors: 0, Skipped: 0, Time elapsed: 50.47 sec
Running org.apache.hadoop.hbase.TestClusterBootOrder
Tests run: 2, Failures: 0, Errors: 0, Skipped: 0, Time elapsed: 40.147 sec

Results :

Failed tests:   testCyclicReplication3(org.apache.hadoop.hbase.replication.TestMasterReplication):
put were replicated back  expected:<1> but was:<2>
  testFixMetaNotWorkingWithNoHdfsChecking(org.apache.hadoop.hbase.util.TestHBaseFsck): Waited
too long for table to be disabled + testFixMetaNotWorkingWithNoHdfsChecking
  testHDFSRegioninfoMissing(org.apache.hadoop.hbase.util.TestHBaseFsck): expected:<[NOT_IN_META_OR_DEPLOYED,
HOLE_IN_REGION_CHAIN, ORPHAN_HDFS_REGION]> but was:<[NOT_IN_META_OR_DEPLOYED, NOT_IN_META_OR_DEPLOYED,
HOLE_IN_REGION_CHAIN, ORPHAN_HDFS_REGION]>
  testNoVersionFile(org.apache.hadoop.hbase.util.TestHBaseFsck): expected:<[NO_VERSION_FILE]>
but was:<[NO_VERSION_FILE, NOT_IN_META_OR_DEPLOYED]>
  testCheckTableLocks(org.apache.hadoop.hbase.util.TestHBaseFsck): expected:<[]> but
was:<[NO_VERSION_FILE, NOT_IN_META_OR_DEPLOYED]>
  testNoHdfsTable(org.apache.hadoop.hbase.util.TestHBaseFsck): expected:<[NOT_IN_HDFS,
NOT_IN_HDFS, NOT_IN_HDFS, NOT_IN_HDFS]> but was:<[NO_VERSION_FILE, NOT_IN_META_OR_DEPLOYED,
NOT_IN_HDFS, NOT_IN_HDFS, NOT_IN_HDFS, NOT_IN_HDFS]>
  testDupeRegion(org.apache.hadoop.hbase.util.TestHBaseFsck): expected:<[]> but was:<[NO_VERSION_FILE,
NOT_IN_HDFS, NOT_IN_HDFS, NOT_IN_HDFS, NOT_IN_HDFS, NOT_IN_META_OR_DEPLOYED]>
  testHbckFixOrphanTable(org.apache.hadoop.hbase.util.TestHBaseFsck): expected:<[NO_TABLEINFO_FILE]>
but was:<[NO_VERSION_FILE, NOT_IN_META_OR_DEPLOYED, NOT_IN_HDFS, NOT_IN_HDFS, NOT_IN_HDFS,
NOT_IN_HDFS, NO_TABLEINFO_FILE]>
  testContainedRegionOverlap(org.apache.hadoop.hbase.util.TestHBaseFsck): expected:<[OVERLAP_IN_REGION_CHAIN]>
but was:<[NO_VERSION_FILE, NOT_IN_META_OR_DEPLOYED, NOT_IN_HDFS, NOT_IN_HDFS, NOT_IN_HDFS,
NOT_IN_HDFS, OVERLAP_IN_REGION_CHAIN]>
  testDupeStartKey(org.apache.hadoop.hbase.util.TestHBaseFsck): expected:<[]> but was:<[NO_VERSION_FILE,
NOT_IN_HDFS, NOT_IN_HDFS, NOT_IN_HDFS, NOT_IN_HDFS, NOT_IN_META_OR_DEPLOYED]>
  testHBaseFsck(org.apache.hadoop.hbase.util.TestHBaseFsck): expected:<[]> but was:<[NO_VERSION_FILE,
NOT_IN_HDFS, NOT_IN_HDFS, NOT_IN_HDFS, NOT_IN_HDFS, NOT_IN_META_OR_DEPLOYED]>
  testNotInMetaHole(org.apache.hadoop.hbase.util.TestHBaseFsck): expected:<[NOT_IN_META_OR_DEPLOYED,
HOLE_IN_REGION_CHAIN]> but was:<[NOT_IN_META_OR_DEPLOYED, NOT_IN_META_OR_DEPLOYED, HOLE_IN_REGION_CHAIN]>
  testRegionShouldNotBeDeployed(org.apache.hadoop.hbase.util.TestHBaseFsck): expected:<[SHOULD_NOT_BE_DEPLOYED]>
but was:<[NOT_IN_META_OR_DEPLOYED, SHOULD_NOT_BE_DEPLOYED]>
  testMissingLastRegion(org.apache.hadoop.hbase.util.TestHBaseFsck): expected:<[LAST_REGION_ENDKEY_NOT_EMPTY]>
but was:<[NOT_IN_META_HDFS, NOT_IN_META_OR_DEPLOYED, LAST_REGION_ENDKEY_NOT_EMPTY]>
  testFixByTable(org.apache.hadoop.hbase.util.TestHBaseFsck): expected:<[NOT_IN_HDFS, NOT_IN_HDFS]>
but was:<[NOT_IN_META_HDFS, NOT_IN_META_OR_DEPLOYED, NOT_IN_HDFS, NOT_IN_HDFS]>
  testSidelineOverlapRegion(org.apache.hadoop.hbase.util.TestHBaseFsck): expected:<[DUPE_STARTKEYS,
DUPE_STARTKEYS, OVERLAP_IN_REGION_CHAIN]> but was:<[NOT_IN_META_HDFS, NOT_IN_META_OR_DEPLOYED,
DUPE_STARTKEYS, DUPE_STARTKEYS, OVERLAP_IN_REGION_CHAIN]>
  testFixAssignmentsAndNoHdfsChecking(org.apache.hadoop.hbase.util.TestHBaseFsck): expected:<[NOT_DEPLOYED,
HOLE_IN_REGION_CHAIN]> but was:<[NOT_IN_META_HDFS, NOT_IN_META_OR_DEPLOYED, NOT_DEPLOYED,
HOLE_IN_REGION_CHAIN]>
  testMetaOffline(org.apache.hadoop.hbase.util.TestHBaseFsck): expected:<[]> but was:<[NOT_IN_META_HDFS,
NOT_IN_META_OR_DEPLOYED]>
  testLingeringReferenceFile(org.apache.hadoop.hbase.util.TestHBaseFsck): expected:<[LINGERING_REFERENCE_HFILE]>
but was:<[NOT_IN_META_HDFS, NOT_IN_META_OR_DEPLOYED, LINGERING_REFERENCE_HFILE]>
  testSplitDaughtersNotInMeta(org.apache.hadoop.hbase.util.TestHBaseFsck): expected:<[NOT_IN_META_OR_DEPLOYED,
NOT_IN_META_OR_DEPLOYED, HOLE_IN_REGION_CHAIN]> but was:<[NOT_IN_META_HDFS, NOT_IN_META_OR_DEPLOYED,
NOT_IN_META_OR_DEPLOYED, NOT_IN_META_OR_DEPLOYED, HOLE_IN_REGION_CHAIN]>
  testOverlapAndOrphan(org.apache.hadoop.hbase.util.TestHBaseFsck): expected:<[NOT_IN_META_OR_DEPLOYED,
HOLE_IN_REGION_CHAIN, ORPHAN_HDFS_REGION]> but was:<[NOT_IN_META_HDFS, NOT_IN_META_OR_DEPLOYED,
NOT_IN_META_OR_DEPLOYED, HOLE_IN_REGION_CHAIN, ORPHAN_HDFS_REGION]>
  testRegionHole(org.apache.hadoop.hbase.util.TestHBaseFsck): expected:<[HOLE_IN_REGION_CHAIN]>
but was:<[NOT_IN_META_HDFS, NOT_IN_META_OR_DEPLOYED, HOLE_IN_REGION_CHAIN]>
  testNotInHdfs(org.apache.hadoop.hbase.util.TestHBaseFsck): expected:<[NOT_IN_HDFS]>
but was:<[NOT_IN_META_HDFS, NOT_IN_META_OR_DEPLOYED, NOT_IN_HDFS]>
  testNotInMetaOrDeployedHole(org.apache.hadoop.hbase.util.TestHBaseFsck): expected:<[NOT_IN_META_OR_DEPLOYED,
HOLE_IN_REGION_CHAIN]> but was:<[NOT_IN_META_HDFS, NOT_IN_META_OR_DEPLOYED, NOT_IN_META_OR_DEPLOYED,
HOLE_IN_REGION_CHAIN]>
  testDegenerateRegions(org.apache.hadoop.hbase.util.TestHBaseFsck): expected:<[]> but
was:<[NOT_IN_META_HDFS, NOT_IN_META_OR_DEPLOYED]>
  testMissingFirstRegion(org.apache.hadoop.hbase.util.TestHBaseFsck): expected:<[FIRST_REGION_STARTKEY_NOT_EMPTY]>
but was:<[NOT_IN_META_HDFS, NOT_IN_META_OR_DEPLOYED, FIRST_REGION_STARTKEY_NOT_EMPTY]>
  testHbckThreadpooling(org.apache.hadoop.hbase.util.TestHBaseFsck): expected:<[]> but
was:<[NOT_IN_META_HDFS, NOT_IN_META_OR_DEPLOYED]>
  org.apache.hadoop.hbase.mapreduce.TestSecureLoadIncrementalHFiles: Timed out waiting for
table to become available hbase:acl

Tests in error: 
  testOfflineRegion(org.apache.hadoop.hbase.master.TestAssignmentManagerOnCluster): test timed
out after 60000 milliseconds
  testRecoveredEdits(org.apache.hadoop.hbase.master.TestDistributedLogSplitting): null not
an instance of org.apache.hadoop.hbase.MiniHBaseCluster

Tests run: 1524, Failures: 28, Errors: 2, Skipped: 20

[INFO]                                                                         
[INFO] ------------------------------------------------------------------------
[INFO] Skipping HBase
[INFO] This project has been banned from the build due to previous failures.
[INFO] ------------------------------------------------------------------------
[INFO] ------------------------------------------------------------------------
[INFO] Reactor Summary:
[INFO] 
[INFO] HBase ............................................. SUCCESS [5.039s]
[INFO] HBase - Common .................................... SUCCESS [26.786s]
[INFO] HBase - Protocol .................................. SUCCESS [9.322s]
[INFO] HBase - Client .................................... SUCCESS [23.338s]
[INFO] HBase - Hadoop Compatibility ...................... SUCCESS [5.539s]
[INFO] HBase - Hadoop Two Compatibility .................. SUCCESS [4.106s]
[INFO] HBase - Prefix Tree ............................... SUCCESS [3.831s]
[INFO] HBase - Server .................................... FAILURE [1:25:51.909s]
[INFO] HBase - Integration Tests ......................... SKIPPED
[INFO] HBase - Examples .................................. SKIPPED
[INFO] HBase - Assembly .................................. SKIPPED
[INFO] ------------------------------------------------------------------------
[INFO] BUILD FAILURE
[INFO] ------------------------------------------------------------------------
[INFO] Total time: 1:27:13.959s
[INFO] Finished at: Sun Sep 01 01:16:09 UTC 2013
[INFO] Final Memory: 47M/1019M
[INFO] ------------------------------------------------------------------------
[ERROR] Failed to execute goal org.apache.maven.plugins:maven-surefire-plugin:2.12-TRUNK-HBASE-2:test
(secondPartTestsExecution) on project hbase-server: There are test failures.
[ERROR] 
[ERROR] Please refer to <https://builds.apache.org/job/hbase-0.96-hadoop2/ws/0.96-on-hadoop2/hbase-server/target/surefire-reports>
for the individual test results.
[ERROR] -> [Help 1]
[ERROR] 
[ERROR] To see the full stack trace of the errors, re-run Maven with the -e switch.
[ERROR] Re-run Maven using the -X switch to enable full debug logging.
[ERROR] 
[ERROR] For more information about the errors and possible solutions, please read the following
articles:
[ERROR] [Help 1] http://cwiki.apache.org/confluence/display/MAVEN/MojoFailureException
[ERROR] 
[ERROR] After correcting the problems, you can resume the build with the command
[ERROR]   mvn <goals> -rf :hbase-server
Build step 'Invoke top-level Maven targets' marked build as failure
Performing Post build task...
Match found for :.* : True
Logical operation result is TRUE
Running script  :   ZOMBIE_TESTS_COUNT=`jps | grep surefirebooter | wc -l`
  if [[ $ZOMBIE_TESTS_COUNT != 0 ]] ; then
    #It seems sometimes the tests are not dying immediately. Let's give them 10s
    echo "Suspicious java process found - waiting 10s to see if there are just slow to stop"
    sleep 10
    ZOMBIE_TESTS_COUNT=`jps | grep surefirebooter | wc -l`
    if [[ $ZOMBIE_TESTS_COUNT != 0 ]] ; then
      echo "There are $ZOMBIE_TESTS_COUNT zombie tests, they should have been killed by surefire
but survived"
      echo "************ BEGIN zombies jstack extract"
      ZB_STACK=`jps | grep surefirebooter | cut -d ' ' -f 1 | xargs -n 1 jstack | grep ".test"
| grep "\.java"`
      jps | grep surefirebooter | cut -d ' ' -f 1 | xargs -n 1 jstack
      echo "************ END  zombies jstack extract"
      JIRA_COMMENT="$JIRA_COMMENT

     {color:red}-1 core zombie tests{color}.  There are ${ZOMBIE_TESTS_COUNT} zombie test(s):
${ZB_STACK}"
      BAD=1
      jps | grep surefirebooter | cut -d ' ' -f 1 | xargs kill -9
    else
      echo "We're ok: there is no zombie test, but some tests took some time to stop"
    fi
  else
    echo "We're ok: there is no zombie test"
  fi
[hbase-0.96-hadoop2] $ /bin/bash -xe /tmp/hudson5757688614731808891.sh
++ jps
++ grep surefirebooter
++ wc -l
+ ZOMBIE_TESTS_COUNT=0
+ [[ 0 != 0 ]]
+ echo 'We'\''re ok: there is no zombie test'
We're ok: there is no zombie test
POST BUILD TASK : SUCCESS
END OF POST BUILD TASK : 0
Archiving artifacts
Recording test results
Updating HBASE-9042

Mime
View raw message