hbase-builds mailing list archives

Site index · List index
Message view « Date » · « Thread »
Top « Date » · « Thread »
From Stack <st...@duboce.net>
Subject Re: Build failed in Jenkins: HBase-TRUNK-on-Hadoop-2.0.0 #649
Date Fri, 02 Aug 2013 22:46:01 GMT
This build was 'killed' part way through.  Restarted it.


On Fri, Aug 2, 2013 at 2:57 PM, Apache Jenkins Server <
jenkins@builds.apache.org> wrote:

> See <https://builds.apache.org/job/HBase-TRUNK-on-Hadoop-2.0.0/649/changes
> >
>
> Changes:
>
> [stack] HBASE-9093 Hbase client API: Restore the writeToWal method; REVERT
>
> [tedyu] HBASE-9115 HTableInterface.append operation may overwrites values
> (Ted Yu)
>
> [jdcryans] HBASE-8983 HBaseConnection#deleteAllConnections does not always
> delete (Nicolas Liochon via JD)
>
> [stack] HBASE-9031 ImmutableBytesWritable.toString() should downcast the
> bytes before converting to hex string
>
> [stack] HBASE-9119 hbase.mapreduce.hfileoutputformat.blocksize should
> configure with blocksize of a table
>
> [stack] HBASE-8224 Publish hbase build against h1 and h2 adding '-hadoop1'
> or '-hadoop2' to version string
>
> [stack] Add pointer to Rajesh's nicely formatted hbase shell commands
> listing
>
> ------------------------------------------
> [...truncated 3153 lines...]
> [INFO] --- build-helper-maven-plugin:1.5:add-source
> (jspcSource-packageInfo-Avro-source) @ hbase-server ---
> [INFO] Source directory: <
> https://builds.apache.org/job/HBase-TRUNK-on-Hadoop-2.0.0/ws/trunk/hbase-server/target/generated-jamon>
> added.
> [INFO] Source directory: <
> https://builds.apache.org/job/HBase-TRUNK-on-Hadoop-2.0.0/ws/trunk/hbase-server/target/generated-sources/java>
> added.
> [INFO]
> [INFO] --- jamon-maven-plugin:2.3.4:translate (default) @ hbase-server ---
> [INFO] Translating 8 templates from <
> https://builds.apache.org/job/HBase-TRUNK-on-Hadoop-2.0.0/ws/trunk/hbase-server/src/main/jamon>
> to <
> https://builds.apache.org/job/HBase-TRUNK-on-Hadoop-2.0.0/ws/trunk/hbase-server/target/generated-jamon
> >
> [INFO]
> [INFO] --- maven-remote-resources-plugin:1.4:process (default) @
> hbase-server ---
> [INFO]
> [INFO] --- maven-resources-plugin:2.6:resources (default-resources) @
> hbase-server ---
> [INFO] Using 'UTF-8' encoding to copy filtered resources.
> [INFO] Copying 21 resources
> [INFO] Copying 3 resources
> [INFO]
> [INFO] --- maven-compiler-plugin:2.5.1:compile (default-compile) @
> hbase-server ---
> [INFO] Compiling 647 source files to <
> https://builds.apache.org/job/HBase-TRUNK-on-Hadoop-2.0.0/ws/trunk/hbase-server/target/classes
> >
> [INFO]
> [INFO] --- maven-dependency-plugin:2.1:build-classpath
> (create-mrapp-generated-classpath) @ hbase-server ---
> [INFO] Wrote classpath file '<
> https://builds.apache.org/job/HBase-TRUNK-on-Hadoop-2.0.0/ws/trunk/hbase-server/target/test-classes/mrapp-generated-classpath'
> .>
> [INFO]
> [INFO] --- maven-resources-plugin:2.6:testResources
> (default-testResources) @ hbase-server ---
> [INFO] Using 'UTF-8' encoding to copy filtered resources.
> [INFO] Copying 7 resources
> [INFO] Copying 3 resources
> [INFO]
> [INFO] --- maven-compiler-plugin:2.5.1:testCompile (default-testCompile) @
> hbase-server ---
> [INFO] Compiling 495 source files to <
> https://builds.apache.org/job/HBase-TRUNK-on-Hadoop-2.0.0/ws/trunk/hbase-server/target/test-classes
> >
> [INFO]
> [INFO] --- maven-surefire-plugin:2.12-TRUNK-HBASE-2:test (default-test) @
> hbase-server ---
> [INFO] Surefire report directory: <
> https://builds.apache.org/job/HBase-TRUNK-on-Hadoop-2.0.0/ws/trunk/hbase-server/target/surefire-reports
> >
> [INFO] Using configured provider
> org.apache.maven.surefire.junitcore.JUnitCoreProvider
>
> -------------------------------------------------------
>  T E S T S
> -------------------------------------------------------
> Running org.apache.hadoop.hbase.TestServerLoad
> Tests run: 2, Failures: 0, Errors: 0, Skipped: 0, Time elapsed: 0.061 sec
> Running org.apache.hadoop.hbase.io.TestHalfStoreFileReader
> Tests run: 2, Failures: 0, Errors: 0, Skipped: 0, Time elapsed: 0.524 sec
> Running org.apache.hadoop.hbase.io.TestImmutableBytesWritable
> Tests run: 3, Failures: 0, Errors: 0, Skipped: 0, Time elapsed: 0.036 sec
> Running org.apache.hadoop.hbase.io.TestReference
> Tests run: 1, Failures: 0, Errors: 0, Skipped: 0, Time elapsed: 0.013 sec
> Running org.apache.hadoop.hbase.io.encoding.TestPrefixTreeEncoding
> Tests run: 4, Failures: 0, Errors: 0, Skipped: 0, Time elapsed: 0.24 sec
> Running org.apache.hadoop.hbase.io.hfile.TestFixedFileTrailer
> Tests run: 2, Failures: 0, Errors: 0, Skipped: 0, Time elapsed: 0.061 sec
> Running org.apache.hadoop.hbase.io.hfile.TestHFileWriterV2
> Tests run: 2, Failures: 0, Errors: 0, Skipped: 0, Time elapsed: 0.943 sec
> Running
> org.apache.hadoop.hbase.io.hfile.TestHFileInlineToRootChunkConversion
> Tests run: 1, Failures: 0, Errors: 0, Skipped: 0, Time elapsed: 0.019 sec
> Running org.apache.hadoop.hbase.io.hfile.TestScannerSelectionUsingKeyRange
> Tests run: 3, Failures: 0, Errors: 0, Skipped: 0, Time elapsed: 0.549 sec
> Running org.apache.hadoop.hbase.io.hfile.TestHFile
> Tests run: 8, Failures: 0, Errors: 0, Skipped: 0, Time elapsed: 0.42 sec
> Running org.apache.hadoop.hbase.io.hfile.bucket.TestFileIOEngine
> Tests run: 1, Failures: 0, Errors: 0, Skipped: 0, Time elapsed: 0.018 sec
> Running org.apache.hadoop.hbase.io.hfile.bucket.TestBucketCache
> Tests run: 4, Failures: 0, Errors: 0, Skipped: 0, Time elapsed: 12.418 sec
> Running org.apache.hadoop.hbase.io.hfile.bucket.TestByteBufferIOEngine
> Tests run: 1, Failures: 0, Errors: 0, Skipped: 0, Time elapsed: 0.062 sec
> Running org.apache.hadoop.hbase.io.hfile.TestCachedBlockQueue
> Tests run: 2, Failures: 0, Errors: 0, Skipped: 0, Time elapsed: 0.023 sec
> Running org.apache.hadoop.hbase.io.hfile.TestSeekTo
> Tests run: 4, Failures: 0, Errors: 0, Skipped: 0, Time elapsed: 0.187 sec
> Running org.apache.hadoop.hbase.io.hfile.TestHFileDataBlockEncoder
> Tests run: 72, Failures: 0, Errors: 0, Skipped: 0, Time elapsed: 0.889 sec
> Running org.apache.hadoop.hbase.io.hfile.TestBlockCacheColumnFamilySummary
> Tests run: 4, Failures: 0, Errors: 0, Skipped: 0, Time elapsed: 0.095 sec
> Running org.apache.hadoop.hbase.io.hfile.TestReseekTo
> Tests run: 1, Failures: 0, Errors: 0, Skipped: 0, Time elapsed: 0.071 sec
> Running org.apache.hadoop.hbase.io.hfile.slab.TestSlab
> Tests run: 1, Failures: 0, Errors: 0, Skipped: 0, Time elapsed: 0.018 sec
> Running org.apache.hadoop.hbase.io.hfile.TestLruBlockCache
> Tests run: 8, Failures: 0, Errors: 0, Skipped: 0, Time elapsed: 0.299 sec
> Running org.apache.hadoop.hbase.io.hfile.TestHFileBlockCompatibility
> Tests run: 8, Failures: 0, Errors: 0, Skipped: 0, Time elapsed: 0.647 sec
> Running org.apache.hadoop.hbase.io.hfile.TestChecksum
> Tests run: 3, Failures: 0, Errors: 0, Skipped: 0, Time elapsed: 0.173 sec
> Running org.apache.hadoop.hbase.io.TestHeapSize
> Tests run: 3, Failures: 0, Errors: 0, Skipped: 0, Time elapsed: 0.035 sec
> Running org.apache.hadoop.hbase.TestServerName
> Tests run: 6, Failures: 0, Errors: 0, Skipped: 0, Time elapsed: 0.064 sec
> Running org.apache.hadoop.hbase.security.TestUser
> Tests run: 3, Failures: 0, Errors: 0, Skipped: 0, Time elapsed: 0.074 sec
> Running org.apache.hadoop.hbase.TestSerialization
> Tests run: 8, Failures: 0, Errors: 0, Skipped: 0, Time elapsed: 0.136 sec
> Running org.apache.hadoop.hbase.TestNodeHealthCheckChore
> Tests run: 4, Failures: 0, Errors: 0, Skipped: 0, Time elapsed: 4.128 sec
> Running org.apache.hadoop.hbase.protobuf.TestReplicationProtobuf
> Tests run: 1, Failures: 0, Errors: 0, Skipped: 0, Time elapsed: 0.016 sec
> Running org.apache.hadoop.hbase.protobuf.TestProtobufUtil
> Tests run: 7, Failures: 0, Errors: 0, Skipped: 0, Time elapsed: 0.105 sec
> Running org.apache.hadoop.hbase.TestHDFSBlocksDistribution
> Tests run: 2, Failures: 0, Errors: 0, Skipped: 0, Time elapsed: 0.024 sec
> Running org.apache.hadoop.hbase.TestCheckTestClasses
> Tests run: 1, Failures: 0, Errors: 0, Skipped: 0, Time elapsed: 0.739 sec
> Running org.apache.hadoop.hbase.zookeeper.TestZKConfig
> Tests run: 1, Failures: 0, Errors: 0, Skipped: 0, Time elapsed: 0.03 sec
> Running org.apache.hadoop.hbase.zookeeper.TestZooKeeperMainServer
> Tests run: 1, Failures: 0, Errors: 0, Skipped: 0, Time elapsed: 0.028 sec
> Running org.apache.hadoop.hbase.util.TestHBaseFsckComparator
> Tests run: 6, Failures: 0, Errors: 0, Skipped: 0, Time elapsed: 0.072 sec
> Running org.apache.hadoop.hbase.util.TestPoolMap$TestRoundRobinPoolType
> Tests run: 3, Failures: 0, Errors: 0, Skipped: 0, Time elapsed: 0.04 sec
> Running org.apache.hadoop.hbase.util.TestPoolMap$TestThreadLocalPoolType
> Tests run: 3, Failures: 0, Errors: 0, Skipped: 0, Time elapsed: 0.038 sec
> Running org.apache.hadoop.hbase.util.TestPoolMap$TestReusablePoolType
> Tests run: 3, Failures: 0, Errors: 0, Skipped: 0, Time elapsed: 0.034 sec
> Running org.apache.hadoop.hbase.util.TestIncrementingEnvironmentEdge
> Tests run: 1, Failures: 0, Errors: 0, Skipped: 0, Time elapsed: 0.011 sec
> Running org.apache.hadoop.hbase.util.TestByteBloomFilter
> Tests run: 5, Failures: 0, Errors: 0, Skipped: 0, Time elapsed: 1.092 sec
> Running org.apache.hadoop.hbase.util.TestSortedCopyOnWriteSet
> Tests run: 2, Failures: 0, Errors: 0, Skipped: 0, Time elapsed: 0.027 sec
> Running org.apache.hadoop.hbase.util.TestKeying
> Tests run: 1, Failures: 0, Errors: 0, Skipped: 0, Time elapsed: 0.014 sec
> Running org.apache.hadoop.hbase.util.TestByteBufferUtils
> Tests run: 12, Failures: 0, Errors: 0, Skipped: 0, Time elapsed: 0.229 sec
> Running org.apache.hadoop.hbase.util.TestHFileArchiveUtil
> Tests run: 4, Failures: 0, Errors: 0, Skipped: 0, Time elapsed: 0.064 sec
> Running org.apache.hadoop.hbase.util.TestRegionSplitCalculator
> Tests run: 15, Failures: 0, Errors: 0, Skipped: 0, Time elapsed: 0.199 sec
> Running org.apache.hadoop.hbase.util.TestCompressionTest
> Tests run: 2, Failures: 0, Errors: 0, Skipped: 0, Time elapsed: 0.051 sec
> Running org.apache.hadoop.hbase.util.TestRootPath
> Tests run: 1, Failures: 0, Errors: 0, Skipped: 0, Time elapsed: 0.012 sec
> Running org.apache.hadoop.hbase.rest.model.TestScannerModel
> Tests run: 3, Failures: 0, Errors: 0, Skipped: 0, Time elapsed: 0.061 sec
> Running org.apache.hadoop.hbase.rest.model.TestStorageClusterVersionModel
> Tests run: 2, Failures: 0, Errors: 0, Skipped: 0, Time elapsed: 0.026 sec
> Running org.apache.hadoop.hbase.rest.model.TestCellSetModel
> Tests run: 3, Failures: 0, Errors: 0, Skipped: 0, Time elapsed: 0.048 sec
> Running org.apache.hadoop.hbase.rest.model.TestTableListModel
> Tests run: 3, Failures: 0, Errors: 0, Skipped: 0, Time elapsed: 0.041 sec
> Running org.apache.hadoop.hbase.rest.model.TestVersionModel
> Tests run: 3, Failures: 0, Errors: 0, Skipped: 0, Time elapsed: 0.041 sec
> Running org.apache.hadoop.hbase.rest.model.TestTableSchemaModel
> Tests run: 3, Failures: 0, Errors: 0, Skipped: 0, Time elapsed: 0.049 sec
> Running org.apache.hadoop.hbase.rest.model.TestTableRegionModel
> Tests run: 4, Failures: 0, Errors: 0, Skipped: 0, Time elapsed: 0.044 sec
> Running org.apache.hadoop.hbase.rest.model.TestColumnSchemaModel
> Tests run: 2, Failures: 0, Errors: 0, Skipped: 0, Time elapsed: 0.024 sec
> Running org.apache.hadoop.hbase.rest.model.TestStorageClusterStatusModel
> Tests run: 3, Failures: 0, Errors: 0, Skipped: 0, Time elapsed: 0.048 sec
> Running org.apache.hadoop.hbase.rest.model.TestCellModel
> Tests run: 3, Failures: 0, Errors: 0, Skipped: 0, Time elapsed: 0.034 sec
> Running org.apache.hadoop.hbase.rest.model.TestRowModel
> Tests run: 2, Failures: 0, Errors: 0, Skipped: 0, Time elapsed: 0.024 sec
> Running org.apache.hadoop.hbase.rest.model.TestTableInfoModel
> Tests run: 3, Failures: 0, Errors: 0, Skipped: 0, Time elapsed: 0.044 sec
> Running org.apache.hadoop.hbase.constraint.TestConstraints
> Tests run: 6, Failures: 0, Errors: 0, Skipped: 0, Time elapsed: 0.427 sec
> Running org.apache.hadoop.hbase.ipc.TestIPC
> Tests run: 2, Failures: 0, Errors: 0, Skipped: 0, Time elapsed: 0.86 sec
> Running org.apache.hadoop.hbase.ipc.TestRpcMetrics
> Tests run: 3, Failures: 0, Errors: 0, Skipped: 0, Time elapsed: 0.059 sec
> Running org.apache.hadoop.hbase.filter.TestRandomRowFilter
> Tests run: 2, Failures: 0, Errors: 0, Skipped: 0, Time elapsed: 0.214 sec
> Running org.apache.hadoop.hbase.filter.TestBitComparator
> Tests run: 6, Failures: 0, Errors: 0, Skipped: 0, Time elapsed: 0.073 sec
> Running org.apache.hadoop.hbase.filter.TestFilterList
> Tests run: 7, Failures: 0, Errors: 0, Skipped: 0, Time elapsed: 0.085 sec
> Running org.apache.hadoop.hbase.filter.TestInclusiveStopFilter
> Tests run: 2, Failures: 0, Errors: 0, Skipped: 0, Time elapsed: 0.028 sec
> Running org.apache.hadoop.hbase.filter.TestSingleColumnValueExcludeFilter
> Tests run: 1, Failures: 0, Errors: 0, Skipped: 0, Time elapsed: 0.016 sec
> Killed
>
> Results :
>
> Tests run: 295, Failures: 0, Errors: 0, Skipped: 0
>
> [INFO]
> ------------------------------------------------------------------------
> [INFO] Reactor Summary:
> [INFO]
> [INFO] HBase ............................................. SUCCESS [8.053s]
> [INFO] HBase - Common .................................... SUCCESS
> [22.700s]
> [INFO] HBase - Protocol .................................. SUCCESS [7.967s]
> [INFO] HBase - Client .................................... SUCCESS
> [23.526s]
> [INFO] HBase - Hadoop Compatibility ...................... SUCCESS [5.432s]
> [INFO] HBase - Hadoop Two Compatibility .................. SUCCESS [4.266s]
> [INFO] HBase - Prefix Tree ............................... SUCCESS [3.355s]
> [INFO] HBase - Server .................................... FAILURE
> [49.051s]
> [INFO] HBase - Integration Tests ......................... SKIPPED
> [INFO] HBase - Examples .................................. SKIPPED
> [INFO] HBase - Assembly .................................. SKIPPED
> [INFO]
> ------------------------------------------------------------------------
> [INFO] BUILD FAILURE
> [INFO]
> ------------------------------------------------------------------------
> [INFO] Total time: 2:05.025s
> [INFO] Finished at: Fri Aug 02 21:57:47 UTC 2013
> [INFO] Final Memory: 69M/677M
> [INFO]
> ------------------------------------------------------------------------
> [ERROR] Failed to execute goal
> org.apache.maven.plugins:maven-surefire-plugin:2.12-TRUNK-HBASE-2:test
> (default-test) on project hbase-server: Error occurred in starting fork,
> check output in log -> [Help 1]
> [ERROR]
> [ERROR] To see the full stack trace of the errors, re-run Maven with the
> -e switch.
> [ERROR] Re-run Maven using the -X switch to enable full debug logging.
> [ERROR]
> [ERROR] For more information about the errors and possible solutions,
> please read the following articles:
> [ERROR] [Help 1]
> http://cwiki.apache.org/confluence/display/MAVEN/MojoExecutionException
> [ERROR]
> [ERROR] After correcting the problems, you can resume the build with the
> command
> [ERROR]   mvn <goals> -rf :hbase-server
> Build step 'Invoke top-level Maven targets' marked build as failure
> Performing Post build task...
> Match found for :.* : True
> Logical operation result is TRUE
> Running script  :   ZOMBIE_TESTS_COUNT=`jps | grep surefirebooter | wc -l`
>   if [[ $ZOMBIE_TESTS_COUNT != 0 ]] ; then
>     #It seems sometimes the tests are not dying immediately. Let's give
> them 10s
>     echo "Suspicious java process found - waiting 10s to see if there are
> just slow to stop"
>     sleep 10
>     ZOMBIE_TESTS_COUNT=`jps | grep surefirebooter | wc -l`
>     if [[ $ZOMBIE_TESTS_COUNT != 0 ]] ; then
>       echo "There are $ZOMBIE_TESTS_COUNT zombie tests, they should have
> been killed by surefire but survived"
>       echo "************ BEGIN zombies jstack extract"
>       ZB_STACK=`jps | grep surefirebooter | cut -d ' ' -f 1 | xargs -n 1
> jstack | grep ".test" | grep "\.java"`
>       jps | grep surefirebooter | cut -d ' ' -f 1 | xargs -n 1 jstack
>       echo "************ END  zombies jstack extract"
>       JIRA_COMMENT="$JIRA_COMMENT
>
>      {color:red}-1 core zombie tests{color}.  There are
> ${ZOMBIE_TESTS_COUNT} zombie test(s): ${ZB_STACK}"
>       BAD=1
>       jps | grep surefirebooter | cut -d ' ' -f 1 | xargs kill -9
>     else
>       echo "We're ok: there is no zombie test, but some tests took some
> time to stop"
>     fi
>   else
>     echo "We're ok: there is no zombie test"
>   fi
> [HBase-TRUNK-on-Hadoop-2.0.0] $ /bin/bash -xe
> /tmp/hudson1257497064929567449.sh
> ++ jps
> ++ grep surefirebooter
> ++ wc -l
> + ZOMBIE_TESTS_COUNT=0
> + [[ 0 != 0 ]]
> + echo 'We'\''re ok: there is no zombie test'
> We're ok: there is no zombie test
> POST BUILD TASK : SUCCESS
> END OF POST BUILD TASK : 0
> Archiving artifacts
> Recording test results
> Updating HBASE-9093
> Updating HBASE-9119
> Updating HBASE-8224
> Updating HBASE-8983
> Updating HBASE-9115
> Updating HBASE-9031
>

Mime
  • Unnamed multipart/alternative (inline, None, 0 bytes)
View raw message