hbase-builds mailing list archives

Site index · List index
Message view « Date » · « Thread »
Top « Date » · « Thread »
From apurt...@apache.org
Subject Build failed in Jenkins: HBase-0.95 #772
Date Thu, 08 Aug 2013 04:28:41 GMT
See <http://54.241.6.143/job/HBase-0.95/772/changes>

Changes:

[Michael Stack] HBASE-8408 Implement namespace

------------------------------------------
[...truncated 5494 lines...]
Downloading: http://repo.maven.apache.org/maven2/org/eclipse/jdt/core/3.1.1/core-3.1.1.pom
Downloaded: http://repo.maven.apache.org/maven2/org/eclipse/jdt/core/3.1.1/core-3.1.1.pom
(677 B at 66.1 KB/sec)
Downloading: http://repository-netty.forge.cloudbees.com/snapshot/org/jamon/jamon-runtime/2.3.1/jamon-runtime-2.3.1.pom
Downloading: https://repository.apache.org/content/repositories/releases/org/jamon/jamon-runtime/2.3.1/jamon-runtime-2.3.1.pom
Downloading: http://download.java.net/maven/2/org/jamon/jamon-runtime/2.3.1/jamon-runtime-2.3.1.pom
Downloading: http://repository.codehaus.org/org/jamon/jamon-runtime/2.3.1/jamon-runtime-2.3.1.pom
Downloading: http://repository.jboss.org/nexus/content/groups/public-jboss/org/jamon/jamon-runtime/2.3.1/jamon-runtime-2.3.1.pom
Downloading: http://people.apache.org/~garyh/mvn/org/jamon/jamon-runtime/2.3.1/jamon-runtime-2.3.1.pom
Downloading: http://repo.maven.apache.org/maven2/org/jamon/jamon-runtime/2.3.1/jamon-runtime-2.3.1.pom
Downloaded: http://repo.maven.apache.org/maven2/org/jamon/jamon-runtime/2.3.1/jamon-runtime-2.3.1.pom
(2 KB at 162.6 KB/sec)
Downloading: http://repository-netty.forge.cloudbees.com/snapshot/org/jamon/jamon-project/1.0.2/jamon-project-1.0.2.pom
Downloading: https://repository.apache.org/content/repositories/releases/org/jamon/jamon-project/1.0.2/jamon-project-1.0.2.pom
Downloading: http://download.java.net/maven/2/org/jamon/jamon-project/1.0.2/jamon-project-1.0.2.pom
Downloading: http://repository.codehaus.org/org/jamon/jamon-project/1.0.2/jamon-project-1.0.2.pom
Downloading: http://repository.jboss.org/nexus/content/groups/public-jboss/org/jamon/jamon-project/1.0.2/jamon-project-1.0.2.pom
Downloading: http://people.apache.org/~garyh/mvn/org/jamon/jamon-project/1.0.2/jamon-project-1.0.2.pom
Downloading: http://repo.maven.apache.org/maven2/org/jamon/jamon-project/1.0.2/jamon-project-1.0.2.pom
Downloaded: http://repo.maven.apache.org/maven2/org/jamon/jamon-project/1.0.2/jamon-project-1.0.2.pom
(9 KB at 812.3 KB/sec)
Downloading: http://repository-netty.forge.cloudbees.com/snapshot/com/github/stephenc/high-scale-lib/high-scale-lib/1.1.1/high-scale-lib-1.1.1.jar
Downloading: http://repository-netty.forge.cloudbees.com/snapshot/org/apache/thrift/libthrift/0.9.0/libthrift-0.9.0.jar
Downloading: http://repository-netty.forge.cloudbees.com/snapshot/org/apache/httpcomponents/httpclient/4.1.3/httpclient-4.1.3.jar
Downloading: http://repository-netty.forge.cloudbees.com/snapshot/org/jruby/jruby-complete/1.6.8/jruby-complete-1.6.8.jar
Downloading: http://repository-netty.forge.cloudbees.com/snapshot/org/apache/httpcomponents/httpcore/4.1.3/httpcore-4.1.3.jar
Downloading: http://repository-netty.forge.cloudbees.com/snapshot/org/mortbay/jetty/jetty-sslengine/6.1.26/jetty-sslengine-6.1.26.jar
Downloading: http://repository-netty.forge.cloudbees.com/snapshot/org/eclipse/jdt/core/3.1.1/core-3.1.1.jar
Downloading: http://repository-netty.forge.cloudbees.com/snapshot/org/jamon/jamon-runtime/2.3.1/jamon-runtime-2.3.1.jar
Downloading: https://repository.apache.org/content/repositories/releases/com/github/stephenc/high-scale-lib/high-scale-lib/1.1.1/high-scale-lib-1.1.1.jar
Downloading: https://repository.apache.org/content/repositories/releases/org/apache/thrift/libthrift/0.9.0/libthrift-0.9.0.jar
Downloading: https://repository.apache.org/content/repositories/releases/org/apache/httpcomponents/httpclient/4.1.3/httpclient-4.1.3.jar
Downloading: https://repository.apache.org/content/repositories/releases/org/apache/httpcomponents/httpcore/4.1.3/httpcore-4.1.3.jar
Downloading: https://repository.apache.org/content/repositories/releases/org/jruby/jruby-complete/1.6.8/jruby-complete-1.6.8.jar
Downloading: https://repository.apache.org/content/repositories/releases/org/mortbay/jetty/jetty-sslengine/6.1.26/jetty-sslengine-6.1.26.jar
Downloading: https://repository.apache.org/content/repositories/releases/org/eclipse/jdt/core/3.1.1/core-3.1.1.jar
Downloading: https://repository.apache.org/content/repositories/releases/org/jamon/jamon-runtime/2.3.1/jamon-runtime-2.3.1.jar
Downloaded: https://repository.apache.org/content/repositories/releases/org/apache/httpcomponents/httpcore/4.1.3/httpcore-4.1.3.jar
(177 KB at 458.4 KB/sec)
Downloaded: https://repository.apache.org/content/repositories/releases/org/apache/httpcomponents/httpclient/4.1.3/httpclient-4.1.3.jar
(345 KB at 723.4 KB/sec)
Downloaded: https://repository.apache.org/content/repositories/releases/org/apache/thrift/libthrift/0.9.0/libthrift-0.9.0.jar
(340 KB at 701.2 KB/sec)
Downloading: http://download.java.net/maven/2/com/github/stephenc/high-scale-lib/high-scale-lib/1.1.1/high-scale-lib-1.1.1.jar
Downloading: http://download.java.net/maven/2/org/jruby/jruby-complete/1.6.8/jruby-complete-1.6.8.jar
Downloading: http://download.java.net/maven/2/org/mortbay/jetty/jetty-sslengine/6.1.26/jetty-sslengine-6.1.26.jar
Downloading: http://download.java.net/maven/2/org/eclipse/jdt/core/3.1.1/core-3.1.1.jar
Downloading: http://download.java.net/maven/2/org/jamon/jamon-runtime/2.3.1/jamon-runtime-2.3.1.jar
Downloading: http://repository.codehaus.org/com/github/stephenc/high-scale-lib/high-scale-lib/1.1.1/high-scale-lib-1.1.1.jar
Downloading: http://repository.codehaus.org/org/jruby/jruby-complete/1.6.8/jruby-complete-1.6.8.jar
Downloading: http://repository.codehaus.org/org/mortbay/jetty/jetty-sslengine/6.1.26/jetty-sslengine-6.1.26.jar
Downloading: http://repository.codehaus.org/org/eclipse/jdt/core/3.1.1/core-3.1.1.jar
Downloading: http://repository.codehaus.org/org/jamon/jamon-runtime/2.3.1/jamon-runtime-2.3.1.jar
Downloaded: http://repository.codehaus.org/org/jruby/jruby-complete/1.6.8/jruby-complete-1.6.8.jar
(13509 KB at 7173.7 KB/sec)
Downloading: http://repository.jboss.org/nexus/content/groups/public-jboss/com/github/stephenc/high-scale-lib/high-scale-lib/1.1.1/high-scale-lib-1.1.1.jar
Downloading: http://repository.jboss.org/nexus/content/groups/public-jboss/org/mortbay/jetty/jetty-sslengine/6.1.26/jetty-sslengine-6.1.26.jar
Downloading: http://repository.jboss.org/nexus/content/groups/public-jboss/org/eclipse/jdt/core/3.1.1/core-3.1.1.jar
Downloading: http://repository.jboss.org/nexus/content/groups/public-jboss/org/jamon/jamon-runtime/2.3.1/jamon-runtime-2.3.1.jar
Downloading: http://people.apache.org/~garyh/mvn/com/github/stephenc/high-scale-lib/high-scale-lib/1.1.1/high-scale-lib-1.1.1.jar
Downloading: http://people.apache.org/~garyh/mvn/org/mortbay/jetty/jetty-sslengine/6.1.26/jetty-sslengine-6.1.26.jar
Downloading: http://people.apache.org/~garyh/mvn/org/eclipse/jdt/core/3.1.1/core-3.1.1.jar
Downloading: http://people.apache.org/~garyh/mvn/org/jamon/jamon-runtime/2.3.1/jamon-runtime-2.3.1.jar
Downloading: http://repo.maven.apache.org/maven2/com/github/stephenc/high-scale-lib/high-scale-lib/1.1.1/high-scale-lib-1.1.1.jar
Downloading: http://repo.maven.apache.org/maven2/org/mortbay/jetty/jetty-sslengine/6.1.26/jetty-sslengine-6.1.26.jar
Downloading: http://repo.maven.apache.org/maven2/org/eclipse/jdt/core/3.1.1/core-3.1.1.jar
Downloading: http://repo.maven.apache.org/maven2/org/jamon/jamon-runtime/2.3.1/jamon-runtime-2.3.1.jar
Downloaded: http://repo.maven.apache.org/maven2/com/github/stephenc/high-scale-lib/high-scale-lib/1.1.1/high-scale-lib-1.1.1.jar
(94 KB at 5513.3 KB/sec)
Downloaded: http://repo.maven.apache.org/maven2/org/mortbay/jetty/jetty-sslengine/6.1.26/jetty-sslengine-6.1.26.jar
(19 KB at 971.0 KB/sec)
Downloaded: http://repo.maven.apache.org/maven2/org/jamon/jamon-runtime/2.3.1/jamon-runtime-2.3.1.jar
(21 KB at 1061.0 KB/sec)
Downloaded: http://repo.maven.apache.org/maven2/org/eclipse/jdt/core/3.1.1/core-3.1.1.jar
(3484 KB at 25240.9 KB/sec)
[INFO] 
[INFO] --- maven-antrun-plugin:1.6:run (generate) @ hbase-server ---
[INFO] Executing tasks

main:
    [mkdir] Created dir: <http://54.241.6.143/job/HBase-0.95/ws/hbase-server/target/hbase-webapps>
     [copy] Copying 17 files to <http://54.241.6.143/job/HBase-0.95/ws/hbase-server/target/hbase-webapps>
13/08/08 04:28:24 INFO mortbay.log: Logging to org.slf4j.impl.Log4jLoggerAdapter(org.mortbay.log)
via org.mortbay.log.Slf4jLog
    [mkdir] Created dir: <http://54.241.6.143/job/HBase-0.95/ws/hbase-server/target/hbase-webapps/master/WEB-INF>
    [mkdir] Created dir: <http://54.241.6.143/job/HBase-0.95/ws/hbase-server/target/hbase-webapps/regionserver/WEB-INF>
    [mkdir] Created dir: <http://54.241.6.143/job/HBase-0.95/ws/hbase-server/target/hbase-webapps/rest/WEB-INF>
    [mkdir] Created dir: <http://54.241.6.143/job/HBase-0.95/ws/hbase-server/target/hbase-webapps/thrift/WEB-INF>
[INFO] Executed tasks
[INFO] [INFO] Source directory: <http://54.241.6.143/job/HBase-0.95/ws/hbase-server/target/generated-jamon>
added.
[INFO] Source directory: <http://54.241.6.143/job/HBase-0.95/ws/hbase-server/target/generated-sources/java>
added.

[INFO] --- build-helper-maven-plugin:1.5:add-source (jspcSource-packageInfo-Avro-source) @
hbase-server ---
[INFO] 
[INFO] --- jamon-maven-plugin:2.3.4:translate (default) @ hbase-server ---
Downloading: http://people.apache.org/~garyh/mvn/org/jamon/jamon-processor/2.3.4/jamon-processor-2.3.4.pom
Downloading: http://repo.maven.apache.org/maven2/org/jamon/jamon-processor/2.3.4/jamon-processor-2.3.4.pom
Downloaded: http://repo.maven.apache.org/maven2/org/jamon/jamon-processor/2.3.4/jamon-processor-2.3.4.pom
(3 KB at 291.5 KB/sec)
Downloading: http://people.apache.org/~garyh/mvn/org/jamon/jamon-api/2.3.0/jamon-api-2.3.0.pom
Downloading: http://repo.maven.apache.org/maven2/org/jamon/jamon-api/2.3.0/jamon-api-2.3.0.pom
Downloaded: http://repo.maven.apache.org/maven2/org/jamon/jamon-api/2.3.0/jamon-api-2.3.0.pom
(2 KB at 120.6 KB/sec)
Downloading: http://people.apache.org/~garyh/mvn/org/jamon/jamon-project/1.0.1/jamon-project-1.0.1.pom
Downloading: http://repo.maven.apache.org/maven2/org/jamon/jamon-project/1.0.1/jamon-project-1.0.1.pom
Downloaded: http://repo.maven.apache.org/maven2/org/jamon/jamon-project/1.0.1/jamon-project-1.0.1.pom
(9 KB at 821.8 KB/sec)
Downloading: http://people.apache.org/~garyh/mvn/org/codehaus/plexus/plexus-compiler-api/1.8.1/plexus-compiler-api-1.8.1.pom
Downloading: http://repo.maven.apache.org/maven2/org/codehaus/plexus/plexus-compiler-api/1.8.1/plexus-compiler-api-1.8.1.pom
Downloaded: http://repo.maven.apache.org/maven2/org/codehaus/plexus/plexus-compiler-api/1.8.1/plexus-compiler-api-1.8.1.pom
(805 B at 78.6 KB/sec)
Downloading: http://people.apache.org/~garyh/mvn/org/codehaus/plexus/plexus-compiler/1.8.1/plexus-compiler-1.8.1.pom
Downloading: http://repo.maven.apache.org/maven2/org/codehaus/plexus/plexus-compiler/1.8.1/plexus-compiler-1.8.1.pom
Downloaded: http://repo.maven.apache.org/maven2/org/codehaus/plexus/plexus-compiler/1.8.1/plexus-compiler-1.8.1.pom
(4 KB at 283.0 KB/sec)
Downloading: http://people.apache.org/~garyh/mvn/org/codehaus/plexus/plexus-components/1.1.18/plexus-components-1.1.18.pom
Downloading: http://repo.maven.apache.org/maven2/org/codehaus/plexus/plexus-components/1.1.18/plexus-components-1.1.18.pom
Downloaded: http://repo.maven.apache.org/maven2/org/codehaus/plexus/plexus-components/1.1.18/plexus-components-1.1.18.pom
(6 KB at 522.9 KB/sec)
Downloading: http://people.apache.org/~garyh/mvn/org/jamon/jamon-processor/2.3.4/jamon-processor-2.3.4.jar
Downloading: http://people.apache.org/~garyh/mvn/org/jamon/jamon-api/2.3.0/jamon-api-2.3.0.jar
Downloading: http://people.apache.org/~garyh/mvn/org/codehaus/plexus/plexus-compiler-api/1.8.1/plexus-compiler-api-1.8.1.jar
Downloading: http://people.apache.org/~garyh/mvn/org/codehaus/plexus/plexus-utils/1.5.5/plexus-utils-1.5.5.jar
Downloading: http://repo.maven.apache.org/maven2/org/jamon/jamon-processor/2.3.4/jamon-processor-2.3.4.jar
Downloading: http://repo.maven.apache.org/maven2/org/jamon/jamon-api/2.3.0/jamon-api-2.3.0.jar
Downloading: http://repo.maven.apache.org/maven2/org/codehaus/plexus/plexus-compiler-api/1.8.1/plexus-compiler-api-1.8.1.jar
Downloading: http://repo.maven.apache.org/maven2/org/codehaus/plexus/plexus-utils/1.5.5/plexus-utils-1.5.5.jar
Downloaded: http://repo.maven.apache.org/maven2/org/jamon/jamon-api/2.3.0/jamon-api-2.3.0.jar
(5 KB at 299.5 KB/sec)
Downloaded: http://repo.maven.apache.org/maven2/org/codehaus/plexus/plexus-compiler-api/1.8.1/plexus-compiler-api-1.8.1.jar
(20 KB at 1218.3 KB/sec)
Downloaded: http://repo.maven.apache.org/maven2/org/jamon/jamon-processor/2.3.4/jamon-processor-2.3.4.jar
(264 KB at 16473.9 KB/sec)
Downloaded: http://repo.maven.apache.org/maven2/org/codehaus/plexus/plexus-utils/1.5.5/plexus-utils-1.5.5.jar
(246 KB at 9437.9 KB/sec)
[INFO] Translating 8 templates from <http://54.241.6.143/job/HBase-0.95/ws/hbase-server/src/main/jamon>
to <http://54.241.6.143/job/HBase-0.95/ws/hbase-server/target/generated-jamon>
[INFO] 
[INFO] --- maven-remote-resources-plugin:1.4:process (default) @ hbase-server ---
[INFO] [INFO] Using 'UTF-8' encoding to copy filtered resources.

[INFO] --- maven-resources-plugin:2.6:resources (default-resources) @ hbase-server ---
[INFO] Copying 21 resources
[INFO] Copying 3 resources
[INFO] 
[INFO] --- maven-compiler-plugin:2.5.1:compile (default-compile) @ hbase-server ---
[INFO] Compiling 651 source files to <http://54.241.6.143/job/HBase-0.95/ws/hbase-server/target/classes>
[INFO] [INFO] Using 'UTF-8' encoding to copy filtered resources.

[INFO] Copying 7 resources
[INFO] --- maven-resources-plugin:2.6:testResources (default-testResources) @ hbase-server
---
[INFO] Copying 3 resources
[INFO] 
[INFO] --- maven-compiler-plugin:2.5.1:testCompile (default-testCompile) @ hbase-server ---
[INFO] Compiling 500 source files to <http://54.241.6.143/job/HBase-0.95/ws/hbase-server/target/test-classes>
[INFO] -------------------------------------------------------------
[ERROR] COMPILATION ERROR : 
[INFO] -------------------------------------------------------------
[ERROR] <http://54.241.6.143/job/HBase-0.95/ws/hbase-server/src/test/java/org/apache/hadoop/hbase/util/TestMergeTool.java>:[70,46]
cannot find symbol
symbol  : method valueOf(java.lang.String)
location: class org.apache.hadoop.hbase.util.TableName
[ERROR] <http://54.241.6.143/job/HBase-0.95/ws/hbase-server/src/test/java/org/apache/hadoop/hbase/util/TestMergeTable.java>:[69,58]
cannot find symbol
symbol  : method valueOf(byte[])
location: class org.apache.hadoop.hbase.util.TableName
[INFO] 2 errors 
[INFO] -------------------------------------------------------------
[INFO] ------------------------------------------------------------------------
[INFO] Reactor Summary:
[INFO] 
[INFO] HBase ............................................. SUCCESS [54.289s]
[INFO] HBase - Common .................................... SUCCESS [1:08.867s]
[INFO] HBase - Protocol .................................. SUCCESS [18.778s]
[INFO] HBase - Client .................................... SUCCESS [27.648s]
[INFO] HBase - Hadoop Compatibility ...................... SUCCESS [5.653s]
[INFO] HBase - Hadoop One Compatibility .................. SUCCESS [10.301s]
[INFO] HBase - Prefix Tree ............................... SUCCESS [4.692s]
[INFO] HBase - Server .................................... FAILURE [26.491s]
[INFO] HBase - Integration Tests ......................... SKIPPED
[INFO] HBase - Examples .................................. SKIPPED
[INFO] HBase - Assembly .................................. SKIPPED
[INFO] ------------------------------------------------------------------------
[INFO] BUILD FAILURE
[INFO] ------------------------------------------------------------------------
[INFO] Total time: 3:59.305s
[INFO] Finished at: Thu Aug 08 04:28:38 UTC 2013
[INFO] Final Memory: 57M/390M
[INFO] ------------------------------------------------------------------------
[JENKINS] Archiving <http://54.241.6.143/job/HBase-0.95/ws/hbase-common/pom.xml> to
/var/lib/jenkins/jobs/HBase-0.95/modules/org.apache.hbase$hbase-common/builds/2013-08-08_04-24-33/archive/org.apache.hbase/hbase-common/0.97.0-SNAPSHOT/hbase-common-0.97.0-SNAPSHOT.pom
[JENKINS] Archiving <http://54.241.6.143/job/HBase-0.95/ws/hbase-hadoop-compat/pom.xml>
to /var/lib/jenkins/jobs/HBase-0.95/modules/org.apache.hbase$hbase-hadoop-compat/builds/2013-08-08_04-24-33/archive/org.apache.hbase/hbase-hadoop-compat/0.97.0-SNAPSHOT/hbase-hadoop-compat-0.97.0-SNAPSHOT.pom
[JENKINS] Archiving <http://54.241.6.143/job/HBase-0.95/ws/hbase-examples/pom.xml> to
/var/lib/jenkins/jobs/HBase-0.95/modules/org.apache.hbase$hbase-examples/builds/2013-08-08_04-24-33/archive/org.apache.hbase/hbase-examples/0.97.0-SNAPSHOT/hbase-examples-0.97.0-SNAPSHOT.pom
[JENKINS] Archiving <http://54.241.6.143/job/HBase-0.95/ws/hbase-it/pom.xml> to /var/lib/jenkins/jobs/HBase-0.95/modules/org.apache.hbase$hbase-it/builds/2013-08-08_04-24-33/archive/org.apache.hbase/hbase-it/0.97.0-SNAPSHOT/hbase-it-0.97.0-SNAPSHOT.pom
[JENKINS] Archiving <http://54.241.6.143/job/HBase-0.95/ws/pom.xml> to /var/lib/jenkins/jobs/HBase-0.95/modules/org.apache.hbase$hbase/builds/2013-08-08_04-24-32/archive/org.apache.hbase/hbase/0.97.0-SNAPSHOT/hbase-0.97.0-SNAPSHOT.pom
[JENKINS] Archiving <http://54.241.6.143/job/HBase-0.95/ws/hbase-assembly/pom.xml> to
/var/lib/jenkins/jobs/HBase-0.95/modules/org.apache.hbase$hbase-assembly/builds/2013-08-08_04-24-33/archive/org.apache.hbase/hbase-assembly/0.97.0-SNAPSHOT/hbase-assembly-0.97.0-SNAPSHOT.pom
[JENKINS] Archiving <http://54.241.6.143/job/HBase-0.95/ws/hbase-client/pom.xml> to
/var/lib/jenkins/jobs/HBase-0.95/modules/org.apache.hbase$hbase-client/builds/2013-08-08_04-24-33/archive/org.apache.hbase/hbase-client/0.97.0-SNAPSHOT/hbase-client-0.97.0-SNAPSHOT.pom
[JENKINS] Archiving <http://54.241.6.143/job/HBase-0.95/ws/hbase-prefix-tree/pom.xml>
to /var/lib/jenkins/jobs/HBase-0.95/modules/org.apache.hbase$hbase-prefix-tree/builds/2013-08-08_04-24-33/archive/org.apache.hbase/hbase-prefix-tree/0.97.0-SNAPSHOT/hbase-prefix-tree-0.97.0-SNAPSHOT.pom
[JENKINS] Archiving <http://54.241.6.143/job/HBase-0.95/ws/hbase-protocol/pom.xml> to
/var/lib/jenkins/jobs/HBase-0.95/modules/org.apache.hbase$hbase-protocol/builds/2013-08-08_04-24-33/archive/org.apache.hbase/hbase-protocol/0.97.0-SNAPSHOT/hbase-protocol-0.97.0-SNAPSHOT.pom
[JENKINS] Archiving <http://54.241.6.143/job/HBase-0.95/ws/hbase-hadoop1-compat/pom.xml>
to /var/lib/jenkins/jobs/HBase-0.95/modules/org.apache.hbase$hbase-hadoop1-compat/builds/2013-08-08_04-24-33/archive/org.apache.hbase/hbase-hadoop1-compat/0.97.0-SNAPSHOT/hbase-hadoop1-compat-0.97.0-SNAPSHOT.pom
[JENKINS] Archiving <http://54.241.6.143/job/HBase-0.95/ws/hbase-server/pom.xml> to
/var/lib/jenkins/jobs/HBase-0.95/modules/org.apache.hbase$hbase-server/builds/2013-08-08_04-24-32/archive/org.apache.hbase/hbase-server/0.97.0-SNAPSHOT/hbase-server-0.97.0-SNAPSHOT.pom
Waiting for Jenkins to finish collecting data
mavenExecutionResult exceptions not empty
message : Failed to execute goal org.apache.maven.plugins:maven-compiler-plugin:2.5.1:testCompile
(default-testCompile) on project hbase-server: Compilation failure
cause : Compilation failure
Stack trace : 
org.apache.maven.lifecycle.LifecycleExecutionException: Failed to execute goal org.apache.maven.plugins:maven-compiler-plugin:2.5.1:testCompile
(default-testCompile) on project hbase-server: Compilation failure
	at org.apache.maven.lifecycle.internal.MojoExecutor.execute(MojoExecutor.java:213)
	at org.apache.maven.lifecycle.internal.MojoExecutor.execute(MojoExecutor.java:153)
	at org.apache.maven.lifecycle.internal.MojoExecutor.execute(MojoExecutor.java:145)
	at org.apache.maven.lifecycle.internal.LifecycleModuleBuilder.buildProject(LifecycleModuleBuilder.java:84)
	at org.apache.maven.lifecycle.internal.LifecycleModuleBuilder.buildProject(LifecycleModuleBuilder.java:59)
	at org.apache.maven.lifecycle.internal.LifecycleStarter.singleThreadedBuild(LifecycleStarter.java:183)
	at org.apache.maven.lifecycle.internal.LifecycleStarter.execute(LifecycleStarter.java:161)
	at org.apache.maven.DefaultMaven.doExecute(DefaultMaven.java:320)
	at org.apache.maven.DefaultMaven.execute(DefaultMaven.java:156)
	at org.jvnet.hudson.maven3.launcher.Maven3Launcher.main(Maven3Launcher.java:79)
	at sun.reflect.NativeMethodAccessorImpl.invoke0(Native Method)
	at sun.reflect.NativeMethodAccessorImpl.invoke(NativeMethodAccessorImpl.java:39)
	at sun.reflect.DelegatingMethodAccessorImpl.invoke(DelegatingMethodAccessorImpl.java:25)
	at java.lang.reflect.Method.invoke(Method.java:597)
	at org.codehaus.plexus.classworlds.launcher.Launcher.launchStandard(Launcher.java:329)
	at org.codehaus.plexus.classworlds.launcher.Launcher.launch(Launcher.java:239)
	at org.jvnet.hudson.maven3.agent.Maven3Main.launch(Maven3Main.java:158)
	at hudson.maven.Maven3Builder.call(Maven3Builder.java:100)
	at hudson.maven.Maven3Builder.call(Maven3Builder.java:66)
	at hudson.remoting.UserRequest.perform(UserRequest.java:118)
	at hudson.remoting.UserRequest.perform(UserRequest.java:48)
	at hudson.remoting.Request$2.run(Request.java:326)
	at hudson.remoting.InterceptingExecutorService$1.call(InterceptingExecutorService.java:72)
	at java.util.concurrent.FutureTask$Sync.innerRun(FutureTask.java:303)
	at java.util.concurrent.FutureTask.run(FutureTask.java:138)
	at java.util.concurrent.ThreadPoolExecutor$Worker.runTask(ThreadPoolExecutor.java:895)
	at java.util.concurrent.ThreadPoolExecutor$Worker.run(ThreadPoolExecutor.java:918)
	at java.lang.Thread.run(Thread.java:662)
Caused by: org.apache.maven.plugin.CompilationFailureException: Compilation failure
	at org.apache.maven.plugin.AbstractCompilerMojo.execute(AbstractCompilerMojo.java:729)
	at org.apache.maven.plugin.TestCompilerMojo.execute(TestCompilerMojo.java:161)
	at org.apache.maven.plugin.DefaultBuildPluginManager.executeMojo(DefaultBuildPluginManager.java:101)
	at org.apache.maven.lifecycle.internal.MojoExecutor.execute(MojoExecutor.java:209)
	... 27 more
channel stopped
Performing Post build task...
Match found for :.* : True
Logical operation result is TRUE
Running script  :  ZOMBIE_TESTS_COUNT=`jps | grep surefirebooter | wc -l`
  if [[ $ZOMBIE_TESTS_COUNT != 0 ]] ; then
    ZOMBIE_TESTS_COUNT=`jps | grep surefirebooter | wc -l`
    if [[ $ZOMBIE_TESTS_COUNT != 0 ]] ; then
      echo "There are $ZOMBIE_TESTS_COUNT zombie tests, they should have been killed by surefire
but survived"
      echo "************ BEGIN zombies jstack extract"
      ZB_STACK=`jps | grep surefirebooter | cut -d ' ' -f 1 | xargs -n 1 jstack | grep ".test"
| grep "\.java"`
      jps | grep surefirebooter | cut -d ' ' -f 1 | xargs -n 1 jstack
      echo "************ END  zombies jstack extract"
      JIRA_COMMENT="$JIRA_COMMENT

     {color:red}-1 core zombie tests{color}.  There are ${ZOMBIE_TESTS_COUNT} zombie test(s):
${ZB_STACK}"
      BAD=1
      jps | grep surefirebooter | cut -d ' ' -f 1 | xargs kill -9
    else
      echo "We're ok: there is no zombie test, but some tests took some time to stop"
    fi
  else
    echo "We're ok: there is no zombie test"
  fi
[HBase-0.95] $ /bin/bash -xe /tmp/hudson6488953539790137226.sh
++ jps
++ grep surefirebooter
++ wc -l
+ ZOMBIE_TESTS_COUNT=0
+ [[ 0 != 0 ]]
+ echo 'We'\''re ok: there is no zombie test'
We're ok: there is no zombie test
POST BUILD TASK : SUCCESS
END OF POST BUILD TASK : 0

Mime
View raw message