hbase-builds mailing list archives

Site index · List index
Message view « Date » · « Thread »
Top « Date » · « Thread »
From Stack <st...@duboce.net>
Subject Re: Build failed in Jenkins: hbase-0.95 #332
Date Wed, 17 Jul 2013 22:44:43 GMT
This should be fixed now.


On Wed, Jul 17, 2013 at 3:35 PM, Apache Jenkins Server <
jenkins@builds.apache.org> wrote:

> See <https://builds.apache.org/job/hbase-0.95/332/changes>
>
> Changes:
>
> [larsgeorge] HBASE-8779 Add mutateRow method support to Thrift2 (Hamed
> Madani)
>
> [larsgeorge] HBASE-8779 Add mutateRow method support to Thrift2 (Hamed
> Madani)
>
> [stack] HBASE-8939 Hanging unit tests; DEBUG
>
> ------------------------------------------
> [...truncated 3763 lines...]
> Tests run: 1, Failures: 0, Errors: 0, Skipped: 0, Time elapsed: 5.224 sec
> Running
> org.apache.hadoop.hbase.replication.TestReplicationQueueFailoverCompressed
> Tests run: 1, Failures: 0, Errors: 0, Skipped: 0, Time elapsed: 69.549 sec
> Running
> org.apache.hadoop.hbase.replication.regionserver.TestReplicationSink
> Tests run: 5, Failures: 0, Errors: 0, Skipped: 0, Time elapsed: 16.73 sec
> Running
> org.apache.hadoop.hbase.replication.regionserver.TestReplicationSourceManager
> Tests run: 3, Failures: 0, Errors: 0, Skipped: 0, Time elapsed: 2.433 sec
> Running org.apache.hadoop.hbase.replication.TestReplicationSmallTests
> Tests run: 7, Failures: 0, Errors: 0, Skipped: 0, Time elapsed: 81.404 sec
> Running
> org.apache.hadoop.hbase.replication.TestReplicationDisableInactivePeer
> Tests run: 1, Failures: 0, Errors: 0, Skipped: 0, Time elapsed: 64.003 sec
> Running org.apache.hadoop.hbase.replication.TestMultiSlaveReplication
> Tests run: 1, Failures: 0, Errors: 0, Skipped: 0, Time elapsed: 41.351 sec
> Running org.apache.hadoop.hbase.replication.TestReplicationStateZKImpl
> Tests run: 3, Failures: 0, Errors: 0, Skipped: 0, Time elapsed: 5.147 sec
> Running org.apache.hadoop.hbase.replication.TestReplicationQueueFailover
> Tests run: 1, Failures: 0, Errors: 0, Skipped: 0, Time elapsed: 74.071 sec
> Running org.apache.hadoop.hbase.TestMultiVersions
> Tests run: 3, Failures: 0, Errors: 0, Skipped: 0, Time elapsed: 22.274 sec
> Running org.apache.hadoop.hbase.catalog.TestMetaReaderEditorNoCluster
> Tests run: 2, Failures: 0, Errors: 0, Skipped: 0, Time elapsed: 2.868 sec
> Running org.apache.hadoop.hbase.TestHBaseTestingUtility
> Tests run: 7, Failures: 0, Errors: 0, Skipped: 0, Time elapsed: 80.926 sec
> Running org.apache.hadoop.hbase.catalog.TestMetaReaderEditor
> Tests run: 5, Failures: 0, Errors: 0, Skipped: 0, Time elapsed: 23.529 sec
> Running org.apache.hadoop.hbase.catalog.TestCatalogTracker
> Tests run: 7, Failures: 0, Errors: 0, Skipped: 0, Time elapsed: 2.02 sec
> Running org.apache.hadoop.hbase.coprocessor.TestRowProcessorEndpoint
> Tests run: 4, Failures: 0, Errors: 0, Skipped: 0, Time elapsed: 26.918 sec
> Running org.apache.hadoop.hbase.catalog.TestMetaMigrationConvertingToPB
> Tests run: 3, Failures: 0, Errors: 0, Skipped: 0, Time elapsed: 54.5 sec
> Running org.apache.hadoop.hbase.coprocessor.TestMasterObserver
> Tests run: 5, Failures: 0, Errors: 0, Skipped: 0, Time elapsed: 32.089 sec
> Running org.apache.hadoop.hbase.coprocessor.TestCoprocessorEndpoint
> Tests run: 6, Failures: 0, Errors: 0, Skipped: 0, Time elapsed: 15.228 sec
> Running org.apache.hadoop.hbase.coprocessor.TestOpenTableInCoprocessor
> Tests run: 1, Failures: 0, Errors: 0, Skipped: 0, Time elapsed: 31.347 sec
> Running org.apache.hadoop.hbase.coprocessor.TestClassLoading
> Tests run: 8, Failures: 0, Errors: 0, Skipped: 0, Time elapsed: 33.764 sec
> Running
> org.apache.hadoop.hbase.coprocessor.TestRegionObserverScannerOpenHook
> Tests run: 1, Failures: 0, Errors: 0, Skipped: 0, Time elapsed: 14.983 sec
> Running org.apache.hadoop.hbase.coprocessor.TestRegionObserverInterface
> Tests run: 7, Failures: 0, Errors: 0, Skipped: 0, Time elapsed: 38.112 sec
> Running
> org.apache.hadoop.hbase.coprocessor.TestMasterCoprocessorExceptionWithRemove
> Tests run: 1, Failures: 0, Errors: 0, Skipped: 0, Time elapsed: 17.808 sec
> Running
> org.apache.hadoop.hbase.coprocessor.TestRegionServerCoprocessorExceptionWithRemove
> Tests run: 1, Failures: 0, Errors: 0, Skipped: 0, Time elapsed: 21.798 sec
> Running
> org.apache.hadoop.hbase.coprocessor.TestMasterCoprocessorExceptionWithAbort
> Tests run: 1, Failures: 0, Errors: 0, Skipped: 0, Time elapsed: 27.578 sec
> Running org.apache.hadoop.hbase.coprocessor.TestWALObserver
> Tests run: 3, Failures: 0, Errors: 0, Skipped: 0, Time elapsed: 22.368 sec
> Running
> org.apache.hadoop.hbase.coprocessor.TestRegionServerCoprocessorExceptionWithAbort
> Tests run: 1, Failures: 0, Errors: 0, Skipped: 0, Time elapsed: 18.754 sec
> Running org.apache.hadoop.hbase.coprocessor.TestRegionObserverBypass
> Tests run: 2, Failures: 0, Errors: 0, Skipped: 0, Time elapsed: 20.245 sec
> Running org.apache.hadoop.hbase.thrift2.TestThriftHBaseServiceHandler
> Tests run: 17, Failures: 0, Errors: 0, Skipped: 0, Time elapsed: 16.321 sec
> Running org.apache.hadoop.hbase.thrift.TestThriftServerCmdLine
> Tests run: 32, Failures: 0, Errors: 0, Skipped: 0, Time elapsed: 62.77 sec
> Running org.apache.hadoop.hbase.TestIOFencing
> Tests run: 2, Failures: 0, Errors: 0, Skipped: 0, Time elapsed: 96.064 sec
> Running org.apache.hadoop.hbase.trace.TestHTraceHooks
> Tests run: 1, Failures: 0, Errors: 0, Skipped: 0, Time elapsed: 16.907 sec
> Running org.apache.hadoop.hbase.procedure.TestZKProcedure
> Tests run: 4, Failures: 0, Errors: 0, Skipped: 0, Time elapsed: 4.664 sec
> Running org.apache.hadoop.hbase.procedure.TestZKProcedureControllers
> Tests run: 4, Failures: 0, Errors: 0, Skipped: 0, Time elapsed: 3.835 sec
> Running org.apache.hadoop.hbase.thrift.TestThriftServer
> Tests run: 1, Failures: 0, Errors: 0, Skipped: 0, Time elapsed: 75.13 sec
> Running org.apache.hadoop.hbase.regionserver.TestHRegionOnCluster
> Tests run: 1, Failures: 0, Errors: 0, Skipped: 0, Time elapsed: 21.932 sec
> Running org.apache.hadoop.hbase.regionserver.TestRegionServerNoMaster
> Tests run: 8, Failures: 0, Errors: 0, Skipped: 0, Time elapsed: 36.263 sec
> Running org.apache.hadoop.hbase.regionserver.TestMemStore
> Tests run: 24, Failures: 0, Errors: 0, Skipped: 0, Time elapsed: 36.86 sec
> Running org.apache.hadoop.hbase.regionserver.TestMasterAddressManager
> Tests run: 1, Failures: 0, Errors: 0, Skipped: 0, Time elapsed: 2.015 sec
> Running org.apache.hadoop.hbase.regionserver.TestRegionServerMetrics
> Tests run: 9, Failures: 0, Errors: 0, Skipped: 0, Time elapsed: 39.386 sec
> Running org.apache.hadoop.hbase.regionserver.TestHRegion
> Tests run: 64, Failures: 0, Errors: 0, Skipped: 0, Time elapsed: 65.851 sec
> Running org.apache.hadoop.hbase.regionserver.TestCompoundBloomFilter
> Tests run: 3, Failures: 0, Errors: 0, Skipped: 0, Time elapsed: 20.189 sec
> Running org.apache.hadoop.hbase.regionserver.TestCompactionWithCoprocessor
> Tests run: 18, Failures: 0, Errors: 0, Skipped: 0, Time elapsed: 42.434 sec
> Running org.apache.hadoop.hbase.regionserver.TestSplitLogWorker
> Tests run: 5, Failures: 0, Errors: 0, Skipped: 0, Time elapsed: 6.237 sec
> Running org.apache.hadoop.hbase.regionserver.TestServerCustomProtocol
> Tests run: 7, Failures: 0, Errors: 0, Skipped: 0, Time elapsed: 54.04 sec
> Running org.apache.hadoop.hbase.regionserver.TestHRegionBusyWait
> Tests run: 65, Failures: 0, Errors: 0, Skipped: 0, Time elapsed: 66.935 sec
> Running org.apache.hadoop.hbase.regionserver.TestStoreFileBlockCacheSummary
> Tests run: 1, Failures: 0, Errors: 0, Skipped: 0, Time elapsed: 16.515 sec
> Running org.apache.hadoop.hbase.regionserver.TestStore
> Tests run: 15, Failures: 0, Errors: 0, Skipped: 0, Time elapsed: 12.277 sec
> Running org.apache.hadoop.hbase.regionserver.TestAtomicOperation
> Tests run: 6, Failures: 0, Errors: 0, Skipped: 0, Time elapsed: 29.428 sec
> Running org.apache.hadoop.hbase.regionserver.TestClusterId
> Tests run: 1, Failures: 0, Errors: 0, Skipped: 0, Time elapsed: 30.364 sec
> Running
> org.apache.hadoop.hbase.regionserver.TestRegionMergeTransactionOnCluster
> Tests run: 2, Failures: 0, Errors: 0, Skipped: 0, Time elapsed: 28.559 sec
> Running org.apache.hadoop.hbase.regionserver.TestBlocksRead
> Tests run: 4, Failures: 0, Errors: 0, Skipped: 0, Time elapsed: 1.578 sec
> Running org.apache.hadoop.hbase.regionserver.TestFSErrorsExposed
> Tests run: 3, Failures: 0, Errors: 0, Skipped: 0, Time elapsed: 26.569 sec
> Running org.apache.hadoop.hbase.regionserver.TestJoinedScanners
> Tests run: 1, Failures: 0, Errors: 0, Skipped: 0, Time elapsed: 45.706 sec
> Running org.apache.hadoop.hbase.regionserver.TestCompactionState
> Tests run: 5, Failures: 0, Errors: 0, Skipped: 0, Time elapsed: 110.484 sec
> Running org.apache.hadoop.hbase.regionserver.TestSeekOptimizations
> Tests run: 6, Failures: 0, Errors: 0, Skipped: 0, Time elapsed: 3.143 sec
> Running org.apache.hadoop.hbase.regionserver.handler.TestOpenRegionHandler
> Tests run: 5, Failures: 0, Errors: 0, Skipped: 0, Time elapsed: 2.218 sec
> Running org.apache.hadoop.hbase.regionserver.handler.TestCloseRegionHandler
> Tests run: 3, Failures: 0, Errors: 0, Skipped: 0, Time elapsed: 2.476 sec
> Running org.apache.hadoop.hbase.regionserver.TestHRegionServerBulkLoad
> Tests run: 1, Failures: 0, Errors: 0, Skipped: 0, Time elapsed: 46.39 sec
> Running org.apache.hadoop.hbase.regionserver.TestGetClosestAtOrBefore
> Tests run: 3, Failures: 0, Errors: 0, Skipped: 0, Time elapsed: 1.445 sec
> Running org.apache.hadoop.hbase.regionserver.TestParallelPut
> Tests run: 2, Failures: 0, Errors: 0, Skipped: 0, Time elapsed: 4.979 sec
> Running org.apache.hadoop.hbase.regionserver.TestCacheOnWriteInSchema
> Tests run: 3, Failures: 0, Errors: 0, Skipped: 0, Time elapsed: 2.052 sec
> Running org.apache.hadoop.hbase.regionserver.TestPriorityRpc
> Tests run: 3, Failures: 0, Errors: 0, Skipped: 0, Time elapsed: 1.508 sec
> Running org.apache.hadoop.hbase.regionserver.TestSplitTransactionOnCluster
> Tests run: 9, Failures: 0, Errors: 0, Skipped: 0, Time elapsed: 65.679 sec
> Running org.apache.hadoop.hbase.regionserver.wal.TestLogRollAbort
> Tests run: 1, Failures: 0, Errors: 0, Skipped: 0, Time elapsed: 253.214 sec
> Running org.apache.hadoop.hbase.regionserver.wal.TestHLog
> Tests run: 13, Failures: 0, Errors: 0, Skipped: 0, Time elapsed: 74.242 sec
> Running org.apache.hadoop.hbase.regionserver.wal.TestLogRolling
> Tests run: 4, Failures: 0, Errors: 0, Skipped: 0, Time elapsed: 341.7 sec
> Running org.apache.hadoop.hbase.regionserver.wal.TestHLogSplit
> Tests run: 35, Failures: 0, Errors: 0, Skipped: 1, Time elapsed: 185.555
> sec
> Running org.apache.hadoop.hbase.regionserver.wal.TestHLogSplitCompressed
> Tests run: 35, Failures: 0, Errors: 0, Skipped: 1, Time elapsed: 185.943
> sec
> Running org.apache.hadoop.hbase.regionserver.wal.TestWALReplay
> Tests run: 8, Failures: 0, Errors: 0, Skipped: 0, Time elapsed: 90.134 sec
> Running org.apache.hadoop.hbase.regionserver.wal.TestWALReplayCompressed
> Tests run: 8, Failures: 0, Errors: 0, Skipped: 0, Time elapsed: 100.406 sec
> Running org.apache.hadoop.hbase.regionserver.wal.TestDurability
> Tests run: 1, Failures: 0, Errors: 0, Skipped: 0, Time elapsed: 7.552 sec
> Running org.apache.hadoop.hbase.regionserver.TestStoreScanner
> Tests run: 16, Failures: 0, Errors: 0, Skipped: 0, Time elapsed: 0.706 sec
> Running org.apache.hadoop.hbase.regionserver.TestRegionFavoredNodes
> Tests run: 1, Failures: 0, Errors: 0, Skipped: 1, Time elapsed: 0.468 sec
> Running org.apache.hadoop.hbase.regionserver.wal.TestHLogFiltering
> Tests run: 1, Failures: 0, Errors: 0, Skipped: 0, Time elapsed: 39.278 sec
> Running org.apache.hadoop.hbase.regionserver.TestCompaction
> Tests run: 18, Failures: 0, Errors: 0, Skipped: 0, Time elapsed: 40.453 sec
> Running org.apache.hadoop.hbase.regionserver.TestEndToEndSplitTransaction
> Tests run: 2, Failures: 0, Errors: 0, Skipped: 0, Time elapsed: 56.844 sec
> Running org.apache.hadoop.hbase.regionserver.TestMultiColumnScanner
> Tests run: 12, Failures: 0, Errors: 0, Skipped: 0, Time elapsed: 29.86 sec
> Running org.apache.hadoop.hbase.mapred.TestTableInputFormat
> Tests run: 10, Failures: 0, Errors: 0, Skipped: 0, Time elapsed: 36.856 sec
> Running org.apache.hadoop.hbase.fs.TestBlockReorder
> Tests run: 3, Failures: 0, Errors: 0, Skipped: 0, Time elapsed: 59.556 sec
> Running org.apache.hadoop.hbase.mapred.TestTableMapReduce
> Tests run: 1, Failures: 0, Errors: 0, Skipped: 0, Time elapsed: 221.483 sec
> Running
> org.apache.hadoop.hbase.backup.example.TestZooKeeperTableArchiveClient
> Tests run: 3, Failures: 0, Errors: 0, Skipped: 0, Time elapsed: 8.263 sec
> Running org.apache.hadoop.hbase.TestClusterBootOrder
> Tests run: 2, Failures: 0, Errors: 0, Skipped: 0, Time elapsed: 42.509 sec
> Running org.apache.hadoop.hbase.TestDrainingServer
> Tests run: 2, Failures: 1, Errors: 0, Skipped: 0, Time elapsed: 32.747 sec
> <<< FAILURE!
> Running org.apache.hadoop.hbase.backup.TestHFileArchiving
> Tests run: 5, Failures: 0, Errors: 0, Skipped: 0, Time elapsed: 262.816 sec
> Running org.apache.hadoop.hbase.mapreduce.TestTimeRangeMapRed
> Tests run: 1, Failures: 0, Errors: 0, Skipped: 0, Time elapsed: 121.619 sec
> Running org.apache.hadoop.hbase.mapreduce.TestRowCounter
> Tests run: 3, Failures: 0, Errors: 0, Skipped: 0, Time elapsed: 106.548 sec
> Running org.apache.hadoop.hbase.mapreduce.TestMultiTableInputFormat
> Tests run: 5, Failures: 0, Errors: 0, Skipped: 0, Time elapsed: 453.844 sec
> Running org.apache.hadoop.hbase.mapreduce.TestCopyTable
> Tests run: 2, Failures: 0, Errors: 0, Skipped: 0, Time elapsed: 225.277 sec
> Running org.apache.hadoop.hbase.mapreduce.TestSecureLoadIncrementalHFiles
> Tests run: 7, Failures: 0, Errors: 0, Skipped: 0, Time elapsed: 66.736 sec
> Running org.apache.hadoop.hbase.mapreduce.TestHFileOutputFormat
> Tests run: 10, Failures: 0, Errors: 0, Skipped: 0, Time elapsed: 728.842
> sec
> Running org.apache.hadoop.hbase.mapreduce.TestTableInputFormatScan1
> Tests run: 5, Failures: 0, Errors: 0, Skipped: 0, Time elapsed: 298.927 sec
> Running org.apache.hadoop.hbase.mapreduce.TestImportTsv
> Tests run: 5, Failures: 0, Errors: 0, Skipped: 0, Time elapsed: 327.434 sec
> Running org.apache.hadoop.hbase.mapreduce.TestImportExport
> Tests run: 5, Failures: 0, Errors: 0, Skipped: 0, Time elapsed: 449.225 sec
> Running org.apache.hadoop.hbase.mapreduce.TestWALPlayer
> Tests run: 1, Failures: 0, Errors: 0, Skipped: 0, Time elapsed: 120.533 sec
> Running org.apache.hadoop.hbase.mapreduce.TestTableInputFormatScan2
> Tests run: 7, Failures: 0, Errors: 0, Skipped: 0, Time elapsed: 338.281 sec
> Running org.apache.hadoop.hbase.mapreduce.TestMultithreadedTableMapper
> Tests run: 1, Failures: 0, Errors: 0, Skipped: 0, Time elapsed: 225.899 sec
> Running
> org.apache.hadoop.hbase.mapreduce.TestSecureLoadIncrementalHFilesSplitRecovery
> Tests run: 4, Failures: 0, Errors: 0, Skipped: 0, Time elapsed: 55.653 sec
> Running
> org.apache.hadoop.hbase.mapreduce.TestLoadIncrementalHFilesSplitRecovery
> Tests run: 4, Failures: 0, Errors: 0, Skipped: 0, Time elapsed: 367.331 sec
> Running org.apache.hadoop.hbase.mapreduce.TestLoadIncrementalHFiles
> Tests run: 7, Failures: 0, Errors: 0, Skipped: 0, Time elapsed: 28.921 sec
> Running org.apache.hadoop.hbase.mapreduce.TestHLogRecordReader
> Tests run: 2, Failures: 0, Errors: 0, Skipped: 0, Time elapsed: 9.059 sec
> Running org.apache.hadoop.hbase.mapreduce.TestTableMapReduce
> Tests run: 2, Failures: 0, Errors: 0, Skipped: 0, Time elapsed: 224.962 sec
>
> Results :
>
> Failed tests:
> testDrainingServerWithAbort(org.apache.hadoop.hbase.TestDrainingServer):
> Test conditions are not met: regions were created/deleted during the test.
>  expected:<11> but was:<4>
>
> Tests run: 1504, Failures: 1, Errors: 0, Skipped: 14
>
> [INFO]
> ------------------------------------------------------------------------
> [INFO] Reactor Summary:
> [INFO]
> [INFO] HBase ............................................. SUCCESS
> [14.490s]
> [INFO] HBase - Common .................................... SUCCESS
> [22.594s]
> [INFO] HBase - Protocol .................................. SUCCESS [7.757s]
> [INFO] HBase - Client .................................... SUCCESS
> [21.451s]
> [INFO] HBase - Prefix Tree ............................... SUCCESS [3.306s]
> [INFO] HBase - Hadoop Compatibility ...................... SUCCESS [5.408s]
> [INFO] HBase - Hadoop One Compatibility .................. SUCCESS [2.333s]
> [INFO] HBase - Server .................................... FAILURE
> [2:08:20.585s]
> [INFO] HBase - Integration Tests ......................... SKIPPED
> [INFO] HBase - Examples .................................. SKIPPED
> [INFO] HBase - Assembly .................................. SKIPPED
> [INFO]
> ------------------------------------------------------------------------
> [INFO] BUILD FAILURE
> [INFO]
> ------------------------------------------------------------------------
> [INFO] Total time: 2:09:38.600s
> [INFO] Finished at: Wed Jul 17 22:34:38 UTC 2013
> [INFO] Final Memory: 34M/840M
> [INFO]
> ------------------------------------------------------------------------
> [ERROR] Failed to execute goal
> org.apache.maven.plugins:maven-surefire-plugin:2.12-TRUNK-HBASE-2:test
> (secondPartTestsExecution) on project hbase-server: There are test failures.
> [ERROR]
> [ERROR] Please refer to <
> https://builds.apache.org/job/hbase-0.95/ws/0.95/hbase-server/target/surefire-reports>
> for the individual test results.
> [ERROR] -> [Help 1]
> [ERROR]
> [ERROR] To see the full stack trace of the errors, re-run Maven with the
> -e switch.
> [ERROR] Re-run Maven using the -X switch to enable full debug logging.
> [ERROR]
> [ERROR] For more information about the errors and possible solutions,
> please read the following articles:
> [ERROR] [Help 1]
> http://cwiki.apache.org/confluence/display/MAVEN/MojoFailureException
> [ERROR]
> [ERROR] After correcting the problems, you can resume the build with the
> command
> [ERROR]   mvn <goals> -rf :hbase-server
> Build step 'Invoke top-level Maven targets' marked build as failure
> Archiving artifacts
> Recording test results
> Updating HBASE-8939
> Updating HBASE-8779
>

Mime
  • Unnamed multipart/alternative (inline, None, 0 bytes)
View raw message