hbase-builds mailing list archives

Site index · List index
Message view « Date » · « Thread »
Top « Date » · « Thread »
From Apache Jenkins Server <jenk...@builds.apache.org>
Subject Build failed in Jenkins: hbase-0.95-on-hadoop2 #179
Date Mon, 15 Jul 2013 12:21:58 GMT
See <https://builds.apache.org/job/hbase-0.95-on-hadoop2/179/changes>

Changes:

[stack] HBASE-8941 TestAccessController.testGlobalPermissionList failed with IndexOutOfBoundsException

------------------------------------------
[...truncated 24151 lines...]
Tests run: 18, Failures: 0, Errors: 0, Skipped: 0, Time elapsed: 55.223 sec
Forking command line: /bin/sh -c cd <https://builds.apache.org/job/hbase-0.95-on-hadoop2/ws/0.95-on-hadoop2/hbase-server> && /home/jenkins/tools/java/jdk1.6.0_45-32/jre/bin/java -enableassertions -Xmx1900m -XX:MaxPermSize=100m -Djava.security.egd=file:/dev/./urandom -Djava.net.preferIPv4Stack=true -jar <https://builds.apache.org/job/hbase-0.95-on-hadoop2/ws/0.95-on-hadoop2/hbase-server/target/surefire/surefirebooter4683776344412419862.jar> <https://builds.apache.org/job/hbase-0.95-on-hadoop2/ws/0.95-on-hadoop2/hbase-server/target/surefire/surefire1357800979987393913tmp> <https://builds.apache.org/job/hbase-0.95-on-hadoop2/ws/0.95-on-hadoop2/hbase-server/target/surefire/surefire_1898594020180028569854tmp>
Running org.apache.hadoop.hbase.master.TestDistributedLogSplitting
Tests run: 14, Failures: 0, Errors: 0, Skipped: 0, Time elapsed: 685.942 sec
Forking command line: /bin/sh -c cd <https://builds.apache.org/job/hbase-0.95-on-hadoop2/ws/0.95-on-hadoop2/hbase-server> && /home/jenkins/tools/java/jdk1.6.0_45-32/jre/bin/java -enableassertions -Xmx1900m -XX:MaxPermSize=100m -Djava.security.egd=file:/dev/./urandom -Djava.net.preferIPv4Stack=true -jar <https://builds.apache.org/job/hbase-0.95-on-hadoop2/ws/0.95-on-hadoop2/hbase-server/target/surefire/surefirebooter5646297747423968620.jar> <https://builds.apache.org/job/hbase-0.95-on-hadoop2/ws/0.95-on-hadoop2/hbase-server/target/surefire/surefire5177920402658182436tmp> <https://builds.apache.org/job/hbase-0.95-on-hadoop2/ws/0.95-on-hadoop2/hbase-server/target/surefire/surefire_1904331538239797753351tmp>
Running org.apache.hadoop.hbase.regionserver.TestStoreFileBlockCacheSummary
Tests run: 1, Failures: 0, Errors: 0, Skipped: 0, Time elapsed: 16.583 sec
Forking command line: /bin/sh -c cd <https://builds.apache.org/job/hbase-0.95-on-hadoop2/ws/0.95-on-hadoop2/hbase-server> && /home/jenkins/tools/java/jdk1.6.0_45-32/jre/bin/java -enableassertions -Xmx1900m -XX:MaxPermSize=100m -Djava.security.egd=file:/dev/./urandom -Djava.net.preferIPv4Stack=true -jar <https://builds.apache.org/job/hbase-0.95-on-hadoop2/ws/0.95-on-hadoop2/hbase-server/target/surefire/surefirebooter462564881608506512.jar> <https://builds.apache.org/job/hbase-0.95-on-hadoop2/ws/0.95-on-hadoop2/hbase-server/target/surefire/surefire5341197684689726381tmp> <https://builds.apache.org/job/hbase-0.95-on-hadoop2/ws/0.95-on-hadoop2/hbase-server/target/surefire/surefire_1913518898882551572628tmp>
Running org.apache.hadoop.hbase.regionserver.TestHRegionBusyWait
Tests run: 65, Failures: 0, Errors: 0, Skipped: 0, Time elapsed: 53.444 sec
Forking command line: /bin/sh -c cd <https://builds.apache.org/job/hbase-0.95-on-hadoop2/ws/0.95-on-hadoop2/hbase-server> && /home/jenkins/tools/java/jdk1.6.0_45-32/jre/bin/java -enableassertions -Xmx1900m -XX:MaxPermSize=100m -Djava.security.egd=file:/dev/./urandom -Djava.net.preferIPv4Stack=true -jar <https://builds.apache.org/job/hbase-0.95-on-hadoop2/ws/0.95-on-hadoop2/hbase-server/target/surefire/surefirebooter1896971063228344972.jar> <https://builds.apache.org/job/hbase-0.95-on-hadoop2/ws/0.95-on-hadoop2/hbase-server/target/surefire/surefire8295763488250322941tmp> <https://builds.apache.org/job/hbase-0.95-on-hadoop2/ws/0.95-on-hadoop2/hbase-server/target/surefire/surefire_1922025923412553982762tmp>
Running org.apache.hadoop.hbase.regionserver.TestStore
Tests run: 15, Failures: 0, Errors: 0, Skipped: 0, Time elapsed: 14.941 sec
Forking command line: /bin/sh -c cd <https://builds.apache.org/job/hbase-0.95-on-hadoop2/ws/0.95-on-hadoop2/hbase-server> && /home/jenkins/tools/java/jdk1.6.0_45-32/jre/bin/java -enableassertions -Xmx1900m -XX:MaxPermSize=100m -Djava.security.egd=file:/dev/./urandom -Djava.net.preferIPv4Stack=true -jar <https://builds.apache.org/job/hbase-0.95-on-hadoop2/ws/0.95-on-hadoop2/hbase-server/target/surefire/surefirebooter370897402286867416.jar> <https://builds.apache.org/job/hbase-0.95-on-hadoop2/ws/0.95-on-hadoop2/hbase-server/target/surefire/surefire8909174837902809188tmp> <https://builds.apache.org/job/hbase-0.95-on-hadoop2/ws/0.95-on-hadoop2/hbase-server/target/surefire/surefire_1934984910858321639680tmp>
Running org.apache.hadoop.hbase.regionserver.TestServerCustomProtocol
Tests run: 7, Failures: 0, Errors: 0, Skipped: 0, Time elapsed: 48.661 sec
Forking command line: /bin/sh -c cd <https://builds.apache.org/job/hbase-0.95-on-hadoop2/ws/0.95-on-hadoop2/hbase-server> && /home/jenkins/tools/java/jdk1.6.0_45-32/jre/bin/java -enableassertions -Xmx1900m -XX:MaxPermSize=100m -Djava.security.egd=file:/dev/./urandom -Djava.net.preferIPv4Stack=true -jar <https://builds.apache.org/job/hbase-0.95-on-hadoop2/ws/0.95-on-hadoop2/hbase-server/target/surefire/surefirebooter7152527911734017899.jar> <https://builds.apache.org/job/hbase-0.95-on-hadoop2/ws/0.95-on-hadoop2/hbase-server/target/surefire/surefire5088333207646601715tmp> <https://builds.apache.org/job/hbase-0.95-on-hadoop2/ws/0.95-on-hadoop2/hbase-server/target/surefire/surefire_1945854651499652698505tmp>
Running org.apache.hadoop.hbase.regionserver.TestAtomicOperation
Tests run: 6, Failures: 0, Errors: 0, Skipped: 0, Time elapsed: 38.896 sec
Forking command line: /bin/sh -c cd <https://builds.apache.org/job/hbase-0.95-on-hadoop2/ws/0.95-on-hadoop2/hbase-server> && /home/jenkins/tools/java/jdk1.6.0_45-32/jre/bin/java -enableassertions -Xmx1900m -XX:MaxPermSize=100m -Djava.security.egd=file:/dev/./urandom -Djava.net.preferIPv4Stack=true -jar <https://builds.apache.org/job/hbase-0.95-on-hadoop2/ws/0.95-on-hadoop2/hbase-server/target/surefire/surefirebooter8907367309566953754.jar> <https://builds.apache.org/job/hbase-0.95-on-hadoop2/ws/0.95-on-hadoop2/hbase-server/target/surefire/surefire1372696180113825160tmp> <https://builds.apache.org/job/hbase-0.95-on-hadoop2/ws/0.95-on-hadoop2/hbase-server/target/surefire/surefire_1952526075751972545032tmp>
Running org.apache.hadoop.hbase.regionserver.TestBlocksRead
Tests run: 4, Failures: 0, Errors: 0, Skipped: 0, Time elapsed: 2.491 sec
Forking command line: /bin/sh -c cd <https://builds.apache.org/job/hbase-0.95-on-hadoop2/ws/0.95-on-hadoop2/hbase-server> && /home/jenkins/tools/java/jdk1.6.0_45-32/jre/bin/java -enableassertions -Xmx1900m -XX:MaxPermSize=100m -Djava.security.egd=file:/dev/./urandom -Djava.net.preferIPv4Stack=true -jar <https://builds.apache.org/job/hbase-0.95-on-hadoop2/ws/0.95-on-hadoop2/hbase-server/target/surefire/surefirebooter2073638208461209963.jar> <https://builds.apache.org/job/hbase-0.95-on-hadoop2/ws/0.95-on-hadoop2/hbase-server/target/surefire/surefire8552513272775705010tmp> <https://builds.apache.org/job/hbase-0.95-on-hadoop2/ws/0.95-on-hadoop2/hbase-server/target/surefire/surefire_196242932383897074763tmp>
Running org.apache.hadoop.hbase.regionserver.TestFSErrorsExposed
Tests run: 3, Failures: 0, Errors: 0, Skipped: 1, Time elapsed: 1.203 sec
Forking command line: /bin/sh -c cd <https://builds.apache.org/job/hbase-0.95-on-hadoop2/ws/0.95-on-hadoop2/hbase-server> && /home/jenkins/tools/java/jdk1.6.0_45-32/jre/bin/java -enableassertions -Xmx1900m -XX:MaxPermSize=100m -Djava.security.egd=file:/dev/./urandom -Djava.net.preferIPv4Stack=true -jar <https://builds.apache.org/job/hbase-0.95-on-hadoop2/ws/0.95-on-hadoop2/hbase-server/target/surefire/surefirebooter685551632813608590.jar> <https://builds.apache.org/job/hbase-0.95-on-hadoop2/ws/0.95-on-hadoop2/hbase-server/target/surefire/surefire2433753288306919315tmp> <https://builds.apache.org/job/hbase-0.95-on-hadoop2/ws/0.95-on-hadoop2/hbase-server/target/surefire/surefire_1973150722471172050135tmp>
Running org.apache.hadoop.hbase.regionserver.TestClusterId
Tests run: 1, Failures: 0, Errors: 0, Skipped: 0, Time elapsed: 37.148 sec
Forking command line: /bin/sh -c cd <https://builds.apache.org/job/hbase-0.95-on-hadoop2/ws/0.95-on-hadoop2/hbase-server> && /home/jenkins/tools/java/jdk1.6.0_45-32/jre/bin/java -enableassertions -Xmx1900m -XX:MaxPermSize=100m -Djava.security.egd=file:/dev/./urandom -Djava.net.preferIPv4Stack=true -jar <https://builds.apache.org/job/hbase-0.95-on-hadoop2/ws/0.95-on-hadoop2/hbase-server/target/surefire/surefirebooter217945607464502912.jar> <https://builds.apache.org/job/hbase-0.95-on-hadoop2/ws/0.95-on-hadoop2/hbase-server/target/surefire/surefire6816585359858905571tmp> <https://builds.apache.org/job/hbase-0.95-on-hadoop2/ws/0.95-on-hadoop2/hbase-server/target/surefire/surefire_1982462531669823841523tmp>
Running org.apache.hadoop.hbase.regionserver.TestSeekOptimizations
Tests run: 6, Failures: 0, Errors: 0, Skipped: 0, Time elapsed: 4.142 sec
Forking command line: /bin/sh -c cd <https://builds.apache.org/job/hbase-0.95-on-hadoop2/ws/0.95-on-hadoop2/hbase-server> && /home/jenkins/tools/java/jdk1.6.0_45-32/jre/bin/java -enableassertions -Xmx1900m -XX:MaxPermSize=100m -Djava.security.egd=file:/dev/./urandom -Djava.net.preferIPv4Stack=true -jar <https://builds.apache.org/job/hbase-0.95-on-hadoop2/ws/0.95-on-hadoop2/hbase-server/target/surefire/surefirebooter9068849011685999062.jar> <https://builds.apache.org/job/hbase-0.95-on-hadoop2/ws/0.95-on-hadoop2/hbase-server/target/surefire/surefire6798060240593869037tmp> <https://builds.apache.org/job/hbase-0.95-on-hadoop2/ws/0.95-on-hadoop2/hbase-server/target/surefire/surefire_1993072745456621516765tmp>
Running org.apache.hadoop.hbase.regionserver.handler.TestCloseRegionHandler
Tests run: 3, Failures: 0, Errors: 0, Skipped: 0, Time elapsed: 4.055 sec
Forking command line: /bin/sh -c cd <https://builds.apache.org/job/hbase-0.95-on-hadoop2/ws/0.95-on-hadoop2/hbase-server> && /home/jenkins/tools/java/jdk1.6.0_45-32/jre/bin/java -enableassertions -Xmx1900m -XX:MaxPermSize=100m -Djava.security.egd=file:/dev/./urandom -Djava.net.preferIPv4Stack=true -jar <https://builds.apache.org/job/hbase-0.95-on-hadoop2/ws/0.95-on-hadoop2/hbase-server/target/surefire/surefirebooter2014851815320160460.jar> <https://builds.apache.org/job/hbase-0.95-on-hadoop2/ws/0.95-on-hadoop2/hbase-server/target/surefire/surefire3108125018178650857tmp> <https://builds.apache.org/job/hbase-0.95-on-hadoop2/ws/0.95-on-hadoop2/hbase-server/target/surefire/surefire_2005001112629307938990tmp>
Running org.apache.hadoop.hbase.regionserver.handler.TestOpenRegionHandler
Tests run: 5, Failures: 0, Errors: 0, Skipped: 0, Time elapsed: 3.721 sec
Forking command line: /bin/sh -c cd <https://builds.apache.org/job/hbase-0.95-on-hadoop2/ws/0.95-on-hadoop2/hbase-server> && /home/jenkins/tools/java/jdk1.6.0_45-32/jre/bin/java -enableassertions -Xmx1900m -XX:MaxPermSize=100m -Djava.security.egd=file:/dev/./urandom -Djava.net.preferIPv4Stack=true -jar <https://builds.apache.org/job/hbase-0.95-on-hadoop2/ws/0.95-on-hadoop2/hbase-server/target/surefire/surefirebooter765220007696472831.jar> <https://builds.apache.org/job/hbase-0.95-on-hadoop2/ws/0.95-on-hadoop2/hbase-server/target/surefire/surefire5898961413548786544tmp> <https://builds.apache.org/job/hbase-0.95-on-hadoop2/ws/0.95-on-hadoop2/hbase-server/target/surefire/surefire_2012752633469037220234tmp>
Running org.apache.hadoop.hbase.regionserver.TestRegionMergeTransactionOnCluster
Tests run: 2, Failures: 0, Errors: 0, Skipped: 0, Time elapsed: 34.466 sec
Forking command line: /bin/sh -c cd <https://builds.apache.org/job/hbase-0.95-on-hadoop2/ws/0.95-on-hadoop2/hbase-server> && /home/jenkins/tools/java/jdk1.6.0_45-32/jre/bin/java -enableassertions -Xmx1900m -XX:MaxPermSize=100m -Djava.security.egd=file:/dev/./urandom -Djava.net.preferIPv4Stack=true -jar <https://builds.apache.org/job/hbase-0.95-on-hadoop2/ws/0.95-on-hadoop2/hbase-server/target/surefire/surefirebooter4865290552770211367.jar> <https://builds.apache.org/job/hbase-0.95-on-hadoop2/ws/0.95-on-hadoop2/hbase-server/target/surefire/surefire1886065641114725353tmp> <https://builds.apache.org/job/hbase-0.95-on-hadoop2/ws/0.95-on-hadoop2/hbase-server/target/surefire/surefire_2027065895279899974515tmp>
Running org.apache.hadoop.hbase.regionserver.TestCompactionState
Tests run: 5, Failures: 0, Errors: 0, Skipped: 0, Time elapsed: 94.508 sec
Forking command line: /bin/sh -c cd <https://builds.apache.org/job/hbase-0.95-on-hadoop2/ws/0.95-on-hadoop2/hbase-server> && /home/jenkins/tools/java/jdk1.6.0_45-32/jre/bin/java -enableassertions -Xmx1900m -XX:MaxPermSize=100m -Djava.security.egd=file:/dev/./urandom -Djava.net.preferIPv4Stack=true -jar <https://builds.apache.org/job/hbase-0.95-on-hadoop2/ws/0.95-on-hadoop2/hbase-server/target/surefire/surefirebooter8532824060957601063.jar> <https://builds.apache.org/job/hbase-0.95-on-hadoop2/ws/0.95-on-hadoop2/hbase-server/target/surefire/surefire1439856221866346802tmp> <https://builds.apache.org/job/hbase-0.95-on-hadoop2/ws/0.95-on-hadoop2/hbase-server/target/surefire/surefire_2035369280400617807816tmp>
Running org.apache.hadoop.hbase.regionserver.TestHRegionServerBulkLoad
Tests run: 1, Failures: 0, Errors: 0, Skipped: 0, Time elapsed: 46.152 sec
Forking command line: /bin/sh -c cd <https://builds.apache.org/job/hbase-0.95-on-hadoop2/ws/0.95-on-hadoop2/hbase-server> && /home/jenkins/tools/java/jdk1.6.0_45-32/jre/bin/java -enableassertions -Xmx1900m -XX:MaxPermSize=100m -Djava.security.egd=file:/dev/./urandom -Djava.net.preferIPv4Stack=true -jar <https://builds.apache.org/job/hbase-0.95-on-hadoop2/ws/0.95-on-hadoop2/hbase-server/target/surefire/surefirebooter2542058468403495508.jar> <https://builds.apache.org/job/hbase-0.95-on-hadoop2/ws/0.95-on-hadoop2/hbase-server/target/surefire/surefire7937439283834684652tmp> <https://builds.apache.org/job/hbase-0.95-on-hadoop2/ws/0.95-on-hadoop2/hbase-server/target/surefire/surefire_2047776190436669293437tmp>
Running org.apache.hadoop.hbase.regionserver.TestGetClosestAtOrBefore
Tests run: 3, Failures: 0, Errors: 0, Skipped: 0, Time elapsed: 1.654 sec
Forking command line: /bin/sh -c cd <https://builds.apache.org/job/hbase-0.95-on-hadoop2/ws/0.95-on-hadoop2/hbase-server> && /home/jenkins/tools/java/jdk1.6.0_45-32/jre/bin/java -enableassertions -Xmx1900m -XX:MaxPermSize=100m -Djava.security.egd=file:/dev/./urandom -Djava.net.preferIPv4Stack=true -jar <https://builds.apache.org/job/hbase-0.95-on-hadoop2/ws/0.95-on-hadoop2/hbase-server/target/surefire/surefirebooter7508031957134103742.jar> <https://builds.apache.org/job/hbase-0.95-on-hadoop2/ws/0.95-on-hadoop2/hbase-server/target/surefire/surefire2618961891748356344tmp> <https://builds.apache.org/job/hbase-0.95-on-hadoop2/ws/0.95-on-hadoop2/hbase-server/target/surefire/surefire_2056702853548226390285tmp>
Running org.apache.hadoop.hbase.regionserver.TestCacheOnWriteInSchema
Tests run: 3, Failures: 0, Errors: 0, Skipped: 0, Time elapsed: 2.864 sec
Forking command line: /bin/sh -c cd <https://builds.apache.org/job/hbase-0.95-on-hadoop2/ws/0.95-on-hadoop2/hbase-server> && /home/jenkins/tools/java/jdk1.6.0_45-32/jre/bin/java -enableassertions -Xmx1900m -XX:MaxPermSize=100m -Djava.security.egd=file:/dev/./urandom -Djava.net.preferIPv4Stack=true -jar <https://builds.apache.org/job/hbase-0.95-on-hadoop2/ws/0.95-on-hadoop2/hbase-server/target/surefire/surefirebooter6220984479050856830.jar> <https://builds.apache.org/job/hbase-0.95-on-hadoop2/ws/0.95-on-hadoop2/hbase-server/target/surefire/surefire7435629240831834895tmp> <https://builds.apache.org/job/hbase-0.95-on-hadoop2/ws/0.95-on-hadoop2/hbase-server/target/surefire/surefire_2062504242142463295749tmp>
Running org.apache.hadoop.hbase.regionserver.TestParallelPut
Tests run: 2, Failures: 0, Errors: 0, Skipped: 0, Time elapsed: 5.762 sec
Forking command line: /bin/sh -c cd <https://builds.apache.org/job/hbase-0.95-on-hadoop2/ws/0.95-on-hadoop2/hbase-server> && /home/jenkins/tools/java/jdk1.6.0_45-32/jre/bin/java -enableassertions -Xmx1900m -XX:MaxPermSize=100m -Djava.security.egd=file:/dev/./urandom -Djava.net.preferIPv4Stack=true -jar <https://builds.apache.org/job/hbase-0.95-on-hadoop2/ws/0.95-on-hadoop2/hbase-server/target/surefire/surefirebooter4738861976021195202.jar> <https://builds.apache.org/job/hbase-0.95-on-hadoop2/ws/0.95-on-hadoop2/hbase-server/target/surefire/surefire1540509482093384874tmp> <https://builds.apache.org/job/hbase-0.95-on-hadoop2/ws/0.95-on-hadoop2/hbase-server/target/surefire/surefire_2077621663036200957057tmp>
Running org.apache.hadoop.hbase.regionserver.TestPriorityRpc
Tests run: 3, Failures: 0, Errors: 0, Skipped: 0, Time elapsed: 1.718 sec
Forking command line: /bin/sh -c cd <https://builds.apache.org/job/hbase-0.95-on-hadoop2/ws/0.95-on-hadoop2/hbase-server> && /home/jenkins/tools/java/jdk1.6.0_45-32/jre/bin/java -enableassertions -Xmx1900m -XX:MaxPermSize=100m -Djava.security.egd=file:/dev/./urandom -Djava.net.preferIPv4Stack=true -jar <https://builds.apache.org/job/hbase-0.95-on-hadoop2/ws/0.95-on-hadoop2/hbase-server/target/surefire/surefirebooter8138924219167377615.jar> <https://builds.apache.org/job/hbase-0.95-on-hadoop2/ws/0.95-on-hadoop2/hbase-server/target/surefire/surefire1938194994840623665tmp> <https://builds.apache.org/job/hbase-0.95-on-hadoop2/ws/0.95-on-hadoop2/hbase-server/target/surefire/surefire_2085867518934284142396tmp>
Running org.apache.hadoop.hbase.regionserver.TestSplitTransactionOnCluster
Tests run: 9, Failures: 0, Errors: 0, Skipped: 0, Time elapsed: 65.06 sec
Forking command line: /bin/sh -c cd <https://builds.apache.org/job/hbase-0.95-on-hadoop2/ws/0.95-on-hadoop2/hbase-server> && /home/jenkins/tools/java/jdk1.6.0_45-32/jre/bin/java -enableassertions -Xmx1900m -XX:MaxPermSize=100m -Djava.security.egd=file:/dev/./urandom -Djava.net.preferIPv4Stack=true -jar <https://builds.apache.org/job/hbase-0.95-on-hadoop2/ws/0.95-on-hadoop2/hbase-server/target/surefire/surefirebooter4572561918631168750.jar> <https://builds.apache.org/job/hbase-0.95-on-hadoop2/ws/0.95-on-hadoop2/hbase-server/target/surefire/surefire8081734900538008209tmp> <https://builds.apache.org/job/hbase-0.95-on-hadoop2/ws/0.95-on-hadoop2/hbase-server/target/surefire/surefire_2098240298244787966187tmp>
Running org.apache.hadoop.hbase.regionserver.wal.TestHLog
Tests run: 13, Failures: 0, Errors: 0, Skipped: 0, Time elapsed: 24.051 sec
Forking command line: /bin/sh -c cd <https://builds.apache.org/job/hbase-0.95-on-hadoop2/ws/0.95-on-hadoop2/hbase-server> && /home/jenkins/tools/java/jdk1.6.0_45-32/jre/bin/java -enableassertions -Xmx1900m -XX:MaxPermSize=100m -Djava.security.egd=file:/dev/./urandom -Djava.net.preferIPv4Stack=true -jar <https://builds.apache.org/job/hbase-0.95-on-hadoop2/ws/0.95-on-hadoop2/hbase-server/target/surefire/surefirebooter3198976913092788794.jar> <https://builds.apache.org/job/hbase-0.95-on-hadoop2/ws/0.95-on-hadoop2/hbase-server/target/surefire/surefire7990084113043693592tmp> <https://builds.apache.org/job/hbase-0.95-on-hadoop2/ws/0.95-on-hadoop2/hbase-server/target/surefire/surefire_2101358499649778570644tmp>
Running org.apache.hadoop.hbase.regionserver.wal.TestHLogSplit
Tests run: 35, Failures: 0, Errors: 0, Skipped: 1, Time elapsed: 73.84 sec
Forking command line: /bin/sh -c cd <https://builds.apache.org/job/hbase-0.95-on-hadoop2/ws/0.95-on-hadoop2/hbase-server> && /home/jenkins/tools/java/jdk1.6.0_45-32/jre/bin/java -enableassertions -Xmx1900m -XX:MaxPermSize=100m -Djava.security.egd=file:/dev/./urandom -Djava.net.preferIPv4Stack=true -jar <https://builds.apache.org/job/hbase-0.95-on-hadoop2/ws/0.95-on-hadoop2/hbase-server/target/surefire/surefirebooter4515441970572938411.jar> <https://builds.apache.org/job/hbase-0.95-on-hadoop2/ws/0.95-on-hadoop2/hbase-server/target/surefire/surefire7616145867741130563tmp> <https://builds.apache.org/job/hbase-0.95-on-hadoop2/ws/0.95-on-hadoop2/hbase-server/target/surefire/surefire_2116663264584182387018tmp>
Running org.apache.hadoop.hbase.regionserver.wal.TestLogRollAbort
Tests run: 1, Failures: 0, Errors: 0, Skipped: 0, Time elapsed: 136.221 sec
Forking command line: /bin/sh -c cd <https://builds.apache.org/job/hbase-0.95-on-hadoop2/ws/0.95-on-hadoop2/hbase-server> && /home/jenkins/tools/java/jdk1.6.0_45-32/jre/bin/java -enableassertions -Xmx1900m -XX:MaxPermSize=100m -Djava.security.egd=file:/dev/./urandom -Djava.net.preferIPv4Stack=true -jar <https://builds.apache.org/job/hbase-0.95-on-hadoop2/ws/0.95-on-hadoop2/hbase-server/target/surefire/surefirebooter5061078141386367712.jar> <https://builds.apache.org/job/hbase-0.95-on-hadoop2/ws/0.95-on-hadoop2/hbase-server/target/surefire/surefire9199534853008782787tmp> <https://builds.apache.org/job/hbase-0.95-on-hadoop2/ws/0.95-on-hadoop2/hbase-server/target/surefire/surefire_2125273921385033764905tmp>
Running org.apache.hadoop.hbase.regionserver.wal.TestHLogSplitCompressed
Tests run: 35, Failures: 0, Errors: 0, Skipped: 1, Time elapsed: 79.899 sec
Forking command line: /bin/sh -c cd <https://builds.apache.org/job/hbase-0.95-on-hadoop2/ws/0.95-on-hadoop2/hbase-server> && /home/jenkins/tools/java/jdk1.6.0_45-32/jre/bin/java -enableassertions -Xmx1900m -XX:MaxPermSize=100m -Djava.security.egd=file:/dev/./urandom -Djava.net.preferIPv4Stack=true -jar <https://builds.apache.org/job/hbase-0.95-on-hadoop2/ws/0.95-on-hadoop2/hbase-server/target/surefire/surefirebooter7555680929931047934.jar> <https://builds.apache.org/job/hbase-0.95-on-hadoop2/ws/0.95-on-hadoop2/hbase-server/target/surefire/surefire7404008198762574021tmp> <https://builds.apache.org/job/hbase-0.95-on-hadoop2/ws/0.95-on-hadoop2/hbase-server/target/surefire/surefire_2133119209879624364340tmp>
Running org.apache.hadoop.hbase.regionserver.wal.TestWALReplay
Tests run: 8, Failures: 0, Errors: 0, Skipped: 0, Time elapsed: 55.593 sec
Forking command line: /bin/sh -c cd <https://builds.apache.org/job/hbase-0.95-on-hadoop2/ws/0.95-on-hadoop2/hbase-server> && /home/jenkins/tools/java/jdk1.6.0_45-32/jre/bin/java -enableassertions -Xmx1900m -XX:MaxPermSize=100m -Djava.security.egd=file:/dev/./urandom -Djava.net.preferIPv4Stack=true -jar <https://builds.apache.org/job/hbase-0.95-on-hadoop2/ws/0.95-on-hadoop2/hbase-server/target/surefire/surefirebooter5364297115510840079.jar> <https://builds.apache.org/job/hbase-0.95-on-hadoop2/ws/0.95-on-hadoop2/hbase-server/target/surefire/surefire5664107514305230022tmp> <https://builds.apache.org/job/hbase-0.95-on-hadoop2/ws/0.95-on-hadoop2/hbase-server/target/surefire/surefire_2147337484682551357393tmp>
Running org.apache.hadoop.hbase.regionserver.wal.TestDurability
Tests run: 1, Failures: 0, Errors: 0, Skipped: 0, Time elapsed: 5.374 sec
Forking command line: /bin/sh -c cd <https://builds.apache.org/job/hbase-0.95-on-hadoop2/ws/0.95-on-hadoop2/hbase-server> && /home/jenkins/tools/java/jdk1.6.0_45-32/jre/bin/java -enableassertions -Xmx1900m -XX:MaxPermSize=100m -Djava.security.egd=file:/dev/./urandom -Djava.net.preferIPv4Stack=true -jar <https://builds.apache.org/job/hbase-0.95-on-hadoop2/ws/0.95-on-hadoop2/hbase-server/target/surefire/surefirebooter1076009000591155970.jar> <https://builds.apache.org/job/hbase-0.95-on-hadoop2/ws/0.95-on-hadoop2/hbase-server/target/surefire/surefire7766476196451501085tmp> <https://builds.apache.org/job/hbase-0.95-on-hadoop2/ws/0.95-on-hadoop2/hbase-server/target/surefire/surefire_2153130466671414673327tmp>
Running org.apache.hadoop.hbase.regionserver.wal.TestLogRolling
Tests run: 4, Failures: 0, Errors: 0, Skipped: 0, Time elapsed: 205.89 sec
Forking command line: /bin/sh -c cd <https://builds.apache.org/job/hbase-0.95-on-hadoop2/ws/0.95-on-hadoop2/hbase-server> && /home/jenkins/tools/java/jdk1.6.0_45-32/jre/bin/java -enableassertions -Xmx1900m -XX:MaxPermSize=100m -Djava.security.egd=file:/dev/./urandom -Djava.net.preferIPv4Stack=true -jar <https://builds.apache.org/job/hbase-0.95-on-hadoop2/ws/0.95-on-hadoop2/hbase-server/target/surefire/surefirebooter2613359459671968620.jar> <https://builds.apache.org/job/hbase-0.95-on-hadoop2/ws/0.95-on-hadoop2/hbase-server/target/surefire/surefire1605848479770019874tmp> <https://builds.apache.org/job/hbase-0.95-on-hadoop2/ws/0.95-on-hadoop2/hbase-server/target/surefire/surefire_2164494558412547260209tmp>
Running org.apache.hadoop.hbase.regionserver.TestStoreScanner
Tests run: 16, Failures: 0, Errors: 0, Skipped: 0, Time elapsed: 0.866 sec
Forking command line: /bin/sh -c cd <https://builds.apache.org/job/hbase-0.95-on-hadoop2/ws/0.95-on-hadoop2/hbase-server> && /home/jenkins/tools/java/jdk1.6.0_45-32/jre/bin/java -enableassertions -Xmx1900m -XX:MaxPermSize=100m -Djava.security.egd=file:/dev/./urandom -Djava.net.preferIPv4Stack=true -jar <https://builds.apache.org/job/hbase-0.95-on-hadoop2/ws/0.95-on-hadoop2/hbase-server/target/surefire/surefirebooter741460723465380577.jar> <https://builds.apache.org/job/hbase-0.95-on-hadoop2/ws/0.95-on-hadoop2/hbase-server/target/surefire/surefire8509132323814670201tmp> <https://builds.apache.org/job/hbase-0.95-on-hadoop2/ws/0.95-on-hadoop2/hbase-server/target/surefire/surefire_2175052633136727857502tmp>
Running org.apache.hadoop.hbase.regionserver.TestRegionFavoredNodes
Tests run: 1, Failures: 0, Errors: 0, Skipped: 1, Time elapsed: 0.533 sec
Forking command line: /bin/sh -c cd <https://builds.apache.org/job/hbase-0.95-on-hadoop2/ws/0.95-on-hadoop2/hbase-server> && /home/jenkins/tools/java/jdk1.6.0_45-32/jre/bin/java -enableassertions -Xmx1900m -XX:MaxPermSize=100m -Djava.security.egd=file:/dev/./urandom -Djava.net.preferIPv4Stack=true -jar <https://builds.apache.org/job/hbase-0.95-on-hadoop2/ws/0.95-on-hadoop2/hbase-server/target/surefire/surefirebooter2497315068576574297.jar> <https://builds.apache.org/job/hbase-0.95-on-hadoop2/ws/0.95-on-hadoop2/hbase-server/target/surefire/surefire6448810825342979878tmp> <https://builds.apache.org/job/hbase-0.95-on-hadoop2/ws/0.95-on-hadoop2/hbase-server/target/surefire/surefire_2184944383309484809852tmp>
Running org.apache.hadoop.hbase.regionserver.TestEndToEndSplitTransaction
Tests run: 2, Failures: 0, Errors: 0, Skipped: 0, Time elapsed: 27.038 sec
Forking command line: /bin/sh -c cd <https://builds.apache.org/job/hbase-0.95-on-hadoop2/ws/0.95-on-hadoop2/hbase-server> && /home/jenkins/tools/java/jdk1.6.0_45-32/jre/bin/java -enableassertions -Xmx1900m -XX:MaxPermSize=100m -Djava.security.egd=file:/dev/./urandom -Djava.net.preferIPv4Stack=true -jar <https://builds.apache.org/job/hbase-0.95-on-hadoop2/ws/0.95-on-hadoop2/hbase-server/target/surefire/surefirebooter5941867194645908726.jar> <https://builds.apache.org/job/hbase-0.95-on-hadoop2/ws/0.95-on-hadoop2/hbase-server/target/surefire/surefire6757393300250976378tmp> <https://builds.apache.org/job/hbase-0.95-on-hadoop2/ws/0.95-on-hadoop2/hbase-server/target/surefire/surefire_219730121142630832369tmp>
Running org.apache.hadoop.hbase.regionserver.wal.TestWALReplayCompressed
Tests run: 8, Failures: 0, Errors: 0, Skipped: 0, Time elapsed: 54.699 sec
Forking command line: /bin/sh -c cd <https://builds.apache.org/job/hbase-0.95-on-hadoop2/ws/0.95-on-hadoop2/hbase-server> && /home/jenkins/tools/java/jdk1.6.0_45-32/jre/bin/java -enableassertions -Xmx1900m -XX:MaxPermSize=100m -Djava.security.egd=file:/dev/./urandom -Djava.net.preferIPv4Stack=true -jar <https://builds.apache.org/job/hbase-0.95-on-hadoop2/ws/0.95-on-hadoop2/hbase-server/target/surefire/surefirebooter2243848626402745304.jar> <https://builds.apache.org/job/hbase-0.95-on-hadoop2/ws/0.95-on-hadoop2/hbase-server/target/surefire/surefire3241768385400194478tmp> <https://builds.apache.org/job/hbase-0.95-on-hadoop2/ws/0.95-on-hadoop2/hbase-server/target/surefire/surefire_2201369705633038359277tmp>
Running org.apache.hadoop.hbase.regionserver.TestCompaction
Tests run: 18, Failures: 0, Errors: 0, Skipped: 0, Time elapsed: 45.732 sec
Forking command line: /bin/sh -c cd <https://builds.apache.org/job/hbase-0.95-on-hadoop2/ws/0.95-on-hadoop2/hbase-server> && /home/jenkins/tools/java/jdk1.6.0_45-32/jre/bin/java -enableassertions -Xmx1900m -XX:MaxPermSize=100m -Djava.security.egd=file:/dev/./urandom -Djava.net.preferIPv4Stack=true -jar <https://builds.apache.org/job/hbase-0.95-on-hadoop2/ws/0.95-on-hadoop2/hbase-server/target/surefire/surefirebooter6030536509387776239.jar> <https://builds.apache.org/job/hbase-0.95-on-hadoop2/ws/0.95-on-hadoop2/hbase-server/target/surefire/surefire3360222126346215865tmp> <https://builds.apache.org/job/hbase-0.95-on-hadoop2/ws/0.95-on-hadoop2/hbase-server/target/surefire/surefire_2217923949093322624tmp>
Running org.apache.hadoop.hbase.regionserver.TestMultiColumnScanner
Tests run: 12, Failures: 0, Errors: 0, Skipped: 0, Time elapsed: 61.862 sec
Forking command line: /bin/sh -c cd <https://builds.apache.org/job/hbase-0.95-on-hadoop2/ws/0.95-on-hadoop2/hbase-server> && /home/jenkins/tools/java/jdk1.6.0_45-32/jre/bin/java -enableassertions -Xmx1900m -XX:MaxPermSize=100m -Djava.security.egd=file:/dev/./urandom -Djava.net.preferIPv4Stack=true -jar <https://builds.apache.org/job/hbase-0.95-on-hadoop2/ws/0.95-on-hadoop2/hbase-server/target/surefire/surefirebooter8647917362142702567.jar> <https://builds.apache.org/job/hbase-0.95-on-hadoop2/ws/0.95-on-hadoop2/hbase-server/target/surefire/surefire1194175470547104231tmp> <https://builds.apache.org/job/hbase-0.95-on-hadoop2/ws/0.95-on-hadoop2/hbase-server/target/surefire/surefire_2225961989100197784552tmp>
Running org.apache.hadoop.hbase.mapred.TestTableInputFormat
Tests run: 10, Failures: 0, Errors: 0, Skipped: 0, Time elapsed: 26.394 sec
Forking command line: /bin/sh -c cd <https://builds.apache.org/job/hbase-0.95-on-hadoop2/ws/0.95-on-hadoop2/hbase-server> && /home/jenkins/tools/java/jdk1.6.0_45-32/jre/bin/java -enableassertions -Xmx1900m -XX:MaxPermSize=100m -Djava.security.egd=file:/dev/./urandom -Djava.net.preferIPv4Stack=true -jar <https://builds.apache.org/job/hbase-0.95-on-hadoop2/ws/0.95-on-hadoop2/hbase-server/target/surefire/surefirebooter8230872096679239271.jar> <https://builds.apache.org/job/hbase-0.95-on-hadoop2/ws/0.95-on-hadoop2/hbase-server/target/surefire/surefire3308027227741149921tmp> <https://builds.apache.org/job/hbase-0.95-on-hadoop2/ws/0.95-on-hadoop2/hbase-server/target/surefire/surefire_2231385791531755680254tmp>
Running org.apache.hadoop.hbase.mapred.TestTableMapReduce
Tests run: 1, Failures: 0, Errors: 0, Skipped: 0, Time elapsed: 71.875 sec
Forking command line: /bin/sh -c cd <https://builds.apache.org/job/hbase-0.95-on-hadoop2/ws/0.95-on-hadoop2/hbase-server> && /home/jenkins/tools/java/jdk1.6.0_45-32/jre/bin/java -enableassertions -Xmx1900m -XX:MaxPermSize=100m -Djava.security.egd=file:/dev/./urandom -Djava.net.preferIPv4Stack=true -jar <https://builds.apache.org/job/hbase-0.95-on-hadoop2/ws/0.95-on-hadoop2/hbase-server/target/surefire/surefirebooter7303249395401621132.jar> <https://builds.apache.org/job/hbase-0.95-on-hadoop2/ws/0.95-on-hadoop2/hbase-server/target/surefire/surefire8892114234891064463tmp> <https://builds.apache.org/job/hbase-0.95-on-hadoop2/ws/0.95-on-hadoop2/hbase-server/target/surefire/surefire_2247395826986344078999tmp>
Running org.apache.hadoop.hbase.fs.TestBlockReorder
Tests run: 3, Failures: 0, Errors: 0, Skipped: 0, Time elapsed: 65.247 sec
Forking command line: /bin/sh -c cd <https://builds.apache.org/job/hbase-0.95-on-hadoop2/ws/0.95-on-hadoop2/hbase-server> && /home/jenkins/tools/java/jdk1.6.0_45-32/jre/bin/java -enableassertions -Xmx1900m -XX:MaxPermSize=100m -Djava.security.egd=file:/dev/./urandom -Djava.net.preferIPv4Stack=true -jar <https://builds.apache.org/job/hbase-0.95-on-hadoop2/ws/0.95-on-hadoop2/hbase-server/target/surefire/surefirebooter4795202832944827588.jar> <https://builds.apache.org/job/hbase-0.95-on-hadoop2/ws/0.95-on-hadoop2/hbase-server/target/surefire/surefire1782702804605905542tmp> <https://builds.apache.org/job/hbase-0.95-on-hadoop2/ws/0.95-on-hadoop2/hbase-server/target/surefire/surefire_225230475820996739128tmp>
Running org.apache.hadoop.hbase.backup.example.TestZooKeeperTableArchiveClient
Tests run: 3, Failures: 0, Errors: 0, Skipped: 0, Time elapsed: 7.238 sec
Forking command line: /bin/sh -c cd <https://builds.apache.org/job/hbase-0.95-on-hadoop2/ws/0.95-on-hadoop2/hbase-server> && /home/jenkins/tools/java/jdk1.6.0_45-32/jre/bin/java -enableassertions -Xmx1900m -XX:MaxPermSize=100m -Djava.security.egd=file:/dev/./urandom -Djava.net.preferIPv4Stack=true -jar <https://builds.apache.org/job/hbase-0.95-on-hadoop2/ws/0.95-on-hadoop2/hbase-server/target/surefire/surefirebooter2636030375675025833.jar> <https://builds.apache.org/job/hbase-0.95-on-hadoop2/ws/0.95-on-hadoop2/hbase-server/target/surefire/surefire1522703957022976344tmp> <https://builds.apache.org/job/hbase-0.95-on-hadoop2/ws/0.95-on-hadoop2/hbase-server/target/surefire/surefire_2262061198646143636681tmp>
Running org.apache.hadoop.hbase.TestClusterBootOrder
Tests run: 2, Failures: 0, Errors: 0, Skipped: 0, Time elapsed: 34.044 sec
Forking command line: /bin/sh -c cd <https://builds.apache.org/job/hbase-0.95-on-hadoop2/ws/0.95-on-hadoop2/hbase-server> && /home/jenkins/tools/java/jdk1.6.0_45-32/jre/bin/java -enableassertions -Xmx1900m -XX:MaxPermSize=100m -Djava.security.egd=file:/dev/./urandom -Djava.net.preferIPv4Stack=true -jar <https://builds.apache.org/job/hbase-0.95-on-hadoop2/ws/0.95-on-hadoop2/hbase-server/target/surefire/surefirebooter3338771837186796010.jar> <https://builds.apache.org/job/hbase-0.95-on-hadoop2/ws/0.95-on-hadoop2/hbase-server/target/surefire/surefire8471619492646319367tmp> <https://builds.apache.org/job/hbase-0.95-on-hadoop2/ws/0.95-on-hadoop2/hbase-server/target/surefire/surefire_2272178251492127085203tmp>
Running org.apache.hadoop.hbase.backup.TestHFileArchiving
Tests run: 5, Failures: 0, Errors: 0, Skipped: 0, Time elapsed: 90.815 sec
Forking command line: /bin/sh -c cd <https://builds.apache.org/job/hbase-0.95-on-hadoop2/ws/0.95-on-hadoop2/hbase-server> && /home/jenkins/tools/java/jdk1.6.0_45-32/jre/bin/java -enableassertions -Xmx1900m -XX:MaxPermSize=100m -Djava.security.egd=file:/dev/./urandom -Djava.net.preferIPv4Stack=true -jar <https://builds.apache.org/job/hbase-0.95-on-hadoop2/ws/0.95-on-hadoop2/hbase-server/target/surefire/surefirebooter2658688787176949976.jar> <https://builds.apache.org/job/hbase-0.95-on-hadoop2/ws/0.95-on-hadoop2/hbase-server/target/surefire/surefire2987827728740504897tmp> <https://builds.apache.org/job/hbase-0.95-on-hadoop2/ws/0.95-on-hadoop2/hbase-server/target/surefire/surefire_2286755298128876771776tmp>
Running org.apache.hadoop.hbase.TestDrainingServer
Tests run: 2, Failures: 0, Errors: 1, Skipped: 0, Time elapsed: 48.126 sec <<< FAILURE!
Forking command line: /bin/sh -c cd <https://builds.apache.org/job/hbase-0.95-on-hadoop2/ws/0.95-on-hadoop2/hbase-server> && /home/jenkins/tools/java/jdk1.6.0_45-32/jre/bin/java -enableassertions -Xmx1900m -XX:MaxPermSize=100m -Djava.security.egd=file:/dev/./urandom -Djava.net.preferIPv4Stack=true -jar <https://builds.apache.org/job/hbase-0.95-on-hadoop2/ws/0.95-on-hadoop2/hbase-server/target/surefire/surefirebooter6451778744675999672.jar> <https://builds.apache.org/job/hbase-0.95-on-hadoop2/ws/0.95-on-hadoop2/hbase-server/target/surefire/surefire7055936645919521621tmp> <https://builds.apache.org/job/hbase-0.95-on-hadoop2/ws/0.95-on-hadoop2/hbase-server/target/surefire/surefire_2296937187299284313669tmp>
Running org.apache.hadoop.hbase.mapreduce.TestTimeRangeMapRed
Tests run: 1, Failures: 0, Errors: 0, Skipped: 0, Time elapsed: 55.209 sec
Forking command line: /bin/sh -c cd <https://builds.apache.org/job/hbase-0.95-on-hadoop2/ws/0.95-on-hadoop2/hbase-server> && /home/jenkins/tools/java/jdk1.6.0_45-32/jre/bin/java -enableassertions -Xmx1900m -XX:MaxPermSize=100m -Djava.security.egd=file:/dev/./urandom -Djava.net.preferIPv4Stack=true -jar <https://builds.apache.org/job/hbase-0.95-on-hadoop2/ws/0.95-on-hadoop2/hbase-server/target/surefire/surefirebooter3013260148699708389.jar> <https://builds.apache.org/job/hbase-0.95-on-hadoop2/ws/0.95-on-hadoop2/hbase-server/target/surefire/surefire6209607848956739596tmp> <https://builds.apache.org/job/hbase-0.95-on-hadoop2/ws/0.95-on-hadoop2/hbase-server/target/surefire/surefire_2303344459513740883634tmp>
Running org.apache.hadoop.hbase.mapreduce.TestRowCounter
Tests run: 3, Failures: 0, Errors: 0, Skipped: 0, Time elapsed: 122.728 sec
Forking command line: /bin/sh -c cd <https://builds.apache.org/job/hbase-0.95-on-hadoop2/ws/0.95-on-hadoop2/hbase-server> && /home/jenkins/tools/java/jdk1.6.0_45-32/jre/bin/java -enableassertions -Xmx1900m -XX:MaxPermSize=100m -Djava.security.egd=file:/dev/./urandom -Djava.net.preferIPv4Stack=true -jar <https://builds.apache.org/job/hbase-0.95-on-hadoop2/ws/0.95-on-hadoop2/hbase-server/target/surefire/surefirebooter4288161614140053960.jar> <https://builds.apache.org/job/hbase-0.95-on-hadoop2/ws/0.95-on-hadoop2/hbase-server/target/surefire/surefire785893240760833472tmp> <https://builds.apache.org/job/hbase-0.95-on-hadoop2/ws/0.95-on-hadoop2/hbase-server/target/surefire/surefire_2315386746230955600773tmp>
Forking command line: /bin/sh -c cd <https://builds.apache.org/job/hbase-0.95-on-hadoop2/ws/0.95-on-hadoop2/hbase-server> && /home/jenkins/tools/java/jdk1.6.0_45-32/jre/bin/java -enableassertions -Xmx1900m -XX:MaxPermSize=100m -Djava.security.egd=file:/dev/./urandom -Djava.net.preferIPv4Stack=true -jar <https://builds.apache.org/job/hbase-0.95-on-hadoop2/ws/0.95-on-hadoop2/hbase-server/target/surefire/surefirebooter8445759976259515908.jar> <https://builds.apache.org/job/hbase-0.95-on-hadoop2/ws/0.95-on-hadoop2/hbase-server/target/surefire/surefire7813161046135015428tmp> <https://builds.apache.org/job/hbase-0.95-on-hadoop2/ws/0.95-on-hadoop2/hbase-server/target/surefire/surefire_2327068569799583689589tmp>
Running org.apache.hadoop.hbase.mapreduce.TestMultiTableInputFormat
Tests run: 5, Failures: 0, Errors: 0, Skipped: 0, Time elapsed: 347.871 sec
Forking command line: /bin/sh -c cd <https://builds.apache.org/job/hbase-0.95-on-hadoop2/ws/0.95-on-hadoop2/hbase-server> && /home/jenkins/tools/java/jdk1.6.0_45-32/jre/bin/java -enableassertions -Xmx1900m -XX:MaxPermSize=100m -Djava.security.egd=file:/dev/./urandom -Djava.net.preferIPv4Stack=true -jar <https://builds.apache.org/job/hbase-0.95-on-hadoop2/ws/0.95-on-hadoop2/hbase-server/target/surefire/surefirebooter3130815837020341973.jar> <https://builds.apache.org/job/hbase-0.95-on-hadoop2/ws/0.95-on-hadoop2/hbase-server/target/surefire/surefire7690206122984352885tmp> <https://builds.apache.org/job/hbase-0.95-on-hadoop2/ws/0.95-on-hadoop2/hbase-server/target/surefire/surefire_2335182740610083146581tmp>
Running org.apache.hadoop.hbase.mapreduce.TestCopyTable
Tests run: 2, Failures: 0, Errors: 0, Skipped: 0, Time elapsed: 106.143 sec
Forking command line: /bin/sh -c cd <https://builds.apache.org/job/hbase-0.95-on-hadoop2/ws/0.95-on-hadoop2/hbase-server> && /home/jenkins/tools/java/jdk1.6.0_45-32/jre/bin/java -enableassertions -Xmx1900m -XX:MaxPermSize=100m -Djava.security.egd=file:/dev/./urandom -Djava.net.preferIPv4Stack=true -jar <https://builds.apache.org/job/hbase-0.95-on-hadoop2/ws/0.95-on-hadoop2/hbase-server/target/surefire/surefirebooter1583395319494172838.jar> <https://builds.apache.org/job/hbase-0.95-on-hadoop2/ws/0.95-on-hadoop2/hbase-server/target/surefire/surefire3415178536477828111tmp> <https://builds.apache.org/job/hbase-0.95-on-hadoop2/ws/0.95-on-hadoop2/hbase-server/target/surefire/surefire_2344741664463465072845tmp>
Running org.apache.hadoop.hbase.mapreduce.TestSecureLoadIncrementalHFiles
Tests run: 7, Failures: 0, Errors: 0, Skipped: 0, Time elapsed: 29.575 sec
Forking command line: /bin/sh -c cd <https://builds.apache.org/job/hbase-0.95-on-hadoop2/ws/0.95-on-hadoop2/hbase-server> && /home/jenkins/tools/java/jdk1.6.0_45-32/jre/bin/java -enableassertions -Xmx1900m -XX:MaxPermSize=100m -Djava.security.egd=file:/dev/./urandom -Djava.net.preferIPv4Stack=true -jar <https://builds.apache.org/job/hbase-0.95-on-hadoop2/ws/0.95-on-hadoop2/hbase-server/target/surefire/surefirebooter4027009567407168222.jar> <https://builds.apache.org/job/hbase-0.95-on-hadoop2/ws/0.95-on-hadoop2/hbase-server/target/surefire/surefire8558082675126081878tmp> <https://builds.apache.org/job/hbase-0.95-on-hadoop2/ws/0.95-on-hadoop2/hbase-server/target/surefire/surefire_235890164209657048041tmp>
Forking command line: /bin/sh -c cd <https://builds.apache.org/job/hbase-0.95-on-hadoop2/ws/0.95-on-hadoop2/hbase-server> && /home/jenkins/tools/java/jdk1.6.0_45-32/jre/bin/java -enableassertions -Xmx1900m -XX:MaxPermSize=100m -Djava.security.egd=file:/dev/./urandom -Djava.net.preferIPv4Stack=true -jar <https://builds.apache.org/job/hbase-0.95-on-hadoop2/ws/0.95-on-hadoop2/hbase-server/target/surefire/surefirebooter8130268740371772967.jar> <https://builds.apache.org/job/hbase-0.95-on-hadoop2/ws/0.95-on-hadoop2/hbase-server/target/surefire/surefire255843173539507469tmp> <https://builds.apache.org/job/hbase-0.95-on-hadoop2/ws/0.95-on-hadoop2/hbase-server/target/surefire/surefire_2365716243216951352411tmp>
Running org.apache.hadoop.hbase.mapreduce.TestHFileOutputFormat
Tests run: 10, Failures: 0, Errors: 0, Skipped: 0, Time elapsed: 363.23 sec
Forking command line: /bin/sh -c cd <https://builds.apache.org/job/hbase-0.95-on-hadoop2/ws/0.95-on-hadoop2/hbase-server> && /home/jenkins/tools/java/jdk1.6.0_45-32/jre/bin/java -enableassertions -Xmx1900m -XX:MaxPermSize=100m -Djava.security.egd=file:/dev/./urandom -Djava.net.preferIPv4Stack=true -jar <https://builds.apache.org/job/hbase-0.95-on-hadoop2/ws/0.95-on-hadoop2/hbase-server/target/surefire/surefirebooter5944854077613332417.jar> <https://builds.apache.org/job/hbase-0.95-on-hadoop2/ws/0.95-on-hadoop2/hbase-server/target/surefire/surefire5455417874589378250tmp> <https://builds.apache.org/job/hbase-0.95-on-hadoop2/ws/0.95-on-hadoop2/hbase-server/target/surefire/surefire_2375403559113079597816tmp>
Running org.apache.hadoop.hbase.mapreduce.TestImportTsv
Tests run: 5, Failures: 0, Errors: 0, Skipped: 0, Time elapsed: 221.271 sec
Forking command line: /bin/sh -c cd <https://builds.apache.org/job/hbase-0.95-on-hadoop2/ws/0.95-on-hadoop2/hbase-server> && /home/jenkins/tools/java/jdk1.6.0_45-32/jre/bin/java -enableassertions -Xmx1900m -XX:MaxPermSize=100m -Djava.security.egd=file:/dev/./urandom -Djava.net.preferIPv4Stack=true -jar <https://builds.apache.org/job/hbase-0.95-on-hadoop2/ws/0.95-on-hadoop2/hbase-server/target/surefire/surefirebooter2326210448325503827.jar> <https://builds.apache.org/job/hbase-0.95-on-hadoop2/ws/0.95-on-hadoop2/hbase-server/target/surefire/surefire2287952311624652054tmp> <https://builds.apache.org/job/hbase-0.95-on-hadoop2/ws/0.95-on-hadoop2/hbase-server/target/surefire/surefire_2384867766099474488057tmp>
Running org.apache.hadoop.hbase.mapreduce.TestTableInputFormatScan1
Tests run: 5, Failures: 0, Errors: 0, Skipped: 0, Time elapsed: 249.828 sec
Forking command line: /bin/sh -c cd <https://builds.apache.org/job/hbase-0.95-on-hadoop2/ws/0.95-on-hadoop2/hbase-server> && /home/jenkins/tools/java/jdk1.6.0_45-32/jre/bin/java -enableassertions -Xmx1900m -XX:MaxPermSize=100m -Djava.security.egd=file:/dev/./urandom -Djava.net.preferIPv4Stack=true -jar <https://builds.apache.org/job/hbase-0.95-on-hadoop2/ws/0.95-on-hadoop2/hbase-server/target/surefire/surefirebooter851727474319706487.jar> <https://builds.apache.org/job/hbase-0.95-on-hadoop2/ws/0.95-on-hadoop2/hbase-server/target/surefire/surefire5070718166929939325tmp> <https://builds.apache.org/job/hbase-0.95-on-hadoop2/ws/0.95-on-hadoop2/hbase-server/target/surefire/surefire_2397103609298160249508tmp>
Running org.apache.hadoop.hbase.mapreduce.TestWALPlayer
Tests run: 1, Failures: 0, Errors: 0, Skipped: 0, Time elapsed: 43.569 sec
Forking command line: /bin/sh -c cd <https://builds.apache.org/job/hbase-0.95-on-hadoop2/ws/0.95-on-hadoop2/hbase-server> && /home/jenkins/tools/java/jdk1.6.0_45-32/jre/bin/java -enableassertions -Xmx1900m -XX:MaxPermSize=100m -Djava.security.egd=file:/dev/./urandom -Djava.net.preferIPv4Stack=true -jar <https://builds.apache.org/job/hbase-0.95-on-hadoop2/ws/0.95-on-hadoop2/hbase-server/target/surefire/surefirebooter382586201550996083.jar> <https://builds.apache.org/job/hbase-0.95-on-hadoop2/ws/0.95-on-hadoop2/hbase-server/target/surefire/surefire7098380669551778304tmp> <https://builds.apache.org/job/hbase-0.95-on-hadoop2/ws/0.95-on-hadoop2/hbase-server/target/surefire/surefire_2405781216090966675395tmp>
Forking command line: /bin/sh -c cd <https://builds.apache.org/job/hbase-0.95-on-hadoop2/ws/0.95-on-hadoop2/hbase-server> && /home/jenkins/tools/java/jdk1.6.0_45-32/jre/bin/java -enableassertions -Xmx1900m -XX:MaxPermSize=100m -Djava.security.egd=file:/dev/./urandom -Djava.net.preferIPv4Stack=true -jar <https://builds.apache.org/job/hbase-0.95-on-hadoop2/ws/0.95-on-hadoop2/hbase-server/target/surefire/surefirebooter5732471670382955443.jar> <https://builds.apache.org/job/hbase-0.95-on-hadoop2/ws/0.95-on-hadoop2/hbase-server/target/surefire/surefire7107799556568943877tmp> <https://builds.apache.org/job/hbase-0.95-on-hadoop2/ws/0.95-on-hadoop2/hbase-server/target/surefire/surefire_2414720089992892501843tmp>
Running org.apache.hadoop.hbase.mapreduce.TestImportExport
Tests run: 5, Failures: 0, Errors: 0, Skipped: 0, Time elapsed: 300.966 sec
Forking command line: /bin/sh -c cd <https://builds.apache.org/job/hbase-0.95-on-hadoop2/ws/0.95-on-hadoop2/hbase-server> && /home/jenkins/tools/java/jdk1.6.0_45-32/jre/bin/java -enableassertions -Xmx1900m -XX:MaxPermSize=100m -Djava.security.egd=file:/dev/./urandom -Djava.net.preferIPv4Stack=true -jar <https://builds.apache.org/job/hbase-0.95-on-hadoop2/ws/0.95-on-hadoop2/hbase-server/target/surefire/surefirebooter1574098185616059449.jar> <https://builds.apache.org/job/hbase-0.95-on-hadoop2/ws/0.95-on-hadoop2/hbase-server/target/surefire/surefire7969445036296907216tmp> <https://builds.apache.org/job/hbase-0.95-on-hadoop2/ws/0.95-on-hadoop2/hbase-server/target/surefire/surefire_2425129398152855621849tmp>
Running org.apache.hadoop.hbase.mapreduce.TestMultithreadedTableMapper
Tests run: 1, Failures: 0, Errors: 0, Skipped: 0, Time elapsed: 126.989 sec
Forking command line: /bin/sh -c cd <https://builds.apache.org/job/hbase-0.95-on-hadoop2/ws/0.95-on-hadoop2/hbase-server> && /home/jenkins/tools/java/jdk1.6.0_45-32/jre/bin/java -enableassertions -Xmx1900m -XX:MaxPermSize=100m -Djava.security.egd=file:/dev/./urandom -Djava.net.preferIPv4Stack=true -jar <https://builds.apache.org/job/hbase-0.95-on-hadoop2/ws/0.95-on-hadoop2/hbase-server/target/surefire/surefirebooter8908551892603774354.jar> <https://builds.apache.org/job/hbase-0.95-on-hadoop2/ws/0.95-on-hadoop2/hbase-server/target/surefire/surefire6646205003875791927tmp> <https://builds.apache.org/job/hbase-0.95-on-hadoop2/ws/0.95-on-hadoop2/hbase-server/target/surefire/surefire_2433515190560736557383tmp>
Running org.apache.hadoop.hbase.mapreduce.TestSecureLoadIncrementalHFilesSplitRecovery
Tests run: 4, Failures: 0, Errors: 0, Skipped: 0, Time elapsed: 113.06 sec
Forking command line: /bin/sh -c cd <https://builds.apache.org/job/hbase-0.95-on-hadoop2/ws/0.95-on-hadoop2/hbase-server> && /home/jenkins/tools/java/jdk1.6.0_45-32/jre/bin/java -enableassertions -Xmx1900m -XX:MaxPermSize=100m -Djava.security.egd=file:/dev/./urandom -Djava.net.preferIPv4Stack=true -jar <https://builds.apache.org/job/hbase-0.95-on-hadoop2/ws/0.95-on-hadoop2/hbase-server/target/surefire/surefirebooter1679732243179145710.jar> <https://builds.apache.org/job/hbase-0.95-on-hadoop2/ws/0.95-on-hadoop2/hbase-server/target/surefire/surefire1910843904785690983tmp> <https://builds.apache.org/job/hbase-0.95-on-hadoop2/ws/0.95-on-hadoop2/hbase-server/target/surefire/surefire_244741100811785032039tmp>
Running org.apache.hadoop.hbase.mapreduce.TestLoadIncrementalHFiles
Tests run: 7, Failures: 0, Errors: 0, Skipped: 0, Time elapsed: 37.741 sec
Running org.apache.hadoop.hbase.mapreduce.TestHLogRecordReader
Tests run: 2, Failures: 0, Errors: 0, Skipped: 0, Time elapsed: 16.54 sec
Running org.apache.hadoop.hbase.mapreduce.TestTableInputFormatScan2
Tests run: 7, Failures: 0, Errors: 0, Skipped: 0, Time elapsed: 306.208 sec
Running org.apache.hadoop.hbase.mapreduce.TestTableMapReduce
Tests run: 2, Failures: 0, Errors: 0, Skipped: 0, Time elapsed: 215.246 sec
Running org.apache.hadoop.hbase.mapreduce.TestLoadIncrementalHFilesSplitRecovery
Tests run: 4, Failures: 0, Errors: 0, Skipped: 0, Time elapsed: 385.249 sec

Results :

Failed tests:   queueFailover(org.apache.hadoop.hbase.replication.TestReplicationQueueFailoverCompressed): Waited too much time for queueFailover replication. Waited 11856ms.
  testRaceForTask(org.apache.hadoop.hbase.regionserver.TestSplitLogWorker): Waiting timed out after [1,500] msec

Tests in error: 
  testDrainingServerWithAbort(org.apache.hadoop.hbase.TestDrainingServer): test timed out after 30000 milliseconds

Tests run: 1437, Failures: 2, Errors: 1, Skipped: 15

[INFO]                                                                         
[INFO] ------------------------------------------------------------------------
[INFO] Skipping HBase
[INFO] This project has been banned from the build due to previous failures.
[INFO] ------------------------------------------------------------------------
[INFO] ------------------------------------------------------------------------
[INFO] Reactor Summary:
[INFO] 
[INFO] HBase ............................................. SUCCESS [13.839s]
[INFO] HBase - Common .................................... SUCCESS [25.390s]
[INFO] HBase - Protocol .................................. SUCCESS [15.404s]
[INFO] HBase - Client .................................... SUCCESS [21.700s]
[INFO] HBase - Prefix Tree ............................... SUCCESS [3.644s]
[INFO] HBase - Hadoop Compatibility ...................... SUCCESS [5.449s]
[INFO] HBase - Hadoop Two Compatibility .................. SUCCESS [3.856s]
[INFO] HBase - Server .................................... FAILURE [1:02:46.452s]
[INFO] HBase - Integration Tests ......................... SKIPPED
[INFO] HBase - Examples .................................. SKIPPED
[INFO] HBase - Assembly .................................. SKIPPED
[INFO] ------------------------------------------------------------------------
[INFO] BUILD FAILURE
[INFO] ------------------------------------------------------------------------
[INFO] Total time: 1:04:21.341s
[INFO] Finished at: Mon Jul 15 12:21:04 UTC 2013
[INFO] Final Memory: 107M/426M
[INFO] ------------------------------------------------------------------------
[ERROR] Failed to execute goal org.apache.maven.plugins:maven-surefire-plugin:2.12-TRUNK-HBASE-2:test (secondPartTestsExecution) on project hbase-server: Failure or timeout -> [Help 1]
org.apache.maven.lifecycle.LifecycleExecutionException: Failed to execute goal org.apache.maven.plugins:maven-surefire-plugin:2.12-TRUNK-HBASE-2:test (secondPartTestsExecution) on project hbase-server: Failure or timeout
	at org.apache.maven.lifecycle.internal.MojoExecutor.execute(MojoExecutor.java:217)
	at org.apache.maven.lifecycle.internal.MojoExecutor.execute(MojoExecutor.java:153)
	at org.apache.maven.lifecycle.internal.MojoExecutor.execute(MojoExecutor.java:145)
	at org.apache.maven.lifecycle.internal.LifecycleModuleBuilder.buildProject(LifecycleModuleBuilder.java:84)
	at org.apache.maven.lifecycle.internal.LifecycleModuleBuilder.buildProject(LifecycleModuleBuilder.java:59)
	at org.apache.maven.lifecycle.internal.LifecycleStarter.singleThreadedBuild(LifecycleStarter.java:183)
	at org.apache.maven.lifecycle.internal.LifecycleStarter.execute(LifecycleStarter.java:161)
	at org.apache.maven.DefaultMaven.doExecute(DefaultMaven.java:320)
	at org.apache.maven.DefaultMaven.execute(DefaultMaven.java:156)
	at org.apache.maven.cli.MavenCli.execute(MavenCli.java:537)
	at org.apache.maven.cli.MavenCli.doMain(MavenCli.java:196)
	at org.apache.maven.cli.MavenCli.main(MavenCli.java:141)
	at sun.reflect.NativeMethodAccessorImpl.invoke0(Native Method)
	at sun.reflect.NativeMethodAccessorImpl.invoke(NativeMethodAccessorImpl.java:39)
	at sun.reflect.DelegatingMethodAccessorImpl.invoke(DelegatingMethodAccessorImpl.java:25)
	at java.lang.reflect.Method.invoke(Method.java:597)
	at org.codehaus.plexus.classworlds.launcher.Launcher.launchEnhanced(Launcher.java:290)
	at org.codehaus.plexus.classworlds.launcher.Launcher.launch(Launcher.java:230)
	at org.codehaus.plexus.classworlds.launcher.Launcher.mainWithExitCode(Launcher.java:409)
	at org.codehaus.plexus.classworlds.launcher.Launcher.main(Launcher.java:352)
Caused by: org.apache.maven.plugin.MojoExecutionException: Failure or timeout
	at org.apache.maven.plugin.surefire.SurefirePlugin.assertNoFailureOrTimeout(SurefirePlugin.java:643)
	at org.apache.maven.plugin.surefire.SurefirePlugin.handleSummary(SurefirePlugin.java:624)
	at org.apache.maven.plugin.surefire.AbstractSurefireMojo.executeAfterPreconditionsChecked(AbstractSurefireMojo.java:137)
	at org.apache.maven.plugin.surefire.AbstractSurefireMojo.execute(AbstractSurefireMojo.java:98)
	at org.apache.maven.plugin.DefaultBuildPluginManager.executeMojo(DefaultBuildPluginManager.java:101)
	at org.apache.maven.lifecycle.internal.MojoExecutor.execute(MojoExecutor.java:209)
	... 19 more
[ERROR] 
[ERROR] 
[ERROR] For more information about the errors and possible solutions, please read the following articles:
[ERROR] [Help 1] http://cwiki.apache.org/confluence/display/MAVEN/MojoExecutionException
[ERROR] 
[ERROR] After correcting the problems, you can resume the build with the command
[ERROR]   mvn <goals> -rf :hbase-server
Build step 'Invoke top-level Maven targets' marked build as failure
Archiving artifacts
Recording test results
Updating HBASE-8941

Mime
View raw message