hbase-builds mailing list archives

Site index · List index
Message view « Date » · « Thread »
Top « Date » · « Thread »
From Apache Jenkins Server <jenk...@builds.apache.org>
Subject Build failed in Jenkins: HBase-0.94 #1074
Date Thu, 25 Jul 2013 18:31:23 GMT
See <https://builds.apache.org/job/HBase-0.94/1074/changes>

Changes:

[larsgeorge] HBASE-8947 Thrift 2 : Replace "bool writeToWAL" with "TDurability durability"
(Hamed Madani)

------------------------------------------
[...truncated 5426 lines...]
[WARNING] <https://builds.apache.org/job/HBase-0.94/ws/trunk/src/main/java/org/apache/hadoop/hbase/util/FSUtils.java>:1352:
warning - @return tag has no arguments.
[WARNING] <https://builds.apache.org/job/HBase-0.94/ws/trunk/src/main/java/org/apache/hadoop/hbase/util/FSUtils.java>:132:
warning - DEFAULT_BUFFER_SIZE (referenced by @value tag) is an unknown reference.
[WARNING] <https://builds.apache.org/job/HBase-0.94/ws/trunk/src/main/java/org/apache/hadoop/hbase/util/FSUtils.java>:155:
warning - DEFAULT_BUFFER_SIZE (referenced by @value tag) is an unknown reference.
[WARNING] <https://builds.apache.org/job/HBase-0.94/ws/trunk/src/main/java/org/apache/hadoop/hbase/util/HBaseFsckRepair.java>:87:
warning - @param argument "conf" is not a parameter name.
[WARNING] <https://builds.apache.org/job/HBase-0.94/ws/trunk/src/main/java/org/apache/hadoop/hbase/util/HFileArchiveUtil.java>:50:
warning - @param argument "family" is not a parameter name.
[WARNING] <https://builds.apache.org/job/HBase-0.94/ws/trunk/src/main/java/org/apache/hadoop/hbase/util/RegionSplitter.java>:149:
warning - Tag @link: can't find rollingSplit(String, String, Configuration) in org.apache.hadoop.hbase.util.RegionSplitter
[WARNING] <https://builds.apache.org/job/HBase-0.94/ws/trunk/src/main/java/org/apache/hadoop/hbase/regionserver/ExplicitColumnTracker.java>:81:
warning - @param argument "ttl" is not a parameter name.
[WARNING] <https://builds.apache.org/job/HBase-0.94/ws/trunk/src/main/java/org/apache/hadoop/hbase/regionserver/HRegion.java>:439:
warning - @param argument "conf" is not a parameter name.
[WARNING] <https://builds.apache.org/job/HBase-0.94/ws/trunk/src/main/java/org/apache/hadoop/hbase/regionserver/HRegion.java>:4250:
warning - @param argument "boolean" is not a parameter name.
[WARNING] <https://builds.apache.org/job/HBase-0.94/ws/trunk/src/main/java/org/apache/hadoop/hbase/regionserver/HRegion.java>:4278:
warning - @param argument "boolean" is not a parameter name.
[WARNING] <https://builds.apache.org/job/HBase-0.94/ws/trunk/src/main/java/org/apache/hadoop/hbase/regionserver/HRegion.java>:4278:
warning - @param argument "boolean" is not a parameter name.
[WARNING] <https://builds.apache.org/job/HBase-0.94/ws/trunk/src/main/java/org/apache/hadoop/hbase/regionserver/RegionCoprocessorHost.java>:531:
warning - Tag @link: can't find preFlush(ObserverContext, Store, KeyValueScanner) in org.apache.hadoop.hbase.coprocessor.RegionObserver
[WARNING] <https://builds.apache.org/job/HBase-0.94/ws/trunk/src/main/java/org/apache/hadoop/hbase/regionserver/RegionSplitPolicy.java>:98:
warning - @return tag has no arguments.
[WARNING] <https://builds.apache.org/job/HBase-0.94/ws/trunk/src/main/java/org/apache/hadoop/hbase/regionserver/RegionSplitPolicy.java>:98:
warning - @param argument "htd" is not a parameter name.
[WARNING] <https://builds.apache.org/job/HBase-0.94/ws/trunk/src/main/java/org/apache/hadoop/hbase/regionserver/StoreFile.java>:94:
warning - Tag @link: can't find WriterBuilder in org.apache.hadoop.hbase.regionserver.StoreFile
[WARNING] <https://builds.apache.org/job/HBase-0.94/ws/trunk/src/main/java/org/apache/hadoop/hbase/regionserver/StoreFile.java>:254:
warning - @param argument "blockcache" is not a parameter name.
[WARNING] <https://builds.apache.org/job/HBase-0.94/ws/trunk/src/main/java/org/apache/hadoop/hbase/regionserver/StoreFileScanner.java>:218:
warning - @return tag has no arguments.
[WARNING] <https://builds.apache.org/job/HBase-0.94/ws/trunk/src/main/java/org/apache/hadoop/hbase/regionserver/metrics/OperationMetrics.java>:99:
warning - @param argument "conf" is not a parameter name.
[WARNING] <https://builds.apache.org/job/HBase-0.94/ws/trunk/src/main/java/org/apache/hadoop/hbase/regionserver/compactions/CompactionRequest.java>:124:
warning - @return tag has no arguments.
[WARNING] <https://builds.apache.org/job/HBase-0.94/ws/trunk/src/main/java/org/apache/hadoop/hbase/regionserver/compactions/CompactSelection.java>:129:
warning - @return tag has no arguments.
[WARNING] <https://builds.apache.org/job/HBase-0.94/ws/trunk/src/main/java/org/apache/hadoop/hbase/regionserver/compactions/CompactSelection.java>:129:
warning - @param argument "currentHour" is not a parameter name.
[WARNING] <https://builds.apache.org/job/HBase-0.94/ws/trunk/src/main/java/org/apache/hadoop/hbase/coprocessor/RegionObserver.java>:244:
warning - @param argument "scantype" is not a parameter name.
[WARNING] <https://builds.apache.org/job/HBase-0.94/ws/trunk/src/main/java/org/apache/hadoop/hbase/coprocessor/example/BulkDeleteProtocol.java>:82:
warning - @return tag has no arguments.
[WARNING] <https://builds.apache.org/job/HBase-0.94/ws/trunk/src/main/java/org/apache/hadoop/hbase/fs/HFileSystem.java>:56:
warning - @param argument "useHBaseChecksums" is not a parameter name.
[WARNING] <https://builds.apache.org/job/HBase-0.94/ws/trunk/src/main/java/org/apache/hadoop/hbase/mapreduce/MultithreadedTableMapper.java>:62:
warning - Tag @link: can't find setMapperClass(Configuration, Class) in org.apache.hadoop.hbase.mapreduce.MultithreadedTableMapper
[WARNING] <https://builds.apache.org/job/HBase-0.94/ws/trunk/src/main/java/org/apache/hadoop/hbase/mapreduce/MultithreadedTableMapper.java>:62:
warning - Missing closing '}' character for inline tag: "{@link #getNumberOfThreads(Configuration)
method. The default
[WARNING] value is 10 threads.
[WARNING] <p>"
[WARNING] <https://builds.apache.org/job/HBase-0.94/ws/trunk/src/main/java/org/apache/hadoop/hbase/thrift2/generated/TDelete.java>:84:
warning - Tag @see: reference not found: TDurability
[WARNING] <https://builds.apache.org/job/HBase-0.94/ws/trunk/src/main/java/org/apache/hadoop/hbase/thrift2/generated/TDelete.java>:463:
warning - Tag @see: reference not found: TDurability
[WARNING] <https://builds.apache.org/job/HBase-0.94/ws/trunk/src/main/java/org/apache/hadoop/hbase/thrift2/generated/TDelete.java>:471:
warning - Tag @see: reference not found: TDurability
[WARNING] <https://builds.apache.org/job/HBase-0.94/ws/trunk/src/main/java/org/apache/hadoop/hbase/thrift2/generated/TDelete.java>:102:
warning - Tag @see: reference not found: TDurability
[WARNING] <https://builds.apache.org/job/HBase-0.94/ws/trunk/src/main/java/org/apache/hadoop/hbase/thrift2/generated/TPut.java>:66:
warning - Tag @see: reference not found: TDurability
[WARNING] <https://builds.apache.org/job/HBase-0.94/ws/trunk/src/main/java/org/apache/hadoop/hbase/thrift2/generated/TPut.java>:399:
warning - Tag @see: reference not found: TDurability
[WARNING] <https://builds.apache.org/job/HBase-0.94/ws/trunk/src/main/java/org/apache/hadoop/hbase/thrift2/generated/TPut.java>:407:
warning - Tag @see: reference not found: TDurability
[WARNING] <https://builds.apache.org/job/HBase-0.94/ws/trunk/src/main/java/org/apache/hadoop/hbase/thrift2/generated/TPut.java>:79:
warning - Tag @see: reference not found: TDurability
[WARNING] <https://builds.apache.org/job/HBase-0.94/ws/trunk/src/main/java/org/apache/hadoop/hbase/client/HBaseAdmin.java>:510:
warning - @link: is an unknown tag.
[WARNING] <https://builds.apache.org/job/HBase-0.94/ws/trunk/src/main/java/org/apache/hadoop/hbase/client/HBaseAdmin.java>:510:
warning - @link: is an unknown tag.
[WARNING] <https://builds.apache.org/job/HBase-0.94/ws/trunk/src/main/java/org/apache/hadoop/hbase/client/HConnection.java>:297:
warning - Tag @link: can't find withoutRetries(ServerCallable) in org.apache.hadoop.hbase.client.HConnectionManager
[WARNING] <https://builds.apache.org/job/HBase-0.94/ws/trunk/src/main/java/org/apache/hadoop/hbase/client/HConnection.java>:284:
warning - Tag @link: can't find withoutRetries(ServerCallable) in org.apache.hadoop.hbase.client.HConnectionManager
[WARNING] <https://builds.apache.org/job/HBase-0.94/ws/trunk/src/main/java/org/apache/hadoop/hbase/client/HTable.java>:496:
warning - @param argument "startRow" is not a parameter name.
[WARNING] <https://builds.apache.org/job/HBase-0.94/ws/trunk/src/main/java/org/apache/hadoop/hbase/client/HTable.java>:496:
warning - @param argument "endRow" is not a parameter name.
[WARNING] <https://builds.apache.org/job/HBase-0.94/ws/trunk/src/main/java/org/apache/hadoop/hbase/client/HTableInterface.java>:512:
warning - Tag @link: can't find autoFlush in org.apache.hadoop.hbase.client.HTableInterface
[WARNING] <https://builds.apache.org/job/HBase-0.94/ws/trunk/src/main/java/org/apache/hadoop/hbase/client/HTableInterface.java>:512:
warning - Tag @link: can't find autoFlush in org.apache.hadoop.hbase.client.HTableInterface
[WARNING] <https://builds.apache.org/job/HBase-0.94/ws/trunk/src/main/java/org/apache/hadoop/hbase/client/HTableInterface.java>:512:
warning - Tag @link: can't find clearBufferOnFail in org.apache.hadoop.hbase.client.HTableInterface
[WARNING] <https://builds.apache.org/job/HBase-0.94/ws/trunk/src/main/java/org/apache/hadoop/hbase/client/HTableInterface.java>:274:
warning - @param argument "arm" is not a parameter name.
[WARNING] <https://builds.apache.org/job/HBase-0.94/ws/trunk/src/main/java/org/apache/hadoop/hbase/client/ServerCallable.java>:151:
warning - @param argument "<T>" is not a type parameter name.
[WARNING] <https://builds.apache.org/job/HBase-0.94/ws/trunk/src/main/java/org/apache/hadoop/hbase/client/ServerCallable.java>:210:
warning - @param argument "<T>" is not a type parameter name.
[WARNING] <https://builds.apache.org/job/HBase-0.94/ws/trunk/src/main/java/org/apache/hadoop/hbase/io/FileLink.java>:89:
warning - Tag @link: reference not found: CleanerChore
[WARNING] <https://builds.apache.org/job/HBase-0.94/ws/trunk/src/main/java/org/apache/hadoop/hbase/io/hfile/BlockCache.java>:56:
warning - Tag @see cannot be used in inline documentation.  It can only be used in the following
types of documentation: overview, package, class/interface, constructor, field, method.
[WARNING] <https://builds.apache.org/job/HBase-0.94/ws/trunk/src/main/java/org/apache/hadoop/hbase/io/hfile/BlockCache.java>:56:
warning - Tag @see cannot be used in inline documentation.  It can only be used in the following
types of documentation: overview, package, class/interface, constructor, field, method.
[WARNING] <https://builds.apache.org/job/HBase-0.94/ws/trunk/src/main/java/org/apache/hadoop/hbase/io/hfile/HFileBlock.java>:628:
warning - Tag @link: can't find startWriting(BlockType, boolean) in org.apache.hadoop.hbase.io.hfile.HFileBlock.Writer
[WARNING] <https://builds.apache.org/job/HBase-0.94/ws/trunk/src/main/java/org/apache/hadoop/hbase/io/hfile/HFileBlock.java>:628:
warning - Tag @link: can't find getHeaderAndData() in org.apache.hadoop.hbase.io.hfile.HFileBlock.Writer
[WARNING] <https://builds.apache.org/job/HBase-0.94/ws/trunk/src/main/java/org/apache/hadoop/hbase/io/hfile/HFileBlock.java>:734:
warning - @param argument "dataBlockEncoderAlgo" is not a parameter name.
[WARNING] <https://builds.apache.org/job/HBase-0.94/ws/trunk/src/main/java/org/apache/hadoop/hbase/io/hfile/HFileReaderV1.java>:418:
warning - @return tag has no arguments.
[WARNING] <https://builds.apache.org/job/HBase-0.94/ws/trunk/src/main/java/org/apache/hadoop/hbase/io/hfile/LruBlockCache.java>:355:
warning - Tag @see cannot be used in inline documentation.  It can only be used in the following
types of documentation: overview, package, class/interface, constructor, field, method.
[WARNING] <https://builds.apache.org/job/HBase-0.94/ws/trunk/src/main/java/org/apache/hadoop/hbase/io/hfile/BlockCache.java>:56:
warning - Tag @see cannot be used in inline documentation.  It can only be used in the following
types of documentation: overview, package, class/interface, constructor, field, method.
[WARNING] <https://builds.apache.org/job/HBase-0.94/ws/trunk/src/main/java/org/apache/hadoop/hbase/io/hfile/BlockCache.java>:56:
warning - Tag @see cannot be used in inline documentation.  It can only be used in the following
types of documentation: overview, package, class/interface, constructor, field, method.
[WARNING] <https://builds.apache.org/job/HBase-0.94/ws/trunk/src/main/java/org/apache/hadoop/hbase/replication/regionserver/ReplicationHLogReaderManager.java>:64:
warning - @return tag has no arguments.
[WARNING] <https://builds.apache.org/job/HBase-0.94/ws/trunk/src/main/java/org/apache/hadoop/hbase/ipc/HRegionInterface.java>:91:
warning - @param argument "region" is not a parameter name.
[WARNING] <https://builds.apache.org/job/HBase-0.94/ws/trunk/src/main/java/org/apache/hadoop/hbase/ipc/HRegionInterface.java>:99:
warning - @param argument "region" is not a parameter name.
[WARNING] <https://builds.apache.org/job/HBase-0.94/ws/trunk/src/main/java/org/apache/hadoop/hbase/ipc/HRegionInterface.java>:99:
warning - @param argument "timestamp" is not a parameter name.
[WARNING] <https://builds.apache.org/job/HBase-0.94/ws/trunk/src/main/java/org/apache/hadoop/hbase/ipc/HRegionInterface.java>:114:
warning - @param argument "region" is not a parameter name.
[WARNING] <https://builds.apache.org/job/HBase-0.94/ws/trunk/src/main/java/org/apache/hadoop/hbase/ipc/HRegionInterface.java>:114:
warning - @param argument "CF" is not a parameter name.
[WARNING] <https://builds.apache.org/job/HBase-0.94/ws/trunk/src/main/java/org/apache/hadoop/hbase/ipc/HRegionInterface.java>:123:
warning - @param argument "region" is not a parameter name.
[WARNING] <https://builds.apache.org/job/HBase-0.94/ws/trunk/src/main/java/org/apache/hadoop/hbase/ipc/HRegionInterface.java>:123:
warning - @param argument "CF" is not a parameter name.
[WARNING] <https://builds.apache.org/job/HBase-0.94/ws/trunk/src/main/java/org/apache/hadoop/hbase/ipc/HRegionInterface.java>:131:
warning - @param argument "region" is not a parameter name.
[WARNING] <https://builds.apache.org/job/HBase-0.94/ws/trunk/src/main/java/org/apache/hadoop/hbase/thrift2/generated/TDelete.java>:84:
warning - Tag @see: reference not found: TDurability
[WARNING] <https://builds.apache.org/job/HBase-0.94/ws/trunk/src/main/java/org/apache/hadoop/hbase/thrift2/generated/TPut.java>:66:
warning - Tag @see: reference not found: TDurability
[WARNING] <https://builds.apache.org/job/HBase-0.94/ws/trunk/src/main/java/org/apache/hadoop/hbase/HBaseIOException.java>:36:
warning - Tag @inheritDoc cannot be used in constructor documentation.  It can only be used
in the following types of documentation: method, inline text.
[WARNING] <https://builds.apache.org/job/HBase-0.94/ws/trunk/src/main/java/org/apache/hadoop/hbase/HBaseIOException.java>:43:
warning - Tag @inheritDoc cannot be used in constructor documentation.  It can only be used
in the following types of documentation: method, inline text.
[WARNING] <https://builds.apache.org/job/HBase-0.94/ws/trunk/src/main/java/org/apache/hadoop/hbase/HBaseIOException.java>:50:
warning - Tag @inheritDoc cannot be used in constructor documentation.  It can only be used
in the following types of documentation: method, inline text.
[INFO] Generating "Source Xref" report    --- maven-jxr-plugin:2.1
[INFO] Generating "Test Source Xref" report    --- maven-jxr-plugin:2.1
[INFO] Generating "RAT Report" report    --- apache-rat-plugin:0.8
[INFO] No excludes
[INFO] Generating "Surefire Report" report    --- maven-surefire-report-plugin:2.7.2
[INFO] 
[INFO] --- maven-antrun-plugin:1.6:run (arc-setup) @ hbase ---
[WARNING] Parameter tasks is deprecated, use target instead
[INFO] Executing tasks

main:
[INFO] Executed tasks
[INFO] 
[INFO] --- avro-maven-plugin:1.5.3:schema (generate-avro-sources) @ hbase ---
[INFO] 
[INFO] --- avro-maven-plugin:1.5.3:protocol (generate-avro-sources) @ hbase ---
[INFO] 
[INFO] --- maven-antrun-plugin:1.6:run (generate) @ hbase ---
[INFO] Executing tasks

main:
13/07/25 18:31:09 INFO mortbay.log: Logging to org.slf4j.impl.Log4jLoggerAdapter(org.mortbay.log)
via org.mortbay.log.Slf4jLog
[INFO] Executed tasks
[INFO] 
[INFO] --- build-helper-maven-plugin:1.5:add-source (jspcSource-packageInfo-Avro-source) @
hbase ---
[INFO] Source directory: <https://builds.apache.org/job/HBase-0.94/ws/trunk/target/generated-jamon>
added.
[INFO] Source directory: <https://builds.apache.org/job/HBase-0.94/ws/trunk/target/generated-sources/java>
added.
[INFO] 
[INFO] --- jamon-maven-plugin:2.3.4:translate (default) @ hbase ---
[INFO] 
[INFO] --- maven-remote-resources-plugin:1.1:process (default) @ hbase ---
[INFO] Setting property: classpath.resource.loader.class => 'org.codehaus.plexus.velocity.ContextClassLoaderResourceLoader'.
[INFO] Setting property: velocimacro.messages.on => 'false'.
[INFO] Setting property: resource.loader => 'classpath'.
[INFO] Setting property: resource.manager.logwhenfound => 'false'.
[INFO] 
[INFO] --- maven-resources-plugin:2.4:resources (default-resources) @ hbase ---
[INFO] Using 'UTF-8' encoding to copy filtered resources.
[INFO] Copying 1 resource
[INFO] Copying 12 resources
[INFO] Copying 3 resources
[INFO] 
[INFO] --- maven-antrun-plugin:1.6:run (default) @ hbase ---
[INFO] Executing tasks

main:
    [mkdir] Created dir: <https://builds.apache.org/job/HBase-0.94/ws/trunk/target/nativelib>
     [exec] tar: hadoop-snappy-nativelibs.tar: Cannot open: No such file or directory
     [exec] tar: Error is not recoverable: exiting now
     [exec] Result: 2
[INFO] Executed tasks
[INFO] 
[INFO] --- maven-compiler-plugin:2.5.1:compile (default-compile) @ hbase ---
[INFO] Compiling 831 source files to <https://builds.apache.org/job/HBase-0.94/ws/trunk/target/classes>
[INFO] -------------------------------------------------------------
[ERROR] COMPILATION ERROR : 
[INFO] -------------------------------------------------------------
[ERROR] <https://builds.apache.org/job/HBase-0.94/ws/trunk/src/main/java/org/apache/hadoop/hbase/util/Bytes.java>:[44,15]
sun.misc.Unsafe is Sun proprietary API and may be removed in a future release
[ERROR] <https://builds.apache.org/job/HBase-0.94/ws/trunk/src/main/java/org/apache/hadoop/hbase/thrift2/generated/TPut.java>:[66,9]
cannot find symbol
symbol  : class TDurability
location: class org.apache.hadoop.hbase.thrift2.generated.TPut
[ERROR] <https://builds.apache.org/job/HBase-0.94/ws/trunk/src/main/java/org/apache/hadoop/hbase/thrift2/generated/TPut.java>:[399,9]
cannot find symbol
symbol  : class TDurability
location: class org.apache.hadoop.hbase.thrift2.generated.TPut
[ERROR] <https://builds.apache.org/job/HBase-0.94/ws/trunk/src/main/java/org/apache/hadoop/hbase/thrift2/generated/TPut.java>:[407,28]
cannot find symbol
symbol  : class TDurability
location: class org.apache.hadoop.hbase.thrift2.generated.TPut
[ERROR] <https://builds.apache.org/job/HBase-0.94/ws/trunk/src/main/java/org/apache/hadoop/hbase/thrift2/ThriftUtilities.java>:[418,49]
cannot find symbol
symbol  : class TDurability
location: class org.apache.hadoop.hbase.thrift2.ThriftUtilities
[ERROR] <https://builds.apache.org/job/HBase-0.94/ws/trunk/src/main/java/org/apache/hadoop/hbase/thrift2/generated/TDelete.java>:[84,9]
cannot find symbol
symbol  : class TDurability
location: class org.apache.hadoop.hbase.thrift2.generated.TDelete
[ERROR] <https://builds.apache.org/job/HBase-0.94/ws/trunk/src/main/java/org/apache/hadoop/hbase/thrift2/generated/TDelete.java>:[463,9]
cannot find symbol
symbol  : class TDurability
location: class org.apache.hadoop.hbase.thrift2.generated.TDelete
[ERROR] <https://builds.apache.org/job/HBase-0.94/ws/trunk/src/main/java/org/apache/hadoop/hbase/thrift2/generated/TDelete.java>:[471,31]
cannot find symbol
symbol  : class TDurability
location: class org.apache.hadoop.hbase.thrift2.generated.TDelete
[ERROR] <https://builds.apache.org/job/HBase-0.94/ws/trunk/src/main/java/org/apache/hadoop/hbase/util/Bytes.java>:[1051,19]
sun.misc.Unsafe is Sun proprietary API and may be removed in a future release
[ERROR] <https://builds.apache.org/job/HBase-0.94/ws/trunk/src/main/java/org/apache/hadoop/hbase/util/Bytes.java>:[1057,21]
sun.misc.Unsafe is Sun proprietary API and may be removed in a future release
[ERROR] <https://builds.apache.org/job/HBase-0.94/ws/trunk/src/main/java/org/apache/hadoop/hbase/util/Bytes.java>:[1062,28]
sun.misc.Unsafe is Sun proprietary API and may be removed in a future release
[ERROR] <https://builds.apache.org/job/HBase-0.94/ws/trunk/src/main/java/org/apache/hadoop/hbase/thrift2/generated/TPut.java>:[167,92]
cannot find symbol
symbol  : class TDurability
location: class org.apache.hadoop.hbase.thrift2.generated.TPut
[ERROR] <https://builds.apache.org/job/HBase-0.94/ws/trunk/src/main/java/org/apache/hadoop/hbase/thrift2/generated/TPut.java>:[473,23]
cannot find symbol
symbol  : class TDurability
location: class org.apache.hadoop.hbase.thrift2.generated.TPut
[ERROR] <https://builds.apache.org/job/HBase-0.94/ws/trunk/src/main/java/org/apache/hadoop/hbase/thrift2/generated/TPut.java>:[852,34]
cannot find symbol
symbol  : variable TDurability
location: class org.apache.hadoop.hbase.thrift2.generated.TPut.TPutStandardScheme
[ERROR] <https://builds.apache.org/job/HBase-0.94/ws/trunk/src/main/java/org/apache/hadoop/hbase/thrift2/generated/TPut.java>:[1024,28]
cannot find symbol
symbol  : variable TDurability
location: class org.apache.hadoop.hbase.thrift2.generated.TPut.TPutTupleScheme
[ERROR] <https://builds.apache.org/job/HBase-0.94/ws/trunk/src/main/java/org/apache/hadoop/hbase/thrift2/generated/TDelete.java>:[194,92]
cannot find symbol
symbol  : class TDurability
location: class org.apache.hadoop.hbase.thrift2.generated.TDelete
[ERROR] <https://builds.apache.org/job/HBase-0.94/ws/trunk/src/main/java/org/apache/hadoop/hbase/thrift2/generated/TDelete.java>:[545,23]
cannot find symbol
symbol  : class TDurability
location: class org.apache.hadoop.hbase.thrift2.generated.TDelete
[ERROR] <https://builds.apache.org/job/HBase-0.94/ws/trunk/src/main/java/org/apache/hadoop/hbase/thrift2/generated/TDelete.java>:[965,34]
cannot find symbol
symbol  : variable TDurability
location: class org.apache.hadoop.hbase.thrift2.generated.TDelete.TDeleteStandardScheme
[ERROR] <https://builds.apache.org/job/HBase-0.94/ws/trunk/src/main/java/org/apache/hadoop/hbase/thrift2/generated/TDelete.java>:[1163,28]
cannot find symbol
symbol  : variable TDurability
location: class org.apache.hadoop.hbase.thrift2.generated.TDelete.TDeleteTupleScheme
[INFO] 19 errors 
[INFO] -------------------------------------------------------------
[INFO] ------------------------------------------------------------------------
[INFO] BUILD FAILURE
[INFO] ------------------------------------------------------------------------
[INFO] Total time: 2:38.283s
[INFO] Finished at: Thu Jul 25 18:31:21 UTC 2013
[INFO] Final Memory: 50M/542M
[INFO] ------------------------------------------------------------------------
[ERROR] Failed to execute goal org.apache.maven.plugins:maven-compiler-plugin:2.5.1:compile
(default-compile) on project hbase: Compilation failure: Compilation failure:
[ERROR] <https://builds.apache.org/job/HBase-0.94/ws/trunk/src/main/java/org/apache/hadoop/hbase/util/Bytes.java>:[44,15]
sun.misc.Unsafe is Sun proprietary API and may be removed in a future release
[ERROR] <https://builds.apache.org/job/HBase-0.94/ws/trunk/src/main/java/org/apache/hadoop/hbase/thrift2/generated/TPut.java>:[66,9]
cannot find symbol
[ERROR] symbol  : class TDurability
[ERROR] location: class org.apache.hadoop.hbase.thrift2.generated.TPut
[ERROR] <https://builds.apache.org/job/HBase-0.94/ws/trunk/src/main/java/org/apache/hadoop/hbase/thrift2/generated/TPut.java>:[399,9]
cannot find symbol
[ERROR] symbol  : class TDurability
[ERROR] location: class org.apache.hadoop.hbase.thrift2.generated.TPut
[ERROR] <https://builds.apache.org/job/HBase-0.94/ws/trunk/src/main/java/org/apache/hadoop/hbase/thrift2/generated/TPut.java>:[407,28]
cannot find symbol
[ERROR] symbol  : class TDurability
[ERROR] location: class org.apache.hadoop.hbase.thrift2.generated.TPut
[ERROR] <https://builds.apache.org/job/HBase-0.94/ws/trunk/src/main/java/org/apache/hadoop/hbase/thrift2/ThriftUtilities.java>:[418,49]
cannot find symbol
[ERROR] symbol  : class TDurability
[ERROR] location: class org.apache.hadoop.hbase.thrift2.ThriftUtilities
[ERROR] <https://builds.apache.org/job/HBase-0.94/ws/trunk/src/main/java/org/apache/hadoop/hbase/thrift2/generated/TDelete.java>:[84,9]
cannot find symbol
[ERROR] symbol  : class TDurability
[ERROR] location: class org.apache.hadoop.hbase.thrift2.generated.TDelete
[ERROR] <https://builds.apache.org/job/HBase-0.94/ws/trunk/src/main/java/org/apache/hadoop/hbase/thrift2/generated/TDelete.java>:[463,9]
cannot find symbol
[ERROR] symbol  : class TDurability
[ERROR] location: class org.apache.hadoop.hbase.thrift2.generated.TDelete
[ERROR] <https://builds.apache.org/job/HBase-0.94/ws/trunk/src/main/java/org/apache/hadoop/hbase/thrift2/generated/TDelete.java>:[471,31]
cannot find symbol
[ERROR] symbol  : class TDurability
[ERROR] location: class org.apache.hadoop.hbase.thrift2.generated.TDelete
[ERROR] <https://builds.apache.org/job/HBase-0.94/ws/trunk/src/main/java/org/apache/hadoop/hbase/util/Bytes.java>:[1051,19]
sun.misc.Unsafe is Sun proprietary API and may be removed in a future release
[ERROR] <https://builds.apache.org/job/HBase-0.94/ws/trunk/src/main/java/org/apache/hadoop/hbase/util/Bytes.java>:[1057,21]
sun.misc.Unsafe is Sun proprietary API and may be removed in a future release
[ERROR] <https://builds.apache.org/job/HBase-0.94/ws/trunk/src/main/java/org/apache/hadoop/hbase/util/Bytes.java>:[1062,28]
sun.misc.Unsafe is Sun proprietary API and may be removed in a future release
[ERROR] <https://builds.apache.org/job/HBase-0.94/ws/trunk/src/main/java/org/apache/hadoop/hbase/thrift2/generated/TPut.java>:[167,92]
cannot find symbol
[ERROR] symbol  : class TDurability
[ERROR] location: class org.apache.hadoop.hbase.thrift2.generated.TPut
[ERROR] <https://builds.apache.org/job/HBase-0.94/ws/trunk/src/main/java/org/apache/hadoop/hbase/thrift2/generated/TPut.java>:[473,23]
cannot find symbol
[ERROR] symbol  : class TDurability
[ERROR] location: class org.apache.hadoop.hbase.thrift2.generated.TPut
[ERROR] <https://builds.apache.org/job/HBase-0.94/ws/trunk/src/main/java/org/apache/hadoop/hbase/thrift2/generated/TPut.java>:[852,34]
cannot find symbol
[ERROR] symbol  : variable TDurability
[ERROR] location: class org.apache.hadoop.hbase.thrift2.generated.TPut.TPutStandardScheme
[ERROR] <https://builds.apache.org/job/HBase-0.94/ws/trunk/src/main/java/org/apache/hadoop/hbase/thrift2/generated/TPut.java>:[1024,28]
cannot find symbol
[ERROR] symbol  : variable TDurability
[ERROR] location: class org.apache.hadoop.hbase.thrift2.generated.TPut.TPutTupleScheme
[ERROR] <https://builds.apache.org/job/HBase-0.94/ws/trunk/src/main/java/org/apache/hadoop/hbase/thrift2/generated/TDelete.java>:[194,92]
cannot find symbol
[ERROR] symbol  : class TDurability
[ERROR] location: class org.apache.hadoop.hbase.thrift2.generated.TDelete
[ERROR] <https://builds.apache.org/job/HBase-0.94/ws/trunk/src/main/java/org/apache/hadoop/hbase/thrift2/generated/TDelete.java>:[545,23]
cannot find symbol
[ERROR] symbol  : class TDurability
[ERROR] location: class org.apache.hadoop.hbase.thrift2.generated.TDelete
[ERROR] <https://builds.apache.org/job/HBase-0.94/ws/trunk/src/main/java/org/apache/hadoop/hbase/thrift2/generated/TDelete.java>:[965,34]
cannot find symbol
[ERROR] symbol  : variable TDurability
[ERROR] location: class org.apache.hadoop.hbase.thrift2.generated.TDelete.TDeleteStandardScheme
[ERROR] <https://builds.apache.org/job/HBase-0.94/ws/trunk/src/main/java/org/apache/hadoop/hbase/thrift2/generated/TDelete.java>:[1163,28]
cannot find symbol
[ERROR] symbol  : variable TDurability
[ERROR] location: class org.apache.hadoop.hbase.thrift2.generated.TDelete.TDeleteTupleScheme
[ERROR] -> [Help 1]
[ERROR] 
[ERROR] To see the full stack trace of the errors, re-run Maven with the -e switch.
[ERROR] Re-run Maven using the -X switch to enable full debug logging.
[ERROR] 
[ERROR] For more information about the errors and possible solutions, please read the following
articles:
[ERROR] [Help 1] http://cwiki.apache.org/confluence/display/MAVEN/MojoFailureException
Build step 'Invoke top-level Maven targets' marked build as failure
Archiving artifacts
Error updating JIRA issues. Saving issues for next build.
com.atlassian.jira.rpc.exception.RemoteAuthenticationException: Attempt to log in user 'hudson'
failed. The maximum number of failed login attempts has been reached. Please log into the
application through the web interface to reset the number of failed login attempts.
Recording test results

Mime
View raw message