hbase-builds mailing list archives

Site index · List index
Message view « Date » · « Thread »
Top « Date » · « Thread »
From apurt...@apache.org
Subject Build failed in Jenkins: HBase-0.95 #628
Date Mon, 15 Jul 2013 22:28:22 GMT
See <http://54.241.6.143/job/HBase-0.95/628/changes>

Changes:

[Michael Stack] HBASE-8953 TestFromClientSide.testClientPoolThreadLocal fails; DEBUG

[Andrew Purtell] HBASE-8944. Document workaround for MiniDFSCluster exceptions when running
tests

[Michael Stack] Fix mistake spotted by Benoit

[jxiang] HBASE-8662 [rest] support impersonation - ADDENDUM 2

[jxiang] HBASE-8662 [rest] support impersonation - ADDENDUM

[jxiang] HBASE-8662 [rest] support impersonation

------------------------------------------
[...truncated 7143 lines...]

[JENKINS] Recording test results
[INFO] 
[INFO] --- maven-jar-plugin:2.4:test-jar (default) @ hbase-server ---
[INFO] Building jar: <http://54.241.6.143/job/HBase-0.95/ws/hbase-server/target/hbase-server-0.97.0-SNAPSHOT-tests.jar>
[INFO] 
[INFO] --- maven-source-plugin:2.2.1:jar-no-fork (attach-sources) @ hbase-server ---
[INFO] Building jar: <http://54.241.6.143/job/HBase-0.95/ws/hbase-server/target/hbase-server-0.97.0-SNAPSHOT-sources.jar>
[INFO] 
[INFO] --- maven-jar-plugin:2.4:jar (default-jar) @ hbase-server ---
[INFO] Building jar: <http://54.241.6.143/job/HBase-0.95/ws/hbase-server/target/hbase-server-0.97.0-SNAPSHOT.jar>
[INFO] [INFO] Installing <http://54.241.6.143/job/HBase-0.95/ws/hbase-server/target/hbase-server-0.97.0-SNAPSHOT.jar>
to /home/ec2-user/jenkins/maven-repositories/0/org/apache/hbase/hbase-server/0.97.0-SNAPSHOT/hbase-server-0.97.0-SNAPSHOT.jar

[INFO] --- maven-install-plugin:2.3.1:install (default-install) @ hbase-server ---
[INFO] Installing <http://54.241.6.143/job/HBase-0.95/ws/hbase-server/pom.xml> to /home/ec2-user/jenkins/maven-repositories/0/org/apache/hbase/hbase-server/0.97.0-SNAPSHOT/hbase-server-0.97.0-SNAPSHOT.pom
[INFO] Installing <http://54.241.6.143/job/HBase-0.95/ws/hbase-server/target/hbase-server-0.97.0-SNAPSHOT-tests.jar>
to /home/ec2-user/jenkins/maven-repositories/0/org/apache/hbase/hbase-server/0.97.0-SNAPSHOT/hbase-server-0.97.0-SNAPSHOT-tests.jar
[INFO] Installing <http://54.241.6.143/job/HBase-0.95/ws/hbase-server/target/hbase-server-0.97.0-SNAPSHOT-sources.jar>
to /home/ec2-user/jenkins/maven-repositories/0/org/apache/hbase/hbase-server/0.97.0-SNAPSHOT/hbase-server-0.97.0-SNAPSHOT-sources.jar
[INFO]                                                                         
[INFO] ------------------------------------------------------------------------Downloading:
http://people.apache.org/~garyh/mvn/org/apache/maven/plugins/maven-failsafe-plugin/2.12-TRUNK-HBASE-2/maven-failsafe-plugin-2.12-TRUNK-HBASE-2.pom

[INFO] Building HBase - Integration Tests 0.97.0-SNAPSHOT
[INFO] ------------------------------------------------------------------------
Downloaded: http://people.apache.org/~garyh/mvn/org/apache/maven/plugins/maven-failsafe-plugin/2.12-TRUNK-HBASE-2/maven-failsafe-plugin-2.12-TRUNK-HBASE-2.pom
(13 KB at 68.6 KB/sec)
Downloading: http://people.apache.org/~garyh/mvn/org/apache/maven/plugins/maven-failsafe-plugin/2.12-TRUNK-HBASE-2/maven-failsafe-plugin-2.12-TRUNK-HBASE-2.jar
Downloaded: http://people.apache.org/~garyh/mvn/org/apache/maven/plugins/maven-failsafe-plugin/2.12-TRUNK-HBASE-2/maven-failsafe-plugin-2.12-TRUNK-HBASE-2.jar
(48 KB at 343.5 KB/sec)
[INFO] 
[INFO] --- maven-remote-resources-plugin:1.4:process (default) @ hbase-it ---
[INFO] [INFO] Using 'UTF-8' encoding to copy filtered resources.
[INFO] skip non existing resourceDirectory <http://54.241.6.143/job/HBase-0.95/ws/hbase-it/src/main/resources>
[INFO] Copying 3 resources

[INFO] --- maven-resources-plugin:2.6:resources (default-resources) @ hbase-it ---
[INFO] [INFO] No sources to compile

[INFO] --- maven-compiler-plugin:2.5.1:compile (default-compile) @ hbase-it ---
[INFO] [INFO] Using 'UTF-8' encoding to copy filtered resources.

[INFO] [INFO] Copying 7 resources
--- maven-resources-plugin:2.6:testResources (default-testResources) @ hbase-it ---
[INFO] Copying 3 resources
[INFO] 
[INFO] [INFO] Compiling 18 source files to <http://54.241.6.143/job/HBase-0.95/ws/hbase-it/target/test-classes>
--- maven-compiler-plugin:2.5.1:testCompile (default-testCompile) @ hbase-it ---
[INFO] [INFO] Surefire report directory: <http://54.241.6.143/job/HBase-0.95/ws/hbase-it/target/surefire-reports>

[INFO] Using configured provider org.apache.maven.surefire.junitcore.JUnitCoreProvider
[INFO] --- maven-surefire-plugin:2.12-TRUNK-HBASE-2:test (default-test) @ hbase-it ---

-------------------------------------------------------
 T E S T S
-------------------------------------------------------

Results :

Tests run: 0, Failures: 0, Errors: 0, Skipped: 0

[JENKINS] Recording test results
[INFO] 
[INFO] --- maven-surefire-plugin:2.12-TRUNK-HBASE-2:test (secondPartTestsExecution) @ hbase-it
---
[INFO] Surefire report directory: <http://54.241.6.143/job/HBase-0.95/ws/hbase-it/target/surefire-reports>
[INFO] Using configured provider org.apache.maven.surefire.junitcore.JUnitCoreProvider

-------------------------------------------------------
 T E S T S
-------------------------------------------------------

-------------------------------------------------------
 T E S T S
-------------------------------------------------------

Results :

Tests run: 0, Failures: 0, Errors: 0, Skipped: 0

[JENKINS] Recording test results
[INFO] 
[INFO] --- maven-jar-plugin:2.4:test-jar (default) @ hbase-it ---
[INFO] Building jar: <http://54.241.6.143/job/HBase-0.95/ws/hbase-it/target/hbase-it-0.97.0-SNAPSHOT-tests.jar>
[INFO] 
[INFO] --- maven-jar-plugin:2.4:jar (default-jar) @ hbase-it ---
[INFO] Building jar: <http://54.241.6.143/job/HBase-0.95/ws/hbase-it/target/hbase-it-0.97.0-SNAPSHOT.jar>
[INFO] 
[INFO] --- maven-failsafe-plugin:2.12-TRUNK-HBASE-2:integration-test (integration-test) @
hbase-it ---
Downloading: http://people.apache.org/~garyh/mvn/org/apache/maven/surefire/surefire-junit4/2.12-TRUNK-HBASE-2/surefire-junit4-2.12-TRUNK-HBASE-2.pom
Downloaded: http://people.apache.org/~garyh/mvn/org/apache/maven/surefire/surefire-junit4/2.12-TRUNK-HBASE-2/surefire-junit4-2.12-TRUNK-HBASE-2.pom
(3 KB at 31.0 KB/sec)
Downloading: http://people.apache.org/~garyh/mvn/org/apache/maven/surefire/surefire-junit4/2.12-TRUNK-HBASE-2/surefire-junit4-2.12-TRUNK-HBASE-2.jar
Downloaded: http://people.apache.org/~garyh/mvn/org/apache/maven/surefire/surefire-junit4/2.12-TRUNK-HBASE-2/surefire-junit4-2.12-TRUNK-HBASE-2.jar
(33 KB at 424.1 KB/sec)
[INFO] Failsafe report directory: <http://54.241.6.143/job/HBase-0.95/ws/hbase-it/target/failsafe-reports>
[INFO] Using configured provider org.apache.maven.surefire.junit4.JUnit4Provider

-------------------------------------------------------
 T E S T S
-------------------------------------------------------

-------------------------------------------------------
 T E S T S
-------------------------------------------------------
Running org.apache.hadoop.hbase.mapreduce.IntegrationTestBulkLoad
Tests run: 1, Failures: 0, Errors: 0, Skipped: 0, Time elapsed: 157.469 sec
Running org.apache.hadoop.hbase.mapreduce.IntegrationTestImportTsv
Tests run: 2, Failures: 0, Errors: 0, Skipped: 0, Time elapsed: 21.348 sec
Running org.apache.hadoop.hbase.mttr.IntegrationTestMTTR
Tests run: 4, Failures: 0, Errors: 1, Skipped: 0, Time elapsed: 740.749 sec <<< FAILURE!
Running org.apache.hadoop.hbase.IntegrationTestManyRegions
Tests run: 1, Failures: 0, Errors: 0, Skipped: 0, Time elapsed: 86.889 sec
Running org.apache.hadoop.hbase.test.IntegrationTestBigLinkedListWithChaosMonkey
Tests run: 1, Failures: 0, Errors: 0, Skipped: 0, Time elapsed: 110.08 sec
Running org.apache.hadoop.hbase.test.IntegrationTestLoadAndVerify
Tests run: 1, Failures: 0, Errors: 0, Skipped: 0, Time elapsed: 25.992 sec
Running org.apache.hadoop.hbase.test.IntegrationTestBigLinkedList
Tests run: 1, Failures: 0, Errors: 0, Skipped: 0, Time elapsed: 176.179 sec
Running org.apache.hadoop.hbase.IntegrationTestDataIngestWithChaosMonkey
Tests run: 1, Failures: 0, Errors: 0, Skipped: 0, Time elapsed: 339.42 sec
Running org.apache.hadoop.hbase.IntegrationTestLazyCfLoading
Tests run: 1, Failures: 0, Errors: 0, Skipped: 0, Time elapsed: 123.144 sec
Running org.apache.hadoop.hbase.IntegrationTestRebalanceAndKillServersTargeted
Tests run: 1, Failures: 0, Errors: 0, Skipped: 0, Time elapsed: 323.478 sec
Running org.apache.hadoop.hbase.IntegrationTestDataIngestSlowDeterministic

Results :

Tests in error: 
  testMoveRegion(org.apache.hadoop.hbase.mttr.IntegrationTestMTTR): org.apache.hadoop.hbase.exceptions.MasterNotRunningException:
Connection was closed while trying to get master

Tests run: 14, Failures: 0, Errors: 1, Skipped: 0

[WARNING] File encoding has not been set, using platform encoding UTF-8, i.e. build is platform
dependent!
[JENKINS] Recording test results
[INFO] [INFO] Failsafe report directory: <http://54.241.6.143/job/HBase-0.95/ws/hbase-it/target/failsafe-reports>
[WARNING] File encoding has not been set, using platform encoding UTF-8, i.e. build is platform
dependent!

[INFO] --- maven-failsafe-plugin:2.12-TRUNK-HBASE-2:verify (verify) @ hbase-it ---
[JENKINS] Recording test results
[INFO]                                                                         
[INFO] ------------------------------------------------------------------------
[INFO] Skipping HBase
[INFO] This project has been banned from the build due to previous failures.
[INFO] ------------------------------------------------------------------------
[INFO]                                                                         
[INFO] ------------------------------------------------------------------------
[INFO] Skipping HBase
[INFO] This project has been banned from the build due to previous failures.
[INFO] ------------------------------------------------------------------------
[INFO] ------------------------------------------------------------------------
[INFO] Reactor Summary:
[INFO] 
[INFO] HBase ............................................. SUCCESS [42.351s]
[INFO] HBase - Common .................................... SUCCESS [1:30.489s]
[INFO] HBase - Protocol .................................. SUCCESS [18.710s]
[INFO] HBase - Client .................................... SUCCESS [25.827s]
[INFO] HBase - Prefix Tree ............................... SUCCESS [4.767s]
[INFO] HBase - Hadoop Compatibility ...................... SUCCESS [5.887s]
[INFO] HBase - Hadoop One Compatibility .................. SUCCESS [12.758s]
[INFO] HBase - Server .................................... SUCCESS [55:35.051s]
[INFO] HBase - Integration Tests ......................... FAILURE [1:05:15.971s]
[INFO] HBase - Examples .................................. SKIPPED
[INFO] HBase - Assembly .................................. SKIPPED
[INFO] ------------------------------------------------------------------------
[INFO] BUILD FAILURE
[INFO] ------------------------------------------------------------------------
[INFO] Total time: 2:04:44.703s
[INFO] Finished at: Mon Jul 15 22:28:00 UTC 2013
[INFO] Final Memory: 68M/513M
[INFO] ------------------------------------------------------------------------
[JENKINS] Archiving <http://54.241.6.143/job/HBase-0.95/ws/hbase-common/pom.xml> to
/var/lib/jenkins/jobs/HBase-0.95/modules/org.apache.hbase$hbase-common/builds/2013-07-15_20-23-09/archive/org.apache.hbase/hbase-common/0.97.0-SNAPSHOT/hbase-common-0.97.0-SNAPSHOT.pom
[JENKINS] Archiving <http://54.241.6.143/job/HBase-0.95/ws/hbase-common/target/hbase-common-0.97.0-SNAPSHOT.jar>
to /var/lib/jenkins/jobs/HBase-0.95/modules/org.apache.hbase$hbase-common/builds/2013-07-15_20-23-09/archive/org.apache.hbase/hbase-common/0.97.0-SNAPSHOT/hbase-common-0.97.0-SNAPSHOT.jar
[JENKINS] Archiving <http://54.241.6.143/job/HBase-0.95/ws/hbase-common/target/hbase-common-0.97.0-SNAPSHOT-sources.jar>
to /var/lib/jenkins/jobs/HBase-0.95/modules/org.apache.hbase$hbase-common/builds/2013-07-15_20-23-09/archive/org.apache.hbase/hbase-common/0.97.0-SNAPSHOT/hbase-common-0.97.0-SNAPSHOT-sources.jar
[JENKINS] Archiving <http://54.241.6.143/job/HBase-0.95/ws/hbase-common/target/hbase-common-0.97.0-SNAPSHOT-tests.jar>
to /var/lib/jenkins/jobs/HBase-0.95/modules/org.apache.hbase$hbase-common/builds/2013-07-15_20-23-09/archive/org.apache.hbase/hbase-common/0.97.0-SNAPSHOT/hbase-common-0.97.0-SNAPSHOT-tests.jar
[JENKINS] Archiving <http://54.241.6.143/job/HBase-0.95/ws/hbase-hadoop-compat/pom.xml>
to /var/lib/jenkins/jobs/HBase-0.95/modules/org.apache.hbase$hbase-hadoop-compat/builds/2013-07-15_20-23-09/archive/org.apache.hbase/hbase-hadoop-compat/0.97.0-SNAPSHOT/hbase-hadoop-compat-0.97.0-SNAPSHOT.pom
[JENKINS] Archiving <http://54.241.6.143/job/HBase-0.95/ws/hbase-hadoop-compat/target/hbase-hadoop-compat-0.97.0-SNAPSHOT.jar>
to /var/lib/jenkins/jobs/HBase-0.95/modules/org.apache.hbase$hbase-hadoop-compat/builds/2013-07-15_20-23-09/archive/org.apache.hbase/hbase-hadoop-compat/0.97.0-SNAPSHOT/hbase-hadoop-compat-0.97.0-SNAPSHOT.jar
[JENKINS] Archiving <http://54.241.6.143/job/HBase-0.95/ws/hbase-hadoop-compat/target/hbase-hadoop-compat-0.97.0-SNAPSHOT-sources.jar>
to /var/lib/jenkins/jobs/HBase-0.95/modules/org.apache.hbase$hbase-hadoop-compat/builds/2013-07-15_20-23-09/archive/org.apache.hbase/hbase-hadoop-compat/0.97.0-SNAPSHOT/hbase-hadoop-compat-0.97.0-SNAPSHOT-sources.jar
[JENKINS] Archiving <http://54.241.6.143/job/HBase-0.95/ws/hbase-hadoop-compat/target/hbase-hadoop-compat-0.97.0-SNAPSHOT-tests.jar>
to /var/lib/jenkins/jobs/HBase-0.95/modules/org.apache.hbase$hbase-hadoop-compat/builds/2013-07-15_20-23-09/archive/org.apache.hbase/hbase-hadoop-compat/0.97.0-SNAPSHOT/hbase-hadoop-compat-0.97.0-SNAPSHOT-tests.jar
[JENKINS] Archiving <http://54.241.6.143/job/HBase-0.95/ws/hbase-examples/pom.xml> to
/var/lib/jenkins/jobs/HBase-0.95/modules/org.apache.hbase$hbase-examples/builds/2013-07-15_20-23-09/archive/org.apache.hbase/hbase-examples/0.97.0-SNAPSHOT/hbase-examples-0.97.0-SNAPSHOT.pom
[JENKINS] Archiving <http://54.241.6.143/job/HBase-0.95/ws/hbase-it/pom.xml> to /var/lib/jenkins/jobs/HBase-0.95/modules/org.apache.hbase$hbase-it/builds/2013-07-15_20-23-09/archive/org.apache.hbase/hbase-it/0.97.0-SNAPSHOT/hbase-it-0.97.0-SNAPSHOT.pom
[JENKINS] Archiving <http://54.241.6.143/job/HBase-0.95/ws/hbase-it/target/hbase-it-0.97.0-SNAPSHOT.jar>
to /var/lib/jenkins/jobs/HBase-0.95/modules/org.apache.hbase$hbase-it/builds/2013-07-15_20-23-09/archive/org.apache.hbase/hbase-it/0.97.0-SNAPSHOT/hbase-it-0.97.0-SNAPSHOT.jar
[JENKINS] Archiving <http://54.241.6.143/job/HBase-0.95/ws/hbase-it/target/hbase-it-0.97.0-SNAPSHOT-tests.jar>
to /var/lib/jenkins/jobs/HBase-0.95/modules/org.apache.hbase$hbase-it/builds/2013-07-15_20-23-09/archive/org.apache.hbase/hbase-it/0.97.0-SNAPSHOT/hbase-it-0.97.0-SNAPSHOT-tests.jar
[JENKINS] Archiving <http://54.241.6.143/job/HBase-0.95/ws/pom.xml> to /var/lib/jenkins/jobs/HBase-0.95/modules/org.apache.hbase$hbase/builds/2013-07-15_20-23-09/archive/org.apache.hbase/hbase/0.97.0-SNAPSHOT/hbase-0.97.0-SNAPSHOT.pom
[JENKINS] Archiving <http://54.241.6.143/job/HBase-0.95/ws/target/hbase-0.97.0-SNAPSHOT-site.xml>
to /var/lib/jenkins/jobs/HBase-0.95/modules/org.apache.hbase$hbase/builds/2013-07-15_20-23-09/archive/org.apache.hbase/hbase/0.97.0-SNAPSHOT/hbase-0.97.0-SNAPSHOT-site.xml
[JENKINS] Archiving <http://54.241.6.143/job/HBase-0.95/ws/hbase-assembly/pom.xml> to
/var/lib/jenkins/jobs/HBase-0.95/modules/org.apache.hbase$hbase-assembly/builds/2013-07-15_20-23-09/archive/org.apache.hbase/hbase-assembly/0.97.0-SNAPSHOT/hbase-assembly-0.97.0-SNAPSHOT.pom
[JENKINS] Archiving <http://54.241.6.143/job/HBase-0.95/ws/hbase-client/pom.xml> to
/var/lib/jenkins/jobs/HBase-0.95/modules/org.apache.hbase$hbase-client/builds/2013-07-15_20-23-09/archive/org.apache.hbase/hbase-client/0.97.0-SNAPSHOT/hbase-client-0.97.0-SNAPSHOT.pom
[JENKINS] Archiving <http://54.241.6.143/job/HBase-0.95/ws/hbase-client/target/hbase-client-0.97.0-SNAPSHOT.jar>
to /var/lib/jenkins/jobs/HBase-0.95/modules/org.apache.hbase$hbase-client/builds/2013-07-15_20-23-09/archive/org.apache.hbase/hbase-client/0.97.0-SNAPSHOT/hbase-client-0.97.0-SNAPSHOT.jar
[JENKINS] Archiving <http://54.241.6.143/job/HBase-0.95/ws/hbase-client/target/hbase-client-0.97.0-SNAPSHOT-sources.jar>
to /var/lib/jenkins/jobs/HBase-0.95/modules/org.apache.hbase$hbase-client/builds/2013-07-15_20-23-09/archive/org.apache.hbase/hbase-client/0.97.0-SNAPSHOT/hbase-client-0.97.0-SNAPSHOT-sources.jar
[JENKINS] Archiving <http://54.241.6.143/job/HBase-0.95/ws/hbase-client/target/hbase-client-0.97.0-SNAPSHOT-tests.jar>
to /var/lib/jenkins/jobs/HBase-0.95/modules/org.apache.hbase$hbase-client/builds/2013-07-15_20-23-09/archive/org.apache.hbase/hbase-client/0.97.0-SNAPSHOT/hbase-client-0.97.0-SNAPSHOT-tests.jar
[JENKINS] Archiving <http://54.241.6.143/job/HBase-0.95/ws/hbase-prefix-tree/pom.xml>
to /var/lib/jenkins/jobs/HBase-0.95/modules/org.apache.hbase$hbase-prefix-tree/builds/2013-07-15_20-23-09/archive/org.apache.hbase/hbase-prefix-tree/0.97.0-SNAPSHOT/hbase-prefix-tree-0.97.0-SNAPSHOT.pom
[JENKINS] Archiving <http://54.241.6.143/job/HBase-0.95/ws/hbase-prefix-tree/target/hbase-prefix-tree-0.97.0-SNAPSHOT.jar>
to /var/lib/jenkins/jobs/HBase-0.95/modules/org.apache.hbase$hbase-prefix-tree/builds/2013-07-15_20-23-09/archive/org.apache.hbase/hbase-prefix-tree/0.97.0-SNAPSHOT/hbase-prefix-tree-0.97.0-SNAPSHOT.jar
[JENKINS] Archiving <http://54.241.6.143/job/HBase-0.95/ws/hbase-prefix-tree/target/hbase-prefix-tree-0.97.0-SNAPSHOT-sources.jar>
to /var/lib/jenkins/jobs/HBase-0.95/modules/org.apache.hbase$hbase-prefix-tree/builds/2013-07-15_20-23-09/archive/org.apache.hbase/hbase-prefix-tree/0.97.0-SNAPSHOT/hbase-prefix-tree-0.97.0-SNAPSHOT-sources.jar
[JENKINS] Archiving <http://54.241.6.143/job/HBase-0.95/ws/hbase-prefix-tree/target/hbase-prefix-tree-0.97.0-SNAPSHOT-tests.jar>
to /var/lib/jenkins/jobs/HBase-0.95/modules/org.apache.hbase$hbase-prefix-tree/builds/2013-07-15_20-23-09/archive/org.apache.hbase/hbase-prefix-tree/0.97.0-SNAPSHOT/hbase-prefix-tree-0.97.0-SNAPSHOT-tests.jar
[JENKINS] Archiving <http://54.241.6.143/job/HBase-0.95/ws/hbase-protocol/pom.xml> to
/var/lib/jenkins/jobs/HBase-0.95/modules/org.apache.hbase$hbase-protocol/builds/2013-07-15_20-23-09/archive/org.apache.hbase/hbase-protocol/0.97.0-SNAPSHOT/hbase-protocol-0.97.0-SNAPSHOT.pom
[JENKINS] Archiving <http://54.241.6.143/job/HBase-0.95/ws/hbase-protocol/target/hbase-protocol-0.97.0-SNAPSHOT.jar>
to /var/lib/jenkins/jobs/HBase-0.95/modules/org.apache.hbase$hbase-protocol/builds/2013-07-15_20-23-09/archive/org.apache.hbase/hbase-protocol/0.97.0-SNAPSHOT/hbase-protocol-0.97.0-SNAPSHOT.jar
[JENKINS] Archiving <http://54.241.6.143/job/HBase-0.95/ws/hbase-protocol/target/hbase-protocol-0.97.0-SNAPSHOT-sources.jar>
to /var/lib/jenkins/jobs/HBase-0.95/modules/org.apache.hbase$hbase-protocol/builds/2013-07-15_20-23-09/archive/org.apache.hbase/hbase-protocol/0.97.0-SNAPSHOT/hbase-protocol-0.97.0-SNAPSHOT-sources.jar
[JENKINS] Archiving <http://54.241.6.143/job/HBase-0.95/ws/hbase-protocol/target/hbase-protocol-0.97.0-SNAPSHOT-tests.jar>
to /var/lib/jenkins/jobs/HBase-0.95/modules/org.apache.hbase$hbase-protocol/builds/2013-07-15_20-23-09/archive/org.apache.hbase/hbase-protocol/0.97.0-SNAPSHOT/hbase-protocol-0.97.0-SNAPSHOT-tests.jar
[JENKINS] Archiving <http://54.241.6.143/job/HBase-0.95/ws/hbase-hadoop1-compat/pom.xml>
to /var/lib/jenkins/jobs/HBase-0.95/modules/org.apache.hbase$hbase-hadoop1-compat/builds/2013-07-15_20-23-09/archive/org.apache.hbase/hbase-hadoop1-compat/0.97.0-SNAPSHOT/hbase-hadoop1-compat-0.97.0-SNAPSHOT.pom
[JENKINS] Archiving <http://54.241.6.143/job/HBase-0.95/ws/hbase-hadoop1-compat/target/hbase-hadoop1-compat-0.97.0-SNAPSHOT.jar>
to /var/lib/jenkins/jobs/HBase-0.95/modules/org.apache.hbase$hbase-hadoop1-compat/builds/2013-07-15_20-23-09/archive/org.apache.hbase/hbase-hadoop1-compat/0.97.0-SNAPSHOT/hbase-hadoop1-compat-0.97.0-SNAPSHOT.jar
[JENKINS] Archiving <http://54.241.6.143/job/HBase-0.95/ws/hbase-hadoop1-compat/target/hbase-hadoop1-compat-0.97.0-SNAPSHOT-sources.jar>
to /var/lib/jenkins/jobs/HBase-0.95/modules/org.apache.hbase$hbase-hadoop1-compat/builds/2013-07-15_20-23-09/archive/org.apache.hbase/hbase-hadoop1-compat/0.97.0-SNAPSHOT/hbase-hadoop1-compat-0.97.0-SNAPSHOT-sources.jar
[JENKINS] Archiving <http://54.241.6.143/job/HBase-0.95/ws/hbase-hadoop1-compat/target/hbase-hadoop1-compat-0.97.0-SNAPSHOT-tests.jar>
to /var/lib/jenkins/jobs/HBase-0.95/modules/org.apache.hbase$hbase-hadoop1-compat/builds/2013-07-15_20-23-09/archive/org.apache.hbase/hbase-hadoop1-compat/0.97.0-SNAPSHOT/hbase-hadoop1-compat-0.97.0-SNAPSHOT-tests.jar
[JENKINS] Archiving <http://54.241.6.143/job/HBase-0.95/ws/hbase-server/pom.xml> to
/var/lib/jenkins/jobs/HBase-0.95/modules/org.apache.hbase$hbase-server/builds/2013-07-15_20-23-09/archive/org.apache.hbase/hbase-server/0.97.0-SNAPSHOT/hbase-server-0.97.0-SNAPSHOT.pom
[JENKINS] Archiving <http://54.241.6.143/job/HBase-0.95/ws/hbase-server/target/hbase-server-0.97.0-SNAPSHOT.jar>
to /var/lib/jenkins/jobs/HBase-0.95/modules/org.apache.hbase$hbase-server/builds/2013-07-15_20-23-09/archive/org.apache.hbase/hbase-server/0.97.0-SNAPSHOT/hbase-server-0.97.0-SNAPSHOT.jar
[JENKINS] Archiving <http://54.241.6.143/job/HBase-0.95/ws/hbase-server/target/hbase-server-0.97.0-SNAPSHOT-tests.jar>
to /var/lib/jenkins/jobs/HBase-0.95/modules/org.apache.hbase$hbase-server/builds/2013-07-15_20-23-09/archive/org.apache.hbase/hbase-server/0.97.0-SNAPSHOT/hbase-server-0.97.0-SNAPSHOT-tests.jar
[JENKINS] Archiving <http://54.241.6.143/job/HBase-0.95/ws/hbase-server/target/hbase-server-0.97.0-SNAPSHOT-sources.jar>
to /var/lib/jenkins/jobs/HBase-0.95/modules/org.apache.hbase$hbase-server/builds/2013-07-15_20-23-09/archive/org.apache.hbase/hbase-server/0.97.0-SNAPSHOT/hbase-server-0.97.0-SNAPSHOT-sources.jar
Waiting for Jenkins to finish collecting data
mavenExecutionResult exceptions not empty
message : Failed to execute goal org.apache.maven.plugins:maven-failsafe-plugin:2.12-TRUNK-HBASE-2:verify
(verify) on project hbase-it: There are test failures.

Please refer to <http://54.241.6.143/job/HBase-0.95/ws/hbase-it/target/failsafe-reports>
for the individual test results.
cause : There are test failures.

Please refer to <http://54.241.6.143/job/HBase-0.95/ws/hbase-it/target/failsafe-reports>
for the individual test results.
Stack trace : 
org.apache.maven.lifecycle.LifecycleExecutionException: Failed to execute goal org.apache.maven.plugins:maven-failsafe-plugin:2.12-TRUNK-HBASE-2:verify
(verify) on project hbase-it: There are test failures.

Please refer to <http://54.241.6.143/job/HBase-0.95/ws/hbase-it/target/failsafe-reports>
for the individual test results.
	at org.apache.maven.lifecycle.internal.MojoExecutor.execute(MojoExecutor.java:213)
	at org.apache.maven.lifecycle.internal.MojoExecutor.execute(MojoExecutor.java:153)
	at org.apache.maven.lifecycle.internal.MojoExecutor.execute(MojoExecutor.java:145)
	at org.apache.maven.lifecycle.internal.LifecycleModuleBuilder.buildProject(LifecycleModuleBuilder.java:84)
	at org.apache.maven.lifecycle.internal.LifecycleModuleBuilder.buildProject(LifecycleModuleBuilder.java:59)
	at org.apache.maven.lifecycle.internal.LifecycleStarter.singleThreadedBuild(LifecycleStarter.java:183)
	at org.apache.maven.lifecycle.internal.LifecycleStarter.execute(LifecycleStarter.java:161)
	at org.apache.maven.DefaultMaven.doExecute(DefaultMaven.java:320)
	at org.apache.maven.DefaultMaven.execute(DefaultMaven.java:156)
	at org.jvnet.hudson.maven3.launcher.Maven3Launcher.main(Maven3Launcher.java:79)
	at sun.reflect.NativeMethodAccessorImpl.invoke0(Native Method)
	at sun.reflect.NativeMethodAccessorImpl.invoke(NativeMethodAccessorImpl.java:39)
	at sun.reflect.DelegatingMethodAccessorImpl.invoke(DelegatingMethodAccessorImpl.java:25)
	at java.lang.reflect.Method.invoke(Method.java:597)
	at org.codehaus.plexus.classworlds.launcher.Launcher.launchStandard(Launcher.java:329)
	at org.codehaus.plexus.classworlds.launcher.Launcher.launch(Launcher.java:239)
	at org.jvnet.hudson.maven3.agent.Maven3Main.launch(Maven3Main.java:158)
	at hudson.maven.Maven3Builder.call(Maven3Builder.java:100)
	at hudson.maven.Maven3Builder.call(Maven3Builder.java:66)
	at hudson.remoting.UserRequest.perform(UserRequest.java:118)
	at hudson.remoting.UserRequest.perform(UserRequest.java:48)
	at hudson.remoting.Request$2.run(Request.java:326)
	at hudson.remoting.InterceptingExecutorService$1.call(InterceptingExecutorService.java:72)
	at java.util.concurrent.FutureTask$Sync.innerRun(FutureTask.java:303)
	at java.util.concurrent.FutureTask.run(FutureTask.java:138)
	at java.util.concurrent.ThreadPoolExecutor$Worker.runTask(ThreadPoolExecutor.java:895)
	at java.util.concurrent.ThreadPoolExecutor$Worker.run(ThreadPoolExecutor.java:918)
	at java.lang.Thread.run(Thread.java:662)
Caused by: org.apache.maven.plugin.MojoFailureException: There are test failures.

Please refer to <http://54.241.6.143/job/HBase-0.95/ws/hbase-it/target/failsafe-reports>
for the individual test results.
	at org.apache.maven.plugin.surefire.SurefireHelper.reportExecution(SurefireHelper.java:126)
	at org.apache.maven.plugin.failsafe.VerifyMojo.execute(VerifyMojo.java:208)
	at org.apache.maven.plugin.DefaultBuildPluginManager.executeMojo(DefaultBuildPluginManager.java:101)
	at org.apache.maven.lifecycle.internal.MojoExecutor.execute(MojoExecutor.java:209)
	... 27 more
Maven failed with error.
channel stopped

Mime
View raw message