hbase-builds mailing list archives

Site index · List index
Message view « Date » · « Thread »
Top « Date » · « Thread »
From Apache Jenkins Server <jenk...@builds.apache.org>
Subject Build failed in Jenkins: hbase-0.95 #325
Date Mon, 15 Jul 2013 19:41:42 GMT
See <https://builds.apache.org/job/hbase-0.95/325/changes>

Changes:

[jxiang] HBASE-8662 [rest] support impersonation

------------------------------------------
[...truncated 3795 lines...]
Tests run: 1, Failures: 0, Errors: 0, Skipped: 0, Time elapsed: 6.298 sec
Running org.apache.hadoop.hbase.master.TestDistributedLogSplitting
Tests run: 14, Failures: 0, Errors: 0, Skipped: 0, Time elapsed: 654.192 sec
Running org.apache.hadoop.hbase.replication.regionserver.TestReplicationSink
Tests run: 5, Failures: 0, Errors: 0, Skipped: 0, Time elapsed: 26.854 sec
Running org.apache.hadoop.hbase.replication.regionserver.TestReplicationSourceManager
Tests run: 3, Failures: 0, Errors: 0, Skipped: 0, Time elapsed: 2.558 sec
Running org.apache.hadoop.hbase.replication.TestReplicationSmallTests
Tests run: 7, Failures: 0, Errors: 0, Skipped: 0, Time elapsed: 94.194 sec
Running org.apache.hadoop.hbase.replication.TestReplicationDisableInactivePeer
Tests run: 1, Failures: 0, Errors: 0, Skipped: 0, Time elapsed: 65.315 sec
Running org.apache.hadoop.hbase.replication.TestMultiSlaveReplication
Tests run: 1, Failures: 0, Errors: 0, Skipped: 0, Time elapsed: 56.122 sec
Running org.apache.hadoop.hbase.replication.TestReplicationStateZKImpl
Tests run: 3, Failures: 0, Errors: 0, Skipped: 0, Time elapsed: 6.234 sec
Running org.apache.hadoop.hbase.replication.TestReplicationQueueFailover
Tests run: 1, Failures: 0, Errors: 0, Skipped: 0, Time elapsed: 98.267 sec
Running org.apache.hadoop.hbase.TestMultiVersions
Tests run: 3, Failures: 0, Errors: 0, Skipped: 0, Time elapsed: 36.669 sec
Running org.apache.hadoop.hbase.catalog.TestMetaReaderEditorNoCluster
Tests run: 2, Failures: 0, Errors: 0, Skipped: 0, Time elapsed: 4.98 sec
Running org.apache.hadoop.hbase.TestHBaseTestingUtility
Tests run: 7, Failures: 0, Errors: 0, Skipped: 0, Time elapsed: 107.615 sec
Running org.apache.hadoop.hbase.catalog.TestMetaReaderEditor
Tests run: 5, Failures: 0, Errors: 0, Skipped: 0, Time elapsed: 39.035 sec
Running org.apache.hadoop.hbase.catalog.TestCatalogTracker
Tests run: 7, Failures: 0, Errors: 0, Skipped: 0, Time elapsed: 2.27 sec
Running org.apache.hadoop.hbase.coprocessor.TestRowProcessorEndpoint
Tests run: 4, Failures: 0, Errors: 0, Skipped: 0, Time elapsed: 34.818 sec
Running org.apache.hadoop.hbase.catalog.TestMetaMigrationConvertingToPB
Tests run: 3, Failures: 0, Errors: 0, Skipped: 0, Time elapsed: 61.38 sec
Running org.apache.hadoop.hbase.coprocessor.TestCoprocessorEndpoint
Tests run: 6, Failures: 0, Errors: 0, Skipped: 0, Time elapsed: 22.488 sec
Running org.apache.hadoop.hbase.coprocessor.TestMasterObserver
Tests run: 5, Failures: 0, Errors: 0, Skipped: 0, Time elapsed: 48.176 sec
Running org.apache.hadoop.hbase.coprocessor.TestOpenTableInCoprocessor
Tests run: 1, Failures: 0, Errors: 0, Skipped: 0, Time elapsed: 36.257 sec
Running org.apache.hadoop.hbase.coprocessor.TestClassLoading
Tests run: 8, Failures: 0, Errors: 0, Skipped: 0, Time elapsed: 39.533 sec
Running org.apache.hadoop.hbase.coprocessor.TestRegionObserverScannerOpenHook
Tests run: 1, Failures: 0, Errors: 0, Skipped: 0, Time elapsed: 18.84 sec
Running org.apache.hadoop.hbase.coprocessor.TestRegionObserverInterface
Tests run: 7, Failures: 0, Errors: 0, Skipped: 0, Time elapsed: 47.228 sec
Running org.apache.hadoop.hbase.coprocessor.TestMasterCoprocessorExceptionWithRemove
Tests run: 1, Failures: 0, Errors: 0, Skipped: 0, Time elapsed: 20.134 sec
Running org.apache.hadoop.hbase.coprocessor.TestRegionServerCoprocessorExceptionWithRemove
Tests run: 1, Failures: 0, Errors: 0, Skipped: 0, Time elapsed: 26.045 sec
Running org.apache.hadoop.hbase.coprocessor.TestMasterCoprocessorExceptionWithAbort
Tests run: 1, Failures: 0, Errors: 0, Skipped: 0, Time elapsed: 30.881 sec
Running org.apache.hadoop.hbase.coprocessor.TestWALObserver
Tests run: 3, Failures: 0, Errors: 0, Skipped: 0, Time elapsed: 27.013 sec
Running org.apache.hadoop.hbase.coprocessor.TestRegionServerCoprocessorExceptionWithAbort
Tests run: 1, Failures: 0, Errors: 0, Skipped: 0, Time elapsed: 26.334 sec
Running org.apache.hadoop.hbase.coprocessor.TestRegionObserverBypass
Tests run: 2, Failures: 0, Errors: 0, Skipped: 0, Time elapsed: 25.605 sec
Running org.apache.hadoop.hbase.thrift2.TestThriftHBaseServiceHandler
Tests run: 16, Failures: 0, Errors: 0, Skipped: 0, Time elapsed: 18.925 sec
Running org.apache.hadoop.hbase.thrift.TestThriftServerCmdLine
Tests run: 32, Failures: 0, Errors: 0, Skipped: 0, Time elapsed: 68.166 sec
Running org.apache.hadoop.hbase.TestIOFencing
Tests run: 2, Failures: 0, Errors: 0, Skipped: 0, Time elapsed: 98.364 sec
Running org.apache.hadoop.hbase.trace.TestHTraceHooks
Tests run: 1, Failures: 0, Errors: 0, Skipped: 0, Time elapsed: 18.167 sec
Running org.apache.hadoop.hbase.procedure.TestZKProcedure
Tests run: 4, Failures: 0, Errors: 0, Skipped: 0, Time elapsed: 2.633 sec
Running org.apache.hadoop.hbase.procedure.TestZKProcedureControllers
Tests run: 4, Failures: 0, Errors: 0, Skipped: 0, Time elapsed: 2.906 sec
Running org.apache.hadoop.hbase.thrift.TestThriftServer
Tests run: 1, Failures: 0, Errors: 0, Skipped: 0, Time elapsed: 70.927 sec
Running org.apache.hadoop.hbase.regionserver.TestHRegionOnCluster
Tests run: 1, Failures: 0, Errors: 0, Skipped: 0, Time elapsed: 21.472 sec
Running org.apache.hadoop.hbase.regionserver.TestRegionServerNoMaster
Tests run: 8, Failures: 0, Errors: 0, Skipped: 0, Time elapsed: 30.399 sec
Running org.apache.hadoop.hbase.regionserver.TestMemStore
Tests run: 24, Failures: 0, Errors: 0, Skipped: 0, Time elapsed: 32.21 sec
Running org.apache.hadoop.hbase.regionserver.TestMasterAddressManager
Tests run: 1, Failures: 0, Errors: 0, Skipped: 0, Time elapsed: 1.116 sec
Running org.apache.hadoop.hbase.regionserver.TestRegionServerMetrics
Tests run: 9, Failures: 0, Errors: 0, Skipped: 0, Time elapsed: 43.42 sec
Running org.apache.hadoop.hbase.regionserver.TestHRegion
Tests run: 64, Failures: 0, Errors: 0, Skipped: 0, Time elapsed: 59.447 sec
Running org.apache.hadoop.hbase.regionserver.TestCompoundBloomFilter
Tests run: 3, Failures: 0, Errors: 0, Skipped: 0, Time elapsed: 19.398 sec
Running org.apache.hadoop.hbase.regionserver.TestCompactionWithCoprocessor
Tests run: 18, Failures: 0, Errors: 0, Skipped: 0, Time elapsed: 39.74 sec
Running org.apache.hadoop.hbase.regionserver.TestSplitLogWorker
Tests run: 5, Failures: 0, Errors: 0, Skipped: 0, Time elapsed: 6.736 sec
Running org.apache.hadoop.hbase.regionserver.TestHRegionBusyWait
Tests run: 65, Failures: 0, Errors: 0, Skipped: 0, Time elapsed: 66.211 sec
Running org.apache.hadoop.hbase.regionserver.TestServerCustomProtocol
Tests run: 7, Failures: 0, Errors: 0, Skipped: 0, Time elapsed: 61.653 sec
Running org.apache.hadoop.hbase.regionserver.TestStoreFileBlockCacheSummary
Tests run: 1, Failures: 0, Errors: 0, Skipped: 0, Time elapsed: 19.524 sec
Running org.apache.hadoop.hbase.regionserver.TestStore
Tests run: 15, Failures: 0, Errors: 0, Skipped: 0, Time elapsed: 12.335 sec
Running org.apache.hadoop.hbase.regionserver.TestAtomicOperation
Tests run: 6, Failures: 0, Errors: 0, Skipped: 0, Time elapsed: 29.859 sec
Running org.apache.hadoop.hbase.regionserver.TestClusterId
Tests run: 1, Failures: 0, Errors: 0, Skipped: 0, Time elapsed: 31.759 sec
Running org.apache.hadoop.hbase.regionserver.TestRegionMergeTransactionOnCluster
Tests run: 2, Failures: 0, Errors: 0, Skipped: 0, Time elapsed: 35.658 sec
Running org.apache.hadoop.hbase.regionserver.TestBlocksRead
Tests run: 4, Failures: 0, Errors: 0, Skipped: 0, Time elapsed: 1.574 sec
Running org.apache.hadoop.hbase.regionserver.TestFSErrorsExposed
Tests run: 3, Failures: 0, Errors: 0, Skipped: 1, Time elapsed: 1.065 sec
Running org.apache.hadoop.hbase.regionserver.TestJoinedScanners
Tests run: 1, Failures: 0, Errors: 0, Skipped: 0, Time elapsed: 50.557 sec
Running org.apache.hadoop.hbase.regionserver.TestSeekOptimizations
Tests run: 6, Failures: 0, Errors: 0, Skipped: 0, Time elapsed: 3.218 sec
Running org.apache.hadoop.hbase.regionserver.handler.TestCloseRegionHandler
Tests run: 3, Failures: 0, Errors: 0, Skipped: 0, Time elapsed: 2.898 sec
Running org.apache.hadoop.hbase.regionserver.handler.TestOpenRegionHandler
Tests run: 5, Failures: 0, Errors: 0, Skipped: 0, Time elapsed: 2.203 sec
Running org.apache.hadoop.hbase.regionserver.TestCompactionState
Tests run: 5, Failures: 0, Errors: 0, Skipped: 0, Time elapsed: 148.62 sec
Running org.apache.hadoop.hbase.regionserver.TestSplitTransactionOnCluster
Tests run: 9, Failures: 0, Errors: 0, Skipped: 0, Time elapsed: 92.53 sec
Running org.apache.hadoop.hbase.regionserver.TestHRegionServerBulkLoad
Tests run: 1, Failures: 0, Errors: 0, Skipped: 0, Time elapsed: 49.015 sec
Running org.apache.hadoop.hbase.regionserver.TestGetClosestAtOrBefore
Tests run: 3, Failures: 0, Errors: 0, Skipped: 0, Time elapsed: 1.506 sec
Running org.apache.hadoop.hbase.regionserver.TestCacheOnWriteInSchema
Tests run: 3, Failures: 0, Errors: 0, Skipped: 0, Time elapsed: 2.943 sec
Running org.apache.hadoop.hbase.regionserver.TestParallelPut
Tests run: 2, Failures: 0, Errors: 0, Skipped: 0, Time elapsed: 5.626 sec
Running org.apache.hadoop.hbase.regionserver.TestPriorityRpc
Tests run: 3, Failures: 0, Errors: 0, Skipped: 0, Time elapsed: 1.738 sec
Running org.apache.hadoop.hbase.regionserver.wal.TestLogRollAbort
Tests run: 1, Failures: 0, Errors: 0, Skipped: 0, Time elapsed: 161.151 sec
Running org.apache.hadoop.hbase.regionserver.wal.TestHLog
Tests run: 13, Failures: 0, Errors: 0, Skipped: 0, Time elapsed: 74.517 sec
Running org.apache.hadoop.hbase.regionserver.wal.TestLogRolling
Tests run: 4, Failures: 0, Errors: 0, Skipped: 0, Time elapsed: 357.192 sec
Running org.apache.hadoop.hbase.regionserver.wal.TestHLogSplit
Tests run: 35, Failures: 0, Errors: 0, Skipped: 1, Time elapsed: 192.248 sec
Running org.apache.hadoop.hbase.regionserver.wal.TestWALReplay
Tests run: 8, Failures: 0, Errors: 0, Skipped: 0, Time elapsed: 82.77 sec
Running org.apache.hadoop.hbase.regionserver.wal.TestHLogSplitCompressed
Tests run: 35, Failures: 0, Errors: 0, Skipped: 1, Time elapsed: 203.249 sec
Running org.apache.hadoop.hbase.regionserver.wal.TestDurability
Tests run: 1, Failures: 0, Errors: 0, Skipped: 0, Time elapsed: 9.071 sec
Running org.apache.hadoop.hbase.regionserver.wal.TestWALReplayCompressed
Tests run: 8, Failures: 0, Errors: 0, Skipped: 0, Time elapsed: 82.883 sec
Running org.apache.hadoop.hbase.regionserver.wal.TestHLogFiltering
Tests run: 1, Failures: 0, Errors: 0, Skipped: 0, Time elapsed: 47.497 sec
Running org.apache.hadoop.hbase.regionserver.TestStoreScanner
Tests run: 16, Failures: 0, Errors: 0, Skipped: 0, Time elapsed: 0.699 sec
Running org.apache.hadoop.hbase.regionserver.TestRegionFavoredNodes
Tests run: 1, Failures: 0, Errors: 0, Skipped: 1, Time elapsed: 0.469 sec
Running org.apache.hadoop.hbase.regionserver.TestEndToEndSplitTransaction
Tests run: 2, Failures: 0, Errors: 0, Skipped: 0, Time elapsed: 42.123 sec
Running org.apache.hadoop.hbase.regionserver.TestCompaction
Tests run: 18, Failures: 0, Errors: 0, Skipped: 0, Time elapsed: 39.426 sec
Running org.apache.hadoop.hbase.regionserver.TestMultiColumnScanner
Tests run: 12, Failures: 0, Errors: 0, Skipped: 0, Time elapsed: 30.762 sec
Running org.apache.hadoop.hbase.mapred.TestTableInputFormat
Tests run: 10, Failures: 0, Errors: 0, Skipped: 0, Time elapsed: 40.999 sec
Running org.apache.hadoop.hbase.fs.TestBlockReorder
Tests run: 3, Failures: 0, Errors: 0, Skipped: 0, Time elapsed: 46.283 sec
Running org.apache.hadoop.hbase.mapred.TestTableMapReduce
Tests run: 1, Failures: 0, Errors: 0, Skipped: 0, Time elapsed: 133.123 sec
Running org.apache.hadoop.hbase.backup.example.TestZooKeeperTableArchiveClient
Tests run: 3, Failures: 0, Errors: 0, Skipped: 0, Time elapsed: 7.279 sec
Running org.apache.hadoop.hbase.TestClusterBootOrder
Tests run: 2, Failures: 0, Errors: 0, Skipped: 0, Time elapsed: 39.826 sec
Running org.apache.hadoop.hbase.TestDrainingServer
Tests run: 2, Failures: 0, Errors: 0, Skipped: 0, Time elapsed: 30.905 sec
Running org.apache.hadoop.hbase.backup.TestHFileArchiving
Tests run: 5, Failures: 0, Errors: 0, Skipped: 0, Time elapsed: 246.544 sec
Running org.apache.hadoop.hbase.mapreduce.TestTimeRangeMapRed
Tests run: 1, Failures: 0, Errors: 0, Skipped: 0, Time elapsed: 54.345 sec
Running org.apache.hadoop.hbase.mapreduce.TestRowCounter
Tests run: 3, Failures: 0, Errors: 0, Skipped: 0, Time elapsed: 104.462 sec
Running org.apache.hadoop.hbase.mapreduce.TestMultiTableInputFormat
Tests run: 5, Failures: 0, Errors: 0, Skipped: 0, Time elapsed: 390.141 sec
Running org.apache.hadoop.hbase.mapreduce.TestCopyTable
Tests run: 2, Failures: 0, Errors: 0, Skipped: 0, Time elapsed: 136.024 sec
Running org.apache.hadoop.hbase.mapreduce.TestSecureLoadIncrementalHFiles
Tests run: 7, Failures: 0, Errors: 0, Skipped: 0, Time elapsed: 41.917 sec
Running org.apache.hadoop.hbase.mapreduce.TestTableInputFormatScan1
Tests run: 5, Failures: 0, Errors: 0, Skipped: 0, Time elapsed: 292.842 sec
Running org.apache.hadoop.hbase.mapreduce.TestHFileOutputFormat
Tests run: 10, Failures: 0, Errors: 0, Skipped: 0, Time elapsed: 578.104 sec
Running org.apache.hadoop.hbase.mapreduce.TestImportTsv
Tests run: 5, Failures: 0, Errors: 0, Skipped: 0, Time elapsed: 317.162 sec
Running org.apache.hadoop.hbase.mapreduce.TestImportExport
Tests run: 5, Failures: 0, Errors: 0, Skipped: 0, Time elapsed: 359.387 sec
Running org.apache.hadoop.hbase.mapreduce.TestWALPlayer
Tests run: 1, Failures: 0, Errors: 0, Skipped: 0, Time elapsed: 63.095 sec
Running org.apache.hadoop.hbase.mapreduce.TestMultithreadedTableMapper
Tests run: 1, Failures: 0, Errors: 0, Skipped: 0, Time elapsed: 121.911 sec
Running org.apache.hadoop.hbase.mapreduce.TestTableInputFormatScan2
Tests run: 7, Failures: 0, Errors: 0, Skipped: 0, Time elapsed: 262.41 sec
Running org.apache.hadoop.hbase.mapreduce.TestSecureLoadIncrementalHFilesSplitRecovery
Tests run: 4, Failures: 0, Errors: 0, Skipped: 0, Time elapsed: 75.838 sec
Running org.apache.hadoop.hbase.mapreduce.TestTableMapReduce
Tests run: 2, Failures: 0, Errors: 0, Skipped: 0, Time elapsed: 285.361 sec
Running org.apache.hadoop.hbase.mapreduce.TestLoadIncrementalHFilesSplitRecovery
Tests run: 4, Failures: 0, Errors: 0, Skipped: 0, Time elapsed: 385.624 sec
Running org.apache.hadoop.hbase.mapreduce.TestHLogRecordReader
Tests run: 2, Failures: 0, Errors: 0, Skipped: 0, Time elapsed: 10.245 sec
Running org.apache.hadoop.hbase.mapreduce.TestLoadIncrementalHFiles
Tests run: 7, Failures: 0, Errors: 0, Skipped: 0, Time elapsed: 39.345 sec

Results :

Tests in error: 
  testBulkLoad(org.apache.hadoop.hbase.security.access.TestAccessController): org.apache.hadoop.security.authorize.AuthorizationException:


Tests run: 1503, Failures: 0, Errors: 1, Skipped: 15

[INFO] ------------------------------------------------------------------------
[INFO] Reactor Summary:
[INFO] 
[INFO] HBase ............................................. SUCCESS [9.608s]
[INFO] HBase - Common .................................... SUCCESS [25.911s]
[INFO] HBase - Protocol .................................. SUCCESS [8.039s]
[INFO] HBase - Client .................................... SUCCESS [21.620s]
[INFO] HBase - Prefix Tree ............................... SUCCESS [3.238s]
[INFO] HBase - Hadoop Compatibility ...................... SUCCESS [5.415s]
[INFO] HBase - Hadoop One Compatibility .................. SUCCESS [1.658s]
[INFO] HBase - Server .................................... FAILURE [2:10:53.091s]
[INFO] HBase - Integration Tests ......................... SKIPPED
[INFO] HBase - Examples .................................. SKIPPED
[INFO] HBase - Assembly .................................. SKIPPED
[INFO] ------------------------------------------------------------------------
[INFO] BUILD FAILURE
[INFO] ------------------------------------------------------------------------
[INFO] Total time: 2:12:09.330s
[INFO] Finished at: Mon Jul 15 19:40:38 UTC 2013
[INFO] Final Memory: 36M/997M
[INFO] ------------------------------------------------------------------------
[ERROR] Failed to execute goal org.apache.maven.plugins:maven-surefire-plugin:2.12-TRUNK-HBASE-2:test
(secondPartTestsExecution) on project hbase-server: There are test failures.
[ERROR] 
[ERROR] Please refer to <https://builds.apache.org/job/hbase-0.95/ws/0.95/hbase-server/target/surefire-reports>
for the individual test results.
[ERROR] -> [Help 1]
[ERROR] 
[ERROR] To see the full stack trace of the errors, re-run Maven with the -e switch.
[ERROR] Re-run Maven using the -X switch to enable full debug logging.
[ERROR] 
[ERROR] For more information about the errors and possible solutions, please read the following
articles:
[ERROR] [Help 1] http://cwiki.apache.org/confluence/display/MAVEN/MojoFailureException
[ERROR] 
[ERROR] After correcting the problems, you can resume the build with the command
[ERROR]   mvn <goals> -rf :hbase-server
Build step 'Invoke top-level Maven targets' marked build as failure
Archiving artifacts
Recording test results
Updating HBASE-8662

Mime
View raw message