hbase-builds mailing list archives

Site index · List index
Message view « Date » · « Thread »
Top « Date » · « Thread »
From apurt...@apache.org
Subject Build failed in Jenkins: HBase-0.95-Hadoop-2 #552
Date Wed, 03 Jul 2013 23:46:08 GMT
See <http://54.241.6.143/job/HBase-0.95-Hadoop-2/552/changes>

Changes:

[jxiang] HBASE-8857 TestGet#testDynamicFilter fails sometimes

[jxiang] HBASE-8860 TestTableLockManager#testTableReadLock times out sometimes

------------------------------------------
[...truncated 2694 lines...]
[INFO]     Updating parent org.apache.hbase:hbase
[INFO]         from version 0.97.0-SNAPSHOT to 0.95.0-hadoop2-SNAPSHOT
[INFO] 
[INFO] Processing org.apache.hbase:hbase-it
[INFO]     Updating parent org.apache.hbase:hbase
[INFO]         from version 0.97.0-SNAPSHOT to 0.95.0-hadoop2-SNAPSHOT
[INFO] 
[INFO] Processing org.apache.hbase:hbase-prefix-tree
[INFO]     Updating parent org.apache.hbase:hbase
[INFO]         from version 0.97.0-SNAPSHOT to 0.95.0-hadoop2-SNAPSHOT
[INFO] 
[INFO] Processing org.apache.hbase:hbase-protocol
[INFO]     Updating parent org.apache.hbase:hbase
[INFO]         from version 0.97.0-SNAPSHOT to 0.95.0-hadoop2-SNAPSHOT
[INFO] 
[INFO] Processing org.apache.hbase:hbase-server
[INFO]     Updating parent org.apache.hbase:hbase
[INFO]         from version 0.97.0-SNAPSHOT to 0.95.0-hadoop2-SNAPSHOT
[INFO] 
[INFO]                                                                         
[INFO] ------------------------------------------------------------------------
[INFO] Building HBase 0.97.0-SNAPSHOT
[INFO] ------------------------------------------------------------------------
[INFO] 
[INFO] --- maven-remote-resources-plugin:1.4:process (default) @ hbase ---
[INFO] 
[INFO] --- findbugs-maven-plugin:2.5.2:findbugs (default) @ hbase ---
[FINDBUGS] No report found for mojo findbugs
[INFO] 
[INFO] --- maven-site-plugin:3.2:attach-descriptor (attach-descriptor) @ hbase ---
[INFO] 
[INFO] --- maven-install-plugin:2.3.1:install (default-install) @ hbase ---
[INFO] Installing <http://54.241.6.143/job/HBase-0.95-Hadoop-2/ws/pom.xml> to /home/ec2-user/jenkins/maven-repositories/0/org/apache/hbase/hbase/0.97.0-SNAPSHOT/hbase-0.97.0-SNAPSHOT.pom
[INFO] Installing <http://54.241.6.143/job/HBase-0.95-Hadoop-2/ws/target/hbase-0.97.0-SNAPSHOT-site.xml>
to /home/ec2-user/jenkins/maven-repositories/0/org/apache/hbase/hbase/0.97.0-SNAPSHOT/hbase-0.97.0-SNAPSHOT-site.xml
[INFO]                                                                         
[INFO] ------------------------------------------------------------------------
[INFO] Building HBase - Common 0.97.0-SNAPSHOT
[INFO] ------------------------------------------------------------------------
[INFO] 
[INFO] --- maven-antrun-plugin:1.6:run (generate) @ hbase-common ---
[INFO] Executing tasks

main:
[INFO] Executed tasks
[INFO] 
[INFO] --- build-helper-maven-plugin:1.5:add-source (versionInfo-source) @ hbase-common ---
[INFO] Source directory: <http://54.241.6.143/job/HBase-0.95-Hadoop-2/ws/hbase-common/target/generated-sources/java>
added.
[INFO] 
[INFO] --- maven-remote-resources-plugin:1.4:process (default) @ hbase-common ---
[INFO] 
[INFO] --- maven-resources-plugin:2.6:resources (default-resources) @ hbase-common ---
[INFO] Using 'UTF-8' encoding to copy filtered resources.
[INFO] Copying 1 resource
[INFO] Copying 3 resources
[INFO] 
[INFO] --- maven-antrun-plugin:1.6:run (default) @ hbase-common ---
[INFO] Executing tasks

main:
    [mkdir] Created dir: <http://54.241.6.143/job/HBase-0.95-Hadoop-2/ws/hbase-common/target/nativelib>
     [exec] tar: hadoop-snappy-nativelibs.tar: Cannot open: No such file or directory
     [exec] tar: Error is not recoverable: exiting now
     [exec] Result: 2
[INFO] Executed tasks
[INFO] 
[INFO] --- maven-compiler-plugin:2.5.1:compile (default-compile) @ hbase-common ---
[INFO] Compiling 83 source files to <http://54.241.6.143/job/HBase-0.95-Hadoop-2/ws/hbase-common/target/classes>
[WARNING] <http://54.241.6.143/job/HBase-0.95-Hadoop-2/ws/hbase-common/src/main/java/org/apache/hadoop/hbase/util/Bytes.java>:[51,15]
sun.misc.Unsafe is Sun proprietary API and may be removed in a future release
[WARNING] <http://54.241.6.143/job/HBase-0.95-Hadoop-2/ws/hbase-common/src/main/java/org/apache/hadoop/hbase/util/Bytes.java>:[1073,19]
sun.misc.Unsafe is Sun proprietary API and may be removed in a future release
[WARNING] <http://54.241.6.143/job/HBase-0.95-Hadoop-2/ws/hbase-common/src/main/java/org/apache/hadoop/hbase/util/Bytes.java>:[1079,21]
sun.misc.Unsafe is Sun proprietary API and may be removed in a future release
[WARNING] <http://54.241.6.143/job/HBase-0.95-Hadoop-2/ws/hbase-common/src/main/java/org/apache/hadoop/hbase/util/Bytes.java>:[1084,28]
sun.misc.Unsafe is Sun proprietary API and may be removed in a future release
[INFO] 
[INFO] --- maven-dependency-plugin:2.1:build-classpath (create-mrapp-generated-classpath)
@ hbase-common ---
[INFO] Wrote classpath file '<http://54.241.6.143/job/HBase-0.95-Hadoop-2/ws/hbase-common/target/test-classes/mrapp-generated-classpath'.>
[INFO] [INFO] Using 'UTF-8' encoding to copy filtered resources.
[INFO] skip non existing resourceDirectory <http://54.241.6.143/job/HBase-0.95-Hadoop-2/ws/hbase-common/src/test/resources>

[INFO] --- maven-resources-plugin:2.6:testResources (default-testResources) @ hbase-common
---[INFO] Copying 3 resources

[INFO] 
[INFO] --- maven-compiler-plugin:2.5.1:testCompile (default-testCompile) @ hbase-common ---
[INFO] Compiling 28 source files to <http://54.241.6.143/job/HBase-0.95-Hadoop-2/ws/hbase-common/target/test-classes>
[INFO] 
[INFO] --- maven-surefire-plugin:2.12-TRUNK-HBASE-2:test (default-test) @ hbase-common ---
Downloading: http://people.apache.org/~garyh/mvn/org/apache/maven/surefire/surefire-junit47/2.12-TRUNK-HBASE-2/surefire-junit47-2.12-TRUNK-HBASE-2.pom
Downloaded: http://people.apache.org/~garyh/mvn/org/apache/maven/surefire/surefire-junit47/2.12-TRUNK-HBASE-2/surefire-junit47-2.12-TRUNK-HBASE-2.pom
(5 KB at 15.9 KB/sec)
Downloading: http://people.apache.org/~garyh/mvn/org/apache/maven/surefire/surefire-providers/2.12-TRUNK-HBASE-2/surefire-providers-2.12-TRUNK-HBASE-2.pom
Downloaded: http://people.apache.org/~garyh/mvn/org/apache/maven/surefire/surefire-providers/2.12-TRUNK-HBASE-2/surefire-providers-2.12-TRUNK-HBASE-2.pom
(3 KB at 29.0 KB/sec)
Downloading: http://people.apache.org/~garyh/mvn/org/apache/maven/surefire/common-junit48/2.12-TRUNK-HBASE-2/common-junit48-2.12-TRUNK-HBASE-2.pom
Downloaded: http://people.apache.org/~garyh/mvn/org/apache/maven/surefire/common-junit48/2.12-TRUNK-HBASE-2/common-junit48-2.12-TRUNK-HBASE-2.pom
(3 KB at 27.6 KB/sec)
Downloading: http://people.apache.org/~garyh/mvn/org/apache/maven/surefire/common-junit4/2.12-TRUNK-HBASE-2/common-junit4-2.12-TRUNK-HBASE-2.pom
Downloaded: http://people.apache.org/~garyh/mvn/org/apache/maven/surefire/common-junit4/2.12-TRUNK-HBASE-2/common-junit4-2.12-TRUNK-HBASE-2.pom
(2 KB at 24.1 KB/sec)
Downloading: http://people.apache.org/~garyh/mvn/org/apache/maven/surefire/common-junit3/2.12-TRUNK-HBASE-2/common-junit3-2.12-TRUNK-HBASE-2.pom
Downloaded: http://people.apache.org/~garyh/mvn/org/apache/maven/surefire/common-junit3/2.12-TRUNK-HBASE-2/common-junit3-2.12-TRUNK-HBASE-2.pom
(2 KB at 19.5 KB/sec)
Downloading: http://people.apache.org/~garyh/mvn/org/apache/maven/surefire/surefire-junit47/2.12-TRUNK-HBASE-2/surefire-junit47-2.12-TRUNK-HBASE-2.jar
Downloading: http://people.apache.org/~garyh/mvn/org/apache/maven/surefire/common-junit48/2.12-TRUNK-HBASE-2/common-junit48-2.12-TRUNK-HBASE-2.jar
Downloading: http://people.apache.org/~garyh/mvn/org/apache/maven/surefire/common-junit4/2.12-TRUNK-HBASE-2/common-junit4-2.12-TRUNK-HBASE-2.jar
Downloading: http://people.apache.org/~garyh/mvn/org/apache/maven/surefire/common-junit3/2.12-TRUNK-HBASE-2/common-junit3-2.12-TRUNK-HBASE-2.jar
Downloading: http://people.apache.org/~garyh/mvn/org/apache/maven/surefire/surefire-api/2.12-TRUNK-HBASE-2/surefire-api-2.12-TRUNK-HBASE-2.jar
Downloaded: http://people.apache.org/~garyh/mvn/org/apache/maven/surefire/common-junit3/2.12-TRUNK-HBASE-2/common-junit3-2.12-TRUNK-HBASE-2.jar
(12 KB at 70.8 KB/sec)
Downloading: http://people.apache.org/~garyh/mvn/org/apache/maven/surefire/surefire-booter/2.12-TRUNK-HBASE-2/surefire-booter-2.12-TRUNK-HBASE-2.jar
Downloaded: http://people.apache.org/~garyh/mvn/org/apache/maven/surefire/surefire-junit47/2.12-TRUNK-HBASE-2/surefire-junit47-2.12-TRUNK-HBASE-2.jar
(46 KB at 256.4 KB/sec)
Downloading: http://people.apache.org/~garyh/mvn/org/apache/maven/surefire/maven-surefire-common/2.12-TRUNK-HBASE-2/maven-surefire-common-2.12-TRUNK-HBASE-2.jar
Downloaded: http://people.apache.org/~garyh/mvn/org/apache/maven/surefire/common-junit48/2.12-TRUNK-HBASE-2/common-junit48-2.12-TRUNK-HBASE-2.jar
(24 KB at 107.8 KB/sec)
Downloading: http://people.apache.org/~garyh/mvn/org/apache/maven/shared/maven-common-artifact-filters/1.3/maven-common-artifact-filters-1.3.jar
Downloading: http://people.apache.org/~garyh/mvn/org/codehaus/plexus/plexus-utils/2.1/plexus-utils-2.1.jar
Downloaded: http://people.apache.org/~garyh/mvn/org/apache/maven/surefire/surefire-booter/2.12-TRUNK-HBASE-2/surefire-booter-2.12-TRUNK-HBASE-2.jar
(33 KB at 229.4 KB/sec)
Downloading: http://people.apache.org/~garyh/mvn/org/apache/maven/reporting/maven-reporting-api/2.0.9/maven-reporting-api-2.0.9.jar
Downloaded: http://people.apache.org/~garyh/mvn/org/apache/maven/surefire/maven-surefire-common/2.12-TRUNK-HBASE-2/maven-surefire-common-2.12-TRUNK-HBASE-2.jar
(94 KB at 449.2 KB/sec)
Downloaded: http://people.apache.org/~garyh/mvn/org/apache/maven/surefire/surefire-api/2.12-TRUNK-HBASE-2/surefire-api-2.12-TRUNK-HBASE-2.jar
(151 KB at 329.8 KB/sec)
Downloading: http://repo.maven.apache.org/maven2/org/apache/maven/surefire/common-junit4/2.12-TRUNK-HBASE-2/common-junit4-2.12-TRUNK-HBASE-2.jar
Downloading: http://repo.maven.apache.org/maven2/org/codehaus/plexus/plexus-utils/2.1/plexus-utils-2.1.jar
Downloading: http://repo.maven.apache.org/maven2/org/apache/maven/shared/maven-common-artifact-filters/1.3/maven-common-artifact-filters-1.3.jar
Downloading: http://repo.maven.apache.org/maven2/org/apache/maven/reporting/maven-reporting-api/2.0.9/maven-reporting-api-2.0.9.jar
Downloaded: http://repo.maven.apache.org/maven2/org/apache/maven/reporting/maven-reporting-api/2.0.9/maven-reporting-api-2.0.9.jar
(10 KB at 353.6 KB/sec)
Downloaded: http://repo.maven.apache.org/maven2/org/apache/maven/shared/maven-common-artifact-filters/1.3/maven-common-artifact-filters-1.3.jar
(31 KB at 819.8 KB/sec)
Downloaded: http://repo.maven.apache.org/maven2/org/codehaus/plexus/plexus-utils/2.1/plexus-utils-2.1.jar
(220 KB at 3480.0 KB/sec)
Jul 3, 2013 11:46:04 PM hudson.maven.ExecutedMojo <init>
WARNING: Failed to getClass for org.apache.maven.plugin.surefire.SurefirePlugin
[JENKINS] Recording test results
[INFO]                                                                         
[INFO] ------------------------------------------------------------------------
[INFO] Skipping HBase
[INFO] This project has been banned from the build due to previous failures.
[INFO] ------------------------------------------------------------------------
[INFO]                                                                         
[INFO] ------------------------------------------------------------------------
[INFO] Skipping HBase
[INFO] This project has been banned from the build due to previous failures.
[INFO] ------------------------------------------------------------------------
[INFO] ------------------------------------------------------------------------
[INFO] Reactor Summary:
[INFO] 
[INFO] HBase ............................................. SUCCESS [5.207s]
[INFO] HBase - Common .................................... FAILURE [1:14.921s]
[INFO] HBase - Protocol .................................. SKIPPED
[INFO] HBase - Client .................................... SKIPPED
[INFO] HBase - Prefix Tree ............................... SKIPPED
[INFO] HBase - Hadoop Compatibility ...................... SKIPPED
[INFO] HBase - Hadoop Two Compatibility .................. SKIPPED
[INFO] HBase - Server .................................... SKIPPED
[INFO] HBase - Integration Tests ......................... SKIPPED
[INFO] HBase - Examples .................................. SKIPPED
[INFO] HBase - Assembly .................................. SKIPPED
[INFO] ------------------------------------------------------------------------
[INFO] BUILD FAILURE
[INFO] ------------------------------------------------------------------------
[INFO] Total time: 1:28.013s
[INFO] Finished at: Wed Jul 03 23:46:05 UTC 2013
[INFO] Final Memory: 54M/646M
[INFO] ------------------------------------------------------------------------
[JENKINS] Archiving <http://54.241.6.143/job/HBase-0.95-Hadoop-2/ws/hbase-hadoop2-compat/pom.xml>
to /var/lib/jenkins/jobs/HBase-0.95-Hadoop-2/modules/org.apache.hbase$hbase-hadoop2-compat/builds/2013-07-03_23-44-31/archive/org.apache.hbase/hbase-hadoop2-compat/0.97.0-SNAPSHOT/hbase-hadoop2-compat-0.97.0-SNAPSHOT.pom
[JENKINS] Archiving <http://54.241.6.143/job/HBase-0.95-Hadoop-2/ws/hbase-common/pom.xml>
to /var/lib/jenkins/jobs/HBase-0.95-Hadoop-2/modules/org.apache.hbase$hbase-common/builds/2013-07-03_23-44-31/archive/org.apache.hbase/hbase-common/0.97.0-SNAPSHOT/hbase-common-0.97.0-SNAPSHOT.pom
[JENKINS] Archiving <http://54.241.6.143/job/HBase-0.95-Hadoop-2/ws/hbase-hadoop-compat/pom.xml>
to /var/lib/jenkins/jobs/HBase-0.95-Hadoop-2/modules/org.apache.hbase$hbase-hadoop-compat/builds/2013-07-03_23-44-30/archive/org.apache.hbase/hbase-hadoop-compat/0.97.0-SNAPSHOT/hbase-hadoop-compat-0.97.0-SNAPSHOT.pom
[JENKINS] Archiving <http://54.241.6.143/job/HBase-0.95-Hadoop-2/ws/hbase-examples/pom.xml>
to /var/lib/jenkins/jobs/HBase-0.95-Hadoop-2/modules/org.apache.hbase$hbase-examples/builds/2013-07-03_23-44-31/archive/org.apache.hbase/hbase-examples/0.97.0-SNAPSHOT/hbase-examples-0.97.0-SNAPSHOT.pom
[JENKINS] Archiving <http://54.241.6.143/job/HBase-0.95-Hadoop-2/ws/hbase-it/pom.xml>
to /var/lib/jenkins/jobs/HBase-0.95-Hadoop-2/modules/org.apache.hbase$hbase-it/builds/2013-07-03_23-44-31/archive/org.apache.hbase/hbase-it/0.97.0-SNAPSHOT/hbase-it-0.97.0-SNAPSHOT.pom
[JENKINS] Archiving <http://54.241.6.143/job/HBase-0.95-Hadoop-2/ws/pom.xml> to /var/lib/jenkins/jobs/HBase-0.95-Hadoop-2/modules/org.apache.hbase$hbase/builds/2013-07-03_23-44-30/archive/org.apache.hbase/hbase/0.97.0-SNAPSHOT/hbase-0.97.0-SNAPSHOT.pom
[JENKINS] Archiving <http://54.241.6.143/job/HBase-0.95-Hadoop-2/ws/target/hbase-0.97.0-SNAPSHOT-site.xml>
to /var/lib/jenkins/jobs/HBase-0.95-Hadoop-2/modules/org.apache.hbase$hbase/builds/2013-07-03_23-44-30/archive/org.apache.hbase/hbase/0.97.0-SNAPSHOT/hbase-0.97.0-SNAPSHOT-site.xml
[JENKINS] Archiving <http://54.241.6.143/job/HBase-0.95-Hadoop-2/ws/hbase-assembly/pom.xml>
to /var/lib/jenkins/jobs/HBase-0.95-Hadoop-2/modules/org.apache.hbase$hbase-assembly/builds/2013-07-03_23-44-31/archive/org.apache.hbase/hbase-assembly/0.97.0-SNAPSHOT/hbase-assembly-0.97.0-SNAPSHOT.pom
[JENKINS] Archiving <http://54.241.6.143/job/HBase-0.95-Hadoop-2/ws/hbase-client/pom.xml>
to /var/lib/jenkins/jobs/HBase-0.95-Hadoop-2/modules/org.apache.hbase$hbase-client/builds/2013-07-03_23-44-30/archive/org.apache.hbase/hbase-client/0.97.0-SNAPSHOT/hbase-client-0.97.0-SNAPSHOT.pom
[JENKINS] Archiving <http://54.241.6.143/job/HBase-0.95-Hadoop-2/ws/hbase-prefix-tree/pom.xml>
to /var/lib/jenkins/jobs/HBase-0.95-Hadoop-2/modules/org.apache.hbase$hbase-prefix-tree/builds/2013-07-03_23-44-31/archive/org.apache.hbase/hbase-prefix-tree/0.97.0-SNAPSHOT/hbase-prefix-tree-0.97.0-SNAPSHOT.pom
[JENKINS] Archiving <http://54.241.6.143/job/HBase-0.95-Hadoop-2/ws/hbase-protocol/pom.xml>
to /var/lib/jenkins/jobs/HBase-0.95-Hadoop-2/modules/org.apache.hbase$hbase-protocol/builds/2013-07-03_23-44-30/archive/org.apache.hbase/hbase-protocol/0.97.0-SNAPSHOT/hbase-protocol-0.97.0-SNAPSHOT.pom
[JENKINS] Archiving <http://54.241.6.143/job/HBase-0.95-Hadoop-2/ws/hbase-server/pom.xml>
to /var/lib/jenkins/jobs/HBase-0.95-Hadoop-2/modules/org.apache.hbase$hbase-server/builds/2013-07-03_23-44-30/archive/org.apache.hbase/hbase-server/0.97.0-SNAPSHOT/hbase-server-0.97.0-SNAPSHOT.pom
Waiting for Jenkins to finish collecting data
mavenExecutionResult exceptions not empty
message : Failed to execute goal org.apache.maven.plugins:maven-surefire-plugin:2.12-TRUNK-HBASE-2:test
(default-test) on project hbase-common: Execution default-test of goal org.apache.maven.plugins:maven-surefire-plugin:2.12-TRUNK-HBASE-2:test
failed: Plugin org.apache.maven.plugins:maven-surefire-plugin:2.12-TRUNK-HBASE-2 or one of
its dependencies could not be resolved: Could not transfer artifact org.apache.maven.surefire:common-junit4:jar:2.12-TRUNK-HBASE-2
from/to ghelmling.testing (http://people.apache.org/~garyh/mvn/): Connection to http://people.apache.org
refused
cause : Execution default-test of goal org.apache.maven.plugins:maven-surefire-plugin:2.12-TRUNK-HBASE-2:test
failed: Plugin org.apache.maven.plugins:maven-surefire-plugin:2.12-TRUNK-HBASE-2 or one of
its dependencies could not be resolved: Could not transfer artifact org.apache.maven.surefire:common-junit4:jar:2.12-TRUNK-HBASE-2
from/to ghelmling.testing (http://people.apache.org/~garyh/mvn/): Connection to http://people.apache.org
refused
Stack trace : 
org.apache.maven.lifecycle.LifecycleExecutionException: Failed to execute goal org.apache.maven.plugins:maven-surefire-plugin:2.12-TRUNK-HBASE-2:test
(default-test) on project hbase-common: Execution default-test of goal org.apache.maven.plugins:maven-surefire-plugin:2.12-TRUNK-HBASE-2:test
failed: Plugin org.apache.maven.plugins:maven-surefire-plugin:2.12-TRUNK-HBASE-2 or one of
its dependencies could not be resolved: Could not transfer artifact org.apache.maven.surefire:common-junit4:jar:2.12-TRUNK-HBASE-2
from/to ghelmling.testing (http://people.apache.org/~garyh/mvn/): Connection to http://people.apache.org
refused
	at org.apache.maven.lifecycle.internal.MojoExecutor.execute(MojoExecutor.java:225)
	at org.apache.maven.lifecycle.internal.MojoExecutor.execute(MojoExecutor.java:153)
	at org.apache.maven.lifecycle.internal.MojoExecutor.execute(MojoExecutor.java:145)
	at org.apache.maven.lifecycle.internal.LifecycleModuleBuilder.buildProject(LifecycleModuleBuilder.java:84)
	at org.apache.maven.lifecycle.internal.LifecycleModuleBuilder.buildProject(LifecycleModuleBuilder.java:59)
	at org.apache.maven.lifecycle.internal.LifecycleStarter.singleThreadedBuild(LifecycleStarter.java:183)
	at org.apache.maven.lifecycle.internal.LifecycleStarter.execute(LifecycleStarter.java:161)
	at org.apache.maven.DefaultMaven.doExecute(DefaultMaven.java:320)
	at org.apache.maven.DefaultMaven.execute(DefaultMaven.java:156)
	at org.jvnet.hudson.maven3.launcher.Maven3Launcher.main(Maven3Launcher.java:79)
	at sun.reflect.NativeMethodAccessorImpl.invoke0(Native Method)
	at sun.reflect.NativeMethodAccessorImpl.invoke(NativeMethodAccessorImpl.java:39)
	at sun.reflect.DelegatingMethodAccessorImpl.invoke(DelegatingMethodAccessorImpl.java:25)
	at java.lang.reflect.Method.invoke(Method.java:597)
	at org.codehaus.plexus.classworlds.launcher.Launcher.launchStandard(Launcher.java:329)
	at org.codehaus.plexus.classworlds.launcher.Launcher.launch(Launcher.java:239)
	at org.jvnet.hudson.maven3.agent.Maven3Main.launch(Maven3Main.java:158)
	at hudson.maven.Maven3Builder.call(Maven3Builder.java:100)
	at hudson.maven.Maven3Builder.call(Maven3Builder.java:66)
	at hudson.remoting.UserRequest.perform(UserRequest.java:118)
	at hudson.remoting.UserRequest.perform(UserRequest.java:48)
	at hudson.remoting.Request$2.run(Request.java:326)
	at hudson.remoting.InterceptingExecutorService$1.call(InterceptingExecutorService.java:72)
	at java.util.concurrent.FutureTask$Sync.innerRun(FutureTask.java:303)
	at java.util.concurrent.FutureTask.run(FutureTask.java:138)
	at java.util.concurrent.ThreadPoolExecutor$Worker.runTask(ThreadPoolExecutor.java:895)
	at java.util.concurrent.ThreadPoolExecutor$Worker.run(ThreadPoolExecutor.java:918)
	at java.lang.Thread.run(Thread.java:662)
Caused by: org.apache.maven.plugin.PluginExecutionException: Execution default-test of goal
org.apache.maven.plugins:maven-surefire-plugin:2.12-TRUNK-HBASE-2:test failed: Plugin org.apache.maven.plugins:maven-surefire-plugin:2.12-TRUNK-HBASE-2
or one of its dependencies could not be resolved: Could not transfer artifact org.apache.maven.surefire:common-junit4:jar:2.12-TRUNK-HBASE-2
from/to ghelmling.testing (http://people.apache.org/~garyh/mvn/): Connection to http://people.apache.org
refused
	at org.apache.maven.plugin.DefaultBuildPluginManager.executeMojo(DefaultBuildPluginManager.java:82)
	at org.apache.maven.lifecycle.internal.MojoExecutor.execute(MojoExecutor.java:209)
	... 27 more
Caused by: org.apache.maven.plugin.PluginResolutionException: Plugin org.apache.maven.plugins:maven-surefire-plugin:2.12-TRUNK-HBASE-2
or one of its dependencies could not be resolved: Could not transfer artifact org.apache.maven.surefire:common-junit4:jar:2.12-TRUNK-HBASE-2
from/to ghelmling.testing (http://people.apache.org/~garyh/mvn/): Connection to http://people.apache.org
refused
	at org.apache.maven.plugin.internal.DefaultPluginDependenciesResolver.resolve(DefaultPluginDependenciesResolver.java:215)
	at org.apache.maven.plugin.internal.DefaultMavenPluginManager.createPluginRealm(DefaultMavenPluginManager.java:353)
	at org.apache.maven.plugin.internal.DefaultMavenPluginManager.setupPluginRealm(DefaultMavenPluginManager.java:321)
	at org.apache.maven.plugin.DefaultBuildPluginManager.getPluginRealm(DefaultBuildPluginManager.java:175)
	at org.apache.maven.plugin.DefaultBuildPluginManager.executeMojo(DefaultBuildPluginManager.java:78)
	... 28 more
Caused by: org.sonatype.aether.resolution.ArtifactResolutionException: Could not transfer
artifact org.apache.maven.surefire:common-junit4:jar:2.12-TRUNK-HBASE-2 from/to ghelmling.testing
(http://people.apache.org/~garyh/mvn/): Connection to http://people.apache.org refused
	at org.sonatype.aether.impl.internal.DefaultArtifactResolver.resolve(DefaultArtifactResolver.java:538)
	at org.sonatype.aether.impl.internal.DefaultArtifactResolver.resolveArtifacts(DefaultArtifactResolver.java:216)
	at org.sonatype.aether.impl.internal.DefaultRepositorySystem.resolveDependencies(DefaultRepositorySystem.java:358)
	at org.apache.maven.plugin.internal.DefaultPluginDependenciesResolver.resolve(DefaultPluginDependenciesResolver.java:207)
	... 32 more
Caused by: org.sonatype.aether.transfer.ArtifactTransferException: Could not transfer artifact
org.apache.maven.surefire:common-junit4:jar:2.12-TRUNK-HBASE-2 from/to ghelmling.testing (http://people.apache.org/~garyh/mvn/):
Connection to http://people.apache.org refused
	at org.sonatype.aether.connector.wagon.WagonRepositoryConnector$4.wrap(WagonRepositoryConnector.java:951)
	at org.sonatype.aether.connector.wagon.WagonRepositoryConnector$4.wrap(WagonRepositoryConnector.java:941)
	at org.sonatype.aether.connector.wagon.WagonRepositoryConnector$GetTask.run(WagonRepositoryConnector.java:669)
	at org.sonatype.aether.util.concurrency.RunnableErrorForwarder$1.run(RunnableErrorForwarder.java:60)
	... 3 more
Caused by: org.apache.maven.wagon.TransferFailedException: Connection to http://people.apache.org
refused
	at org.apache.maven.wagon.shared.http4.AbstractHttpClientWagon.fillInputData(AbstractHttpClientWagon.java:799)
	at org.apache.maven.wagon.StreamWagon.getInputStream(StreamWagon.java:116)
	at org.apache.maven.wagon.StreamWagon.getIfNewer(StreamWagon.java:88)
	at org.apache.maven.wagon.StreamWagon.get(StreamWagon.java:61)
	at org.sonatype.aether.connector.wagon.WagonRepositoryConnector$GetTask.run(WagonRepositoryConnector.java:601)
	... 4 more
Caused by: org.apache.maven.wagon.providers.http.httpclient.conn.HttpHostConnectException:
Connection to http://people.apache.org refused
	at org.apache.maven.wagon.providers.http.httpclient.impl.conn.DefaultClientConnectionOperator.openConnection(DefaultClientConnectionOperator.java:158)
	at org.apache.maven.wagon.providers.http.httpclient.impl.conn.AbstractPoolEntry.open(AbstractPoolEntry.java:149)
	at org.apache.maven.wagon.providers.http.httpclient.impl.conn.AbstractPooledConnAdapter.open(AbstractPooledConnAdapter.java:121)
	at org.apache.maven.wagon.providers.http.httpclient.impl.client.DefaultRequestDirector.tryConnect(DefaultRequestDirector.java:573)
	at org.apache.maven.wagon.providers.http.httpclient.impl.client.DefaultRequestDirector.execute(DefaultRequestDirector.java:425)
	at org.apache.maven.wagon.providers.http.httpclient.impl.client.AbstractHttpClient.execute(AbstractHttpClient.java:820)
	at org.apache.maven.wagon.providers.http.httpclient.impl.client.AbstractHttpClient.execute(AbstractHttpClient.java:754)
	at org.apache.maven.wagon.shared.http4.AbstractHttpClientWagon.execute(AbstractHttpClientWagon.java:674)
	at org.apache.maven.wagon.shared.http4.AbstractHttpClientWagon.fillInputData(AbstractHttpClientWagon.java:793)
	... 8 more
Caused by: java.net.ConnectException: Connection timed out
	at java.net.PlainSocketImpl.socketConnect(Native Method)
	at java.net.PlainSocketImpl.doConnect(PlainSocketImpl.java:351)
	at java.net.PlainSocketImpl.connectToAddress(PlainSocketImpl.java:213)
	at java.net.PlainSocketImpl.connect(PlainSocketImpl.java:200)
	at java.net.SocksSocketImpl.connect(SocksSocketImpl.java:366)
	at java.net.Socket.connect(Socket.java:529)
	at org.apache.maven.wagon.providers.http.httpclient.conn.scheme.PlainSocketFactory.connectSocket(PlainSocketFactory.java:123)
	at org.apache.maven.wagon.providers.http.httpclient.impl.conn.DefaultClientConnectionOperator.openConnection(DefaultClientConnectionOperator.java:148)
	... 16 more
channel stopped

Mime
View raw message