hbase-builds mailing list archives

Site index · List index
Message view « Date » · « Thread »
Top « Date » · « Thread »
From apurt...@apache.org
Subject Build failed in Jenkins: HBase-0.95-Hadoop-2 #701
Date Sat, 27 Jul 2013 00:21:06 GMT
See <http://54.241.6.143/job/HBase-0.95-Hadoop-2/701/changes>

Changes:

[Michael Stack] HBASE-9051 TestHFileOutputFormat.testExcludeAllFromMinorCompaction fails

[Michael Stack] HBASE-8439 [replication] Remove ReplicationZookeeper class; ADDENDDUM

[jxiang] HBASE-9048 HCM throws NullPointerException under load

[jxiang] HBASE-9044 Merging regions throws NPE

[Michael Stack] HBASE-8439 [replication] Remove ReplicationZookeeper class

[Michael Stack] HBASE-8764 Some MasterMonitorCallable should retry

------------------------------------------
[...truncated 6273 lines...]
Downloading: http://repository-netty.forge.cloudbees.com/snapshot/org/jamon/jamon-runtime/2.3.1/jamon-runtime-2.3.1.jar
Downloading: https://repository.apache.org/content/repositories/releases/com/github/stephenc/high-scale-lib/high-scale-lib/1.1.1/high-scale-lib-1.1.1.jar
Downloading: https://repository.apache.org/content/repositories/releases/org/apache/httpcomponents/httpclient/4.1.3/httpclient-4.1.3.jar
Downloading: https://repository.apache.org/content/repositories/releases/org/apache/thrift/libthrift/0.9.0/libthrift-0.9.0.jar
Downloading: https://repository.apache.org/content/repositories/releases/org/apache/httpcomponents/httpcore/4.1.3/httpcore-4.1.3.jar
Downloading: https://repository.apache.org/content/repositories/releases/org/jruby/jruby-complete/1.6.8/jruby-complete-1.6.8.jar
Downloading: https://repository.apache.org/content/repositories/releases/org/mortbay/jetty/jetty-sslengine/6.1.26/jetty-sslengine-6.1.26.jar
Downloading: https://repository.apache.org/content/repositories/releases/org/mortbay/jetty/jsp-2.1/6.1.14/jsp-2.1-6.1.14.jar
Downloading: https://repository.apache.org/content/repositories/releases/org/eclipse/jdt/core/3.1.1/core-3.1.1.jar
Downloading: https://repository.apache.org/content/repositories/releases/org/mortbay/jetty/jsp-api-2.1/6.1.14/jsp-api-2.1-6.1.14.jar
Downloading: https://repository.apache.org/content/repositories/releases/org/mortbay/jetty/servlet-api-2.5/6.1.14/servlet-api-2.5-6.1.14.jar
Downloading: https://repository.apache.org/content/repositories/releases/org/jamon/jamon-runtime/2.3.1/jamon-runtime-2.3.1.jar
Downloaded: https://repository.apache.org/content/repositories/releases/org/apache/httpcomponents/httpcore/4.1.3/httpcore-4.1.3.jar
(177 KB at 322.3 KB/sec)
Downloaded: https://repository.apache.org/content/repositories/releases/org/apache/httpcomponents/httpclient/4.1.3/httpclient-4.1.3.jar
(345 KB at 308.3 KB/sec)
Downloaded: https://repository.apache.org/content/repositories/releases/org/apache/thrift/libthrift/0.9.0/libthrift-0.9.0.jar
(340 KB at 297.2 KB/sec)
Downloading: http://download.java.net/maven/2/com/github/stephenc/high-scale-lib/high-scale-lib/1.1.1/high-scale-lib-1.1.1.jar
Downloading: http://download.java.net/maven/2/org/jruby/jruby-complete/1.6.8/jruby-complete-1.6.8.jar
Downloading: http://download.java.net/maven/2/org/mortbay/jetty/jetty-sslengine/6.1.26/jetty-sslengine-6.1.26.jar
Downloading: http://download.java.net/maven/2/org/eclipse/jdt/core/3.1.1/core-3.1.1.jar
Downloading: http://download.java.net/maven/2/org/mortbay/jetty/jsp-2.1/6.1.14/jsp-2.1-6.1.14.jar
Downloading: http://download.java.net/maven/2/org/mortbay/jetty/jsp-api-2.1/6.1.14/jsp-api-2.1-6.1.14.jar
Downloading: http://download.java.net/maven/2/org/mortbay/jetty/servlet-api-2.5/6.1.14/servlet-api-2.5-6.1.14.jar
Downloading: http://download.java.net/maven/2/org/jamon/jamon-runtime/2.3.1/jamon-runtime-2.3.1.jar
Downloading: http://repository.codehaus.org/com/github/stephenc/high-scale-lib/high-scale-lib/1.1.1/high-scale-lib-1.1.1.jar
Downloading: http://repository.codehaus.org/org/jruby/jruby-complete/1.6.8/jruby-complete-1.6.8.jar
Downloading: http://repository.codehaus.org/org/mortbay/jetty/jetty-sslengine/6.1.26/jetty-sslengine-6.1.26.jar
Downloading: http://repository.codehaus.org/org/mortbay/jetty/jsp-2.1/6.1.14/jsp-2.1-6.1.14.jar
Downloading: http://repository.codehaus.org/org/eclipse/jdt/core/3.1.1/core-3.1.1.jar
Downloading: http://repository.codehaus.org/org/mortbay/jetty/jsp-api-2.1/6.1.14/jsp-api-2.1-6.1.14.jar
Downloading: http://repository.codehaus.org/org/mortbay/jetty/servlet-api-2.5/6.1.14/servlet-api-2.5-6.1.14.jar
Downloading: http://repository.codehaus.org/org/jamon/jamon-runtime/2.3.1/jamon-runtime-2.3.1.jar
Downloaded: http://repository.codehaus.org/org/mortbay/jetty/jsp-api-2.1/6.1.14/jsp-api-2.1-6.1.14.jar
(132 KB at 243.5 KB/sec)
Downloaded: http://repository.codehaus.org/org/mortbay/jetty/servlet-api-2.5/6.1.14/servlet-api-2.5-6.1.14.jar
(130 KB at 238.5 KB/sec)
Downloaded: http://repository.codehaus.org/org/mortbay/jetty/jsp-2.1/6.1.14/jsp-2.1-6.1.14.jar
(1001 KB at 970.6 KB/sec)
Downloaded: http://repository.codehaus.org/org/jruby/jruby-complete/1.6.8/jruby-complete-1.6.8.jar
(13509 KB at 8040.5 KB/sec)
Downloading: http://repository.jboss.org/nexus/content/groups/public-jboss/com/github/stephenc/high-scale-lib/high-scale-lib/1.1.1/high-scale-lib-1.1.1.jar
Downloading: http://repository.jboss.org/nexus/content/groups/public-jboss/org/mortbay/jetty/jetty-sslengine/6.1.26/jetty-sslengine-6.1.26.jar
Downloading: http://repository.jboss.org/nexus/content/groups/public-jboss/org/eclipse/jdt/core/3.1.1/core-3.1.1.jar
Downloading: http://repository.jboss.org/nexus/content/groups/public-jboss/org/jamon/jamon-runtime/2.3.1/jamon-runtime-2.3.1.jar
Downloading: http://people.apache.org/~garyh/mvn/com/github/stephenc/high-scale-lib/high-scale-lib/1.1.1/high-scale-lib-1.1.1.jar
Downloading: http://people.apache.org/~garyh/mvn/org/mortbay/jetty/jetty-sslengine/6.1.26/jetty-sslengine-6.1.26.jar
Downloading: http://people.apache.org/~garyh/mvn/org/eclipse/jdt/core/3.1.1/core-3.1.1.jar
Downloading: http://people.apache.org/~garyh/mvn/org/jamon/jamon-runtime/2.3.1/jamon-runtime-2.3.1.jar
Downloading: http://repo.maven.apache.org/maven2/com/github/stephenc/high-scale-lib/high-scale-lib/1.1.1/high-scale-lib-1.1.1.jar
Downloading: http://repo.maven.apache.org/maven2/org/mortbay/jetty/jetty-sslengine/6.1.26/jetty-sslengine-6.1.26.jar
Downloading: http://repo.maven.apache.org/maven2/org/jamon/jamon-runtime/2.3.1/jamon-runtime-2.3.1.jar
Downloading: http://repo.maven.apache.org/maven2/org/eclipse/jdt/core/3.1.1/core-3.1.1.jar
Downloaded: http://repo.maven.apache.org/maven2/org/jamon/jamon-runtime/2.3.1/jamon-runtime-2.3.1.jar
(21 KB at 671.9 KB/sec)
Downloaded: http://repo.maven.apache.org/maven2/com/github/stephenc/high-scale-lib/high-scale-lib/1.1.1/high-scale-lib-1.1.1.jar
(94 KB at 2231.6 KB/sec)
Downloaded: http://repo.maven.apache.org/maven2/org/mortbay/jetty/jetty-sslengine/6.1.26/jetty-sslengine-6.1.26.jar
(19 KB at 107.3 KB/sec)
Downloaded: http://repo.maven.apache.org/maven2/org/eclipse/jdt/core/3.1.1/core-3.1.1.jar
(3484 KB at 14759.5 KB/sec)
[INFO] 
[INFO] --- maven-antrun-plugin:1.6:run (generate) @ hbase-server ---
[INFO] Executing tasks

main:
    [mkdir] Created dir: <http://54.241.6.143/job/HBase-0.95-Hadoop-2/ws/hbase-server/target/hbase-webapps>
     [copy] Copying 17 files to <http://54.241.6.143/job/HBase-0.95-Hadoop-2/ws/hbase-server/target/hbase-webapps>
2013-07-27 00:20:48,519 INFO  [pool-1-thread-1] mortbay.log (Slf4jLog.java:info(67)) - Logging
to org.slf4j.impl.Log4jLoggerAdapter(org.mortbay.log) via org.mortbay.log.Slf4jLog
    [mkdir] Created dir: <http://54.241.6.143/job/HBase-0.95-Hadoop-2/ws/hbase-server/target/hbase-webapps/master/WEB-INF>
    [mkdir] Created dir: <http://54.241.6.143/job/HBase-0.95-Hadoop-2/ws/hbase-server/target/hbase-webapps/regionserver/WEB-INF>
    [mkdir] Created dir: <http://54.241.6.143/job/HBase-0.95-Hadoop-2/ws/hbase-server/target/hbase-webapps/rest/WEB-INF>
    [mkdir] Created dir: <http://54.241.6.143/job/HBase-0.95-Hadoop-2/ws/hbase-server/target/hbase-webapps/thrift/WEB-INF>
[INFO] Executed tasks
[INFO] [INFO] Source directory: <http://54.241.6.143/job/HBase-0.95-Hadoop-2/ws/hbase-server/target/generated-jamon>
added.
[INFO] Source directory: <http://54.241.6.143/job/HBase-0.95-Hadoop-2/ws/hbase-server/target/generated-sources/java>
added.

[INFO] --- build-helper-maven-plugin:1.5:add-source (jspcSource-packageInfo-Avro-source) @
hbase-server ---
[INFO] 
[INFO] --- jamon-maven-plugin:2.3.4:translate (default) @ hbase-server ---
Downloading: http://people.apache.org/~garyh/mvn/org/jamon/jamon-processor/2.3.4/jamon-processor-2.3.4.pom
Downloading: http://repo.maven.apache.org/maven2/org/jamon/jamon-processor/2.3.4/jamon-processor-2.3.4.pom
Downloaded: http://repo.maven.apache.org/maven2/org/jamon/jamon-processor/2.3.4/jamon-processor-2.3.4.pom
(3 KB at 126.7 KB/sec)
Downloading: http://people.apache.org/~garyh/mvn/org/jamon/jamon-api/2.3.0/jamon-api-2.3.0.pom
Downloading: http://repo.maven.apache.org/maven2/org/jamon/jamon-api/2.3.0/jamon-api-2.3.0.pom
Downloaded: http://repo.maven.apache.org/maven2/org/jamon/jamon-api/2.3.0/jamon-api-2.3.0.pom
(2 KB at 57.4 KB/sec)
Downloading: http://people.apache.org/~garyh/mvn/org/jamon/jamon-project/1.0.1/jamon-project-1.0.1.pom
Downloading: http://repo.maven.apache.org/maven2/org/jamon/jamon-project/1.0.1/jamon-project-1.0.1.pom
Downloaded: http://repo.maven.apache.org/maven2/org/jamon/jamon-project/1.0.1/jamon-project-1.0.1.pom
(9 KB at 684.8 KB/sec)
Downloading: http://people.apache.org/~garyh/mvn/org/codehaus/plexus/plexus-compiler-api/1.8.1/plexus-compiler-api-1.8.1.pom
Downloading: http://repo.maven.apache.org/maven2/org/codehaus/plexus/plexus-compiler-api/1.8.1/plexus-compiler-api-1.8.1.pom
Downloaded: http://repo.maven.apache.org/maven2/org/codehaus/plexus/plexus-compiler-api/1.8.1/plexus-compiler-api-1.8.1.pom
(805 B at 60.5 KB/sec)
Downloading: http://people.apache.org/~garyh/mvn/org/codehaus/plexus/plexus-compiler/1.8.1/plexus-compiler-1.8.1.pom
Downloading: http://repo.maven.apache.org/maven2/org/codehaus/plexus/plexus-compiler/1.8.1/plexus-compiler-1.8.1.pom
Downloaded: http://repo.maven.apache.org/maven2/org/codehaus/plexus/plexus-compiler/1.8.1/plexus-compiler-1.8.1.pom
(4 KB at 242.5 KB/sec)
Downloading: http://people.apache.org/~garyh/mvn/org/jamon/jamon-processor/2.3.4/jamon-processor-2.3.4.jar
Downloading: http://people.apache.org/~garyh/mvn/org/codehaus/plexus/plexus-compiler-api/1.8.1/plexus-compiler-api-1.8.1.jar
Downloading: http://people.apache.org/~garyh/mvn/org/jamon/jamon-api/2.3.0/jamon-api-2.3.0.jar
Downloading: http://people.apache.org/~garyh/mvn/org/codehaus/plexus/plexus-utils/1.5.5/plexus-utils-1.5.5.jar
Downloading: http://repo.maven.apache.org/maven2/org/jamon/jamon-processor/2.3.4/jamon-processor-2.3.4.jar
Downloading: http://repo.maven.apache.org/maven2/org/jamon/jamon-api/2.3.0/jamon-api-2.3.0.jar
Downloading: http://repo.maven.apache.org/maven2/org/codehaus/plexus/plexus-compiler-api/1.8.1/plexus-compiler-api-1.8.1.jar
Downloading: http://repo.maven.apache.org/maven2/org/codehaus/plexus/plexus-utils/1.5.5/plexus-utils-1.5.5.jar
Downloaded: http://repo.maven.apache.org/maven2/org/jamon/jamon-api/2.3.0/jamon-api-2.3.0.jar
(5 KB at 264.3 KB/sec)
Downloaded: http://repo.maven.apache.org/maven2/org/codehaus/plexus/plexus-compiler-api/1.8.1/plexus-compiler-api-1.8.1.jar
(20 KB at 886.1 KB/sec)
Downloaded: http://repo.maven.apache.org/maven2/org/codehaus/plexus/plexus-utils/1.5.5/plexus-utils-1.5.5.jar
(246 KB at 7435.9 KB/sec)
Downloaded: http://repo.maven.apache.org/maven2/org/jamon/jamon-processor/2.3.4/jamon-processor-2.3.4.jar
(264 KB at 2043.3 KB/sec)
[INFO] Translating 8 templates from <http://54.241.6.143/job/HBase-0.95-Hadoop-2/ws/hbase-server/src/main/jamon>
to <http://54.241.6.143/job/HBase-0.95-Hadoop-2/ws/hbase-server/target/generated-jamon>
[INFO] 
[INFO] --- maven-remote-resources-plugin:1.4:process (default) @ hbase-server ---
[INFO] [INFO] Using 'UTF-8' encoding to copy filtered resources.

[INFO] --- maven-resources-plugin:2.6:resources (default-resources) @ hbase-server ---
[INFO] Copying 21 resources
[INFO] Copying 3 resources
[INFO] 
[INFO] --- maven-compiler-plugin:2.5.1:compile (default-compile) @ hbase-server ---
[INFO] Compiling 636 source files to <http://54.241.6.143/job/HBase-0.95-Hadoop-2/ws/hbase-server/target/classes>
[INFO] [INFO] Wrote classpath file '<http://54.241.6.143/job/HBase-0.95-Hadoop-2/ws/hbase-server/target/test-classes/mrapp-generated-classpath'.>

[INFO] --- maven-dependency-plugin:2.1:build-classpath (create-mrapp-generated-classpath)
@ hbase-server ---
[INFO] [INFO] Using 'UTF-8' encoding to copy filtered resources.
[INFO] Copying 7 resources

[INFO] --- maven-resources-plugin:2.6:testResources (default-testResources) @ hbase-server
---
[INFO] Copying 3 resources
[INFO] 
[INFO] --- maven-compiler-plugin:2.5.1:testCompile (default-testCompile) @ hbase-server ---
[INFO] Compiling 486 source files to <http://54.241.6.143/job/HBase-0.95-Hadoop-2/ws/hbase-server/target/test-classes>
[INFO] -------------------------------------------------------------
[ERROR] COMPILATION ERROR : 
[INFO] -------------------------------------------------------------
[ERROR] <http://54.241.6.143/job/HBase-0.95-Hadoop-2/ws/hbase-server/src/test/java/org/apache/hadoop/hbase/mapreduce/TestHFileOutputFormat.java>:[634,49]
cannot find symbol
symbol  : variable Lists
location: class org.apache.hadoop.hbase.mapreduce.TestHFileOutputFormat
[INFO] 1 error
[INFO] -------------------------------------------------------------
[INFO] ------------------------------------------------------------------------
[INFO] Reactor Summary:
[INFO] 
[INFO] HBase ............................................. SUCCESS [28.150s]
[INFO] HBase - Common .................................... SUCCESS [1:55.471s]
[INFO] HBase - Protocol .................................. SUCCESS [17.507s]
[INFO] HBase - Client .................................... SUCCESS [24.048s]
[INFO] HBase - Prefix Tree ............................... SUCCESS [4.756s]
[INFO] HBase - Hadoop Compatibility ...................... SUCCESS [5.607s]
[INFO] HBase - Hadoop Two Compatibility .................. SUCCESS [30.143s]
[INFO] HBase - Server .................................... FAILURE [31.630s]
[INFO] HBase - Integration Tests ......................... SKIPPED
[INFO] HBase - Examples .................................. SKIPPED
[INFO] HBase - Assembly .................................. SKIPPED
[INFO] ------------------------------------------------------------------------
[INFO] BUILD FAILURE
[INFO] ------------------------------------------------------------------------
[INFO] Total time: 4:46.030s
[INFO] Finished at: Sat Jul 27 00:21:02 UTC 2013
[INFO] Final Memory: 55M/430M
[INFO] ------------------------------------------------------------------------
[JENKINS] Archiving <http://54.241.6.143/job/HBase-0.95-Hadoop-2/ws/hbase-hadoop2-compat/pom.xml>
to /var/lib/jenkins/jobs/HBase-0.95-Hadoop-2/modules/org.apache.hbase$hbase-hadoop2-compat/builds/2013-07-27_00-16-11/archive/org.apache.hbase/hbase-hadoop2-compat/0.95.2-SNAPSHOT/hbase-hadoop2-compat-0.95.2-SNAPSHOT.pom
[JENKINS] Archiving <http://54.241.6.143/job/HBase-0.95-Hadoop-2/ws/hbase-common/pom.xml>
to /var/lib/jenkins/jobs/HBase-0.95-Hadoop-2/modules/org.apache.hbase$hbase-common/builds/2013-07-27_00-16-11/archive/org.apache.hbase/hbase-common/0.95.2-SNAPSHOT/hbase-common-0.95.2-SNAPSHOT.pom
[JENKINS] Archiving <http://54.241.6.143/job/HBase-0.95-Hadoop-2/ws/hbase-hadoop-compat/pom.xml>
to /var/lib/jenkins/jobs/HBase-0.95-Hadoop-2/modules/org.apache.hbase$hbase-hadoop-compat/builds/2013-07-27_00-16-11/archive/org.apache.hbase/hbase-hadoop-compat/0.95.2-SNAPSHOT/hbase-hadoop-compat-0.95.2-SNAPSHOT.pom
[JENKINS] Archiving <http://54.241.6.143/job/HBase-0.95-Hadoop-2/ws/hbase-examples/pom.xml>
to /var/lib/jenkins/jobs/HBase-0.95-Hadoop-2/modules/org.apache.hbase$hbase-examples/builds/2013-07-27_00-16-11/archive/org.apache.hbase/hbase-examples/0.95.2-SNAPSHOT/hbase-examples-0.95.2-SNAPSHOT.pom
[JENKINS] Archiving <http://54.241.6.143/job/HBase-0.95-Hadoop-2/ws/hbase-it/pom.xml>
to /var/lib/jenkins/jobs/HBase-0.95-Hadoop-2/modules/org.apache.hbase$hbase-it/builds/2013-07-27_00-16-11/archive/org.apache.hbase/hbase-it/0.95.2-SNAPSHOT/hbase-it-0.95.2-SNAPSHOT.pom
[JENKINS] Archiving <http://54.241.6.143/job/HBase-0.95-Hadoop-2/ws/pom.xml> to /var/lib/jenkins/jobs/HBase-0.95-Hadoop-2/modules/org.apache.hbase$hbase/builds/2013-07-27_00-16-11/archive/org.apache.hbase/hbase/0.95.2-SNAPSHOT/hbase-0.95.2-SNAPSHOT.pom
[JENKINS] Archiving <http://54.241.6.143/job/HBase-0.95-Hadoop-2/ws/hbase-assembly/pom.xml>
to /var/lib/jenkins/jobs/HBase-0.95-Hadoop-2/modules/org.apache.hbase$hbase-assembly/builds/2013-07-27_00-16-11/archive/org.apache.hbase/hbase-assembly/0.95.2-SNAPSHOT/hbase-assembly-0.95.2-SNAPSHOT.pom
[JENKINS] Archiving <http://54.241.6.143/job/HBase-0.95-Hadoop-2/ws/hbase-client/pom.xml>
to /var/lib/jenkins/jobs/HBase-0.95-Hadoop-2/modules/org.apache.hbase$hbase-client/builds/2013-07-27_00-16-11/archive/org.apache.hbase/hbase-client/0.95.2-SNAPSHOT/hbase-client-0.95.2-SNAPSHOT.pom
[JENKINS] Archiving <http://54.241.6.143/job/HBase-0.95-Hadoop-2/ws/hbase-prefix-tree/pom.xml>
to /var/lib/jenkins/jobs/HBase-0.95-Hadoop-2/modules/org.apache.hbase$hbase-prefix-tree/builds/2013-07-27_00-16-11/archive/org.apache.hbase/hbase-prefix-tree/0.95.2-SNAPSHOT/hbase-prefix-tree-0.95.2-SNAPSHOT.pom
[JENKINS] Archiving <http://54.241.6.143/job/HBase-0.95-Hadoop-2/ws/hbase-protocol/pom.xml>
to /var/lib/jenkins/jobs/HBase-0.95-Hadoop-2/modules/org.apache.hbase$hbase-protocol/builds/2013-07-27_00-16-11/archive/org.apache.hbase/hbase-protocol/0.95.2-SNAPSHOT/hbase-protocol-0.95.2-SNAPSHOT.pom
[JENKINS] Archiving <http://54.241.6.143/job/HBase-0.95-Hadoop-2/ws/hbase-server/pom.xml>
to /var/lib/jenkins/jobs/HBase-0.95-Hadoop-2/modules/org.apache.hbase$hbase-server/builds/2013-07-27_00-16-11/archive/org.apache.hbase/hbase-server/0.95.2-SNAPSHOT/hbase-server-0.95.2-SNAPSHOT.pom
Waiting for Jenkins to finish collecting data
mavenExecutionResult exceptions not empty
message : Failed to execute goal org.apache.maven.plugins:maven-compiler-plugin:2.5.1:testCompile
(default-testCompile) on project hbase-server: Compilation failure
<http://54.241.6.143/job/HBase-0.95-Hadoop-2/ws/hbase-server/src/test/java/org/apache/hadoop/hbase/mapreduce/TestHFileOutputFormat.java>:[634,49]
cannot find symbol
symbol  : variable Lists
location: class org.apache.hadoop.hbase.mapreduce.TestHFileOutputFormat

cause : Compilation failure
<http://54.241.6.143/job/HBase-0.95-Hadoop-2/ws/hbase-server/src/test/java/org/apache/hadoop/hbase/mapreduce/TestHFileOutputFormat.java>:[634,49]
cannot find symbol
symbol  : variable Lists
location: class org.apache.hadoop.hbase.mapreduce.TestHFileOutputFormat

Stack trace : 
org.apache.maven.lifecycle.LifecycleExecutionException: Failed to execute goal org.apache.maven.plugins:maven-compiler-plugin:2.5.1:testCompile
(default-testCompile) on project hbase-server: Compilation failure
<http://54.241.6.143/job/HBase-0.95-Hadoop-2/ws/hbase-server/src/test/java/org/apache/hadoop/hbase/mapreduce/TestHFileOutputFormat.java>:[634,49]
cannot find symbol
symbol  : variable Lists
location: class org.apache.hadoop.hbase.mapreduce.TestHFileOutputFormat

	at org.apache.maven.lifecycle.internal.MojoExecutor.execute(MojoExecutor.java:213)
	at org.apache.maven.lifecycle.internal.MojoExecutor.execute(MojoExecutor.java:153)
	at org.apache.maven.lifecycle.internal.MojoExecutor.execute(MojoExecutor.java:145)
	at org.apache.maven.lifecycle.internal.LifecycleModuleBuilder.buildProject(LifecycleModuleBuilder.java:84)
	at org.apache.maven.lifecycle.internal.LifecycleModuleBuilder.buildProject(LifecycleModuleBuilder.java:59)
	at org.apache.maven.lifecycle.internal.LifecycleStarter.singleThreadedBuild(LifecycleStarter.java:183)
	at org.apache.maven.lifecycle.internal.LifecycleStarter.execute(LifecycleStarter.java:161)
	at org.apache.maven.DefaultMaven.doExecute(DefaultMaven.java:320)
	at org.apache.maven.DefaultMaven.execute(DefaultMaven.java:156)
	at org.jvnet.hudson.maven3.launcher.Maven3Launcher.main(Maven3Launcher.java:79)
	at sun.reflect.NativeMethodAccessorImpl.invoke0(Native Method)
	at sun.reflect.NativeMethodAccessorImpl.invoke(NativeMethodAccessorImpl.java:39)
	at sun.reflect.DelegatingMethodAccessorImpl.invoke(DelegatingMethodAccessorImpl.java:25)
	at java.lang.reflect.Method.invoke(Method.java:597)
	at org.codehaus.plexus.classworlds.launcher.Launcher.launchStandard(Launcher.java:329)
	at org.codehaus.plexus.classworlds.launcher.Launcher.launch(Launcher.java:239)
	at org.jvnet.hudson.maven3.agent.Maven3Main.launch(Maven3Main.java:158)
	at hudson.maven.Maven3Builder.call(Maven3Builder.java:100)
	at hudson.maven.Maven3Builder.call(Maven3Builder.java:66)
	at hudson.remoting.UserRequest.perform(UserRequest.java:118)
	at hudson.remoting.UserRequest.perform(UserRequest.java:48)
	at hudson.remoting.Request$2.run(Request.java:326)
	at hudson.remoting.InterceptingExecutorService$1.call(InterceptingExecutorService.java:72)
	at java.util.concurrent.FutureTask$Sync.innerRun(FutureTask.java:303)
	at java.util.concurrent.FutureTask.run(FutureTask.java:138)
	at java.util.concurrent.ThreadPoolExecutor$Worker.runTask(ThreadPoolExecutor.java:895)
	at java.util.concurrent.ThreadPoolExecutor$Worker.run(ThreadPoolExecutor.java:918)
	at java.lang.Thread.run(Thread.java:662)
Caused by: org.apache.maven.plugin.CompilationFailureException: Compilation failure
<http://54.241.6.143/job/HBase-0.95-Hadoop-2/ws/hbase-server/src/test/java/org/apache/hadoop/hbase/mapreduce/TestHFileOutputFormat.java>:[634,49]
cannot find symbol
symbol  : variable Lists
location: class org.apache.hadoop.hbase.mapreduce.TestHFileOutputFormat

	at org.apache.maven.plugin.AbstractCompilerMojo.execute(AbstractCompilerMojo.java:729)
	at org.apache.maven.plugin.TestCompilerMojo.execute(TestCompilerMojo.java:161)
	at org.apache.maven.plugin.DefaultBuildPluginManager.executeMojo(DefaultBuildPluginManager.java:101)
	at org.apache.maven.lifecycle.internal.MojoExecutor.execute(MojoExecutor.java:209)
	... 27 more
channel stopped
Performing Post build task...
Match found for :.* : True
Logical operation result is TRUE
Running script  :   ZOMBIE_TESTS_COUNT=`jps | grep surefirebooter | wc -l`
  if [[ $ZOMBIE_TESTS_COUNT != 0 ]] ; then
    ZOMBIE_TESTS_COUNT=`jps | grep surefirebooter | wc -l`
    if [[ $ZOMBIE_TESTS_COUNT != 0 ]] ; then
      echo "There are $ZOMBIE_TESTS_COUNT zombie tests, they should have been killed by surefire
but survived"
      echo "************ BEGIN zombies jstack extract"
      ZB_STACK=`jps | grep surefirebooter | cut -d ' ' -f 1 | xargs -n 1 jstack | grep ".test"
| grep "\.java"`
      jps | grep surefirebooter | cut -d ' ' -f 1 | xargs -n 1 jstack
      echo "************ END  zombies jstack extract"
      JIRA_COMMENT="$JIRA_COMMENT

     {color:red}-1 core zombie tests{color}.  There are ${ZOMBIE_TESTS_COUNT} zombie test(s):
${ZB_STACK}"
      BAD=1
      jps | grep surefirebooter | cut -d ' ' -f 1 | xargs kill -9
    else
      echo "We're ok: there is no zombie test, but some tests took some time to stop"
    fi
  else
    echo "We're ok: there is no zombie test"
  fi
[HBase-0.95-Hadoop-2] $ /bin/bash -xe /tmp/hudson699828320820507560.sh
++ jps
++ grep surefirebooter
++ wc -l
+ ZOMBIE_TESTS_COUNT=0
+ [[ 0 != 0 ]]
+ echo 'We'\''re ok: there is no zombie test'
We're ok: there is no zombie test
POST BUILD TASK : SUCCESS
END OF POST BUILD TASK : 0

Mime
View raw message