hbase-builds mailing list archives

Site index · List index
Message view « Date » · « Thread »
Top « Date » · « Thread »
From apurt...@apache.org
Subject Build failed in Jenkins: HBase-TRUNK-Hadoop-2 #397
Date Fri, 12 Jul 2013 17:52:04 GMT
See <http://54.241.6.143/job/HBase-TRUNK-Hadoop-2/397/changes>

Changes:

[Michael Stack] HBASE-8934 Fix bunch of flaky tests

------------------------------------------
[...truncated 3062 lines...]
[INFO] ------------------------------------------------------------------------
[INFO] 
[INFO] --- maven-remote-resources-plugin:1.4:process (default) @ hbase-hadoop2-compat ---
[INFO] [INFO] Using 'UTF-8' encoding to copy filtered resources.

[INFO] [INFO] Copying 10 resources
--- maven-resources-plugin:2.6:resources (default-resources) @ hbase-hadoop2-compat ---
[INFO] Copying 3 resources
[INFO] 
[INFO] --- maven-compiler-plugin:2.5.1:compile (default-compile) @ hbase-hadoop2-compat ---
[INFO] Compiling 24 source files to <http://54.241.6.143/job/HBase-TRUNK-Hadoop-2/ws/hbase-hadoop2-compat/target/classes>
[INFO] 
[INFO] --- maven-dependency-plugin:2.4:build-classpath (create-mrapp-generated-classpath)
@ hbase-hadoop2-compat ---
[INFO] Wrote classpath file '<http://54.241.6.143/job/HBase-TRUNK-Hadoop-2/ws/hbase-hadoop2-compat/target/test-classes/mrapp-generated-classpath'.>
[INFO] [INFO] Using 'UTF-8' encoding to copy filtered resources.
[INFO] Copying 2 resources
[INFO] Copying 3 resources

[INFO] --- maven-resources-plugin:2.6:testResources (default-testResources) @ hbase-hadoop2-compat
---
[INFO] 
[INFO] [INFO] Compiling 10 source files to <http://54.241.6.143/job/HBase-TRUNK-Hadoop-2/ws/hbase-hadoop2-compat/target/test-classes>
--- maven-compiler-plugin:2.5.1:testCompile (default-testCompile) @ hbase-hadoop2-compat ---
[INFO] [INFO] Surefire report directory: <http://54.241.6.143/job/HBase-TRUNK-Hadoop-2/ws/hbase-hadoop2-compat/target/surefire-reports>
[INFO] Using configured provider org.apache.maven.surefire.junitcore.JUnitCoreProvider

[INFO] --- maven-surefire-plugin:2.12-TRUNK-HBASE-2:test (default-test) @ hbase-hadoop2-compat
---

-------------------------------------------------------
 T E S T S
-------------------------------------------------------
Running org.apache.hadoop.hbase.metrics.TestBaseSourceImpl
Tests run: 5, Failures: 0, Errors: 0, Skipped: 0, Time elapsed: 0.004 sec
Running org.apache.hadoop.hbase.regionserver.TestMetricsRegionSourceImpl
Tests run: 2, Failures: 0, Errors: 0, Skipped: 0, Time elapsed: 0.016 sec
Running org.apache.hadoop.hbase.regionserver.TestMetricsRegionServerSourceImpl
Tests run: 2, Failures: 0, Errors: 0, Skipped: 0, Time elapsed: 0.009 sec
Running org.apache.hadoop.hbase.regionserver.wal.TestMetricsWALSourceImpl
Tests run: 1, Failures: 0, Errors: 0, Skipped: 0, Time elapsed: 0.003 sec
Running org.apache.hadoop.hbase.replication.regionserver.TestMetricsReplicationSourceImpl
Tests run: 1, Failures: 0, Errors: 0, Skipped: 0, Time elapsed: 0.003 sec
Running org.apache.hadoop.hbase.master.TestMetricsMasterSourceImpl
Tests run: 1, Failures: 0, Errors: 0, Skipped: 0, Time elapsed: 0.007 sec
Running org.apache.hadoop.hbase.thrift.TestMetricsThriftServerSourceFactoryImpl
Tests run: 3, Failures: 0, Errors: 0, Skipped: 0, Time elapsed: 0.007 sec
Running org.apache.hadoop.hbase.rest.TestMetricsRESTSourceImpl
Tests run: 1, Failures: 0, Errors: 0, Skipped: 0, Time elapsed: 0.467 sec

Results :

Tests run: 16, Failures: 0, Errors: 0, Skipped: 0

[JENKINS] Recording test results
[INFO] [INFO] Tests are skipped.

[INFO] --- maven-surefire-plugin:2.12-TRUNK-HBASE-2:test (secondPartTestsExecution) @ hbase-hadoop2-compat
---
[INFO] 
[INFO] --- maven-source-plugin:2.2.1:jar-no-fork (attach-sources) @ hbase-hadoop2-compat ---
[INFO] Building jar: <http://54.241.6.143/job/HBase-TRUNK-Hadoop-2/ws/hbase-hadoop2-compat/target/hbase-hadoop2-compat-0.97.0-SNAPSHOT-sources.jar>
[INFO] 
[INFO] --- maven-jar-plugin:2.4:test-jar (default) @ hbase-hadoop2-compat ---
[INFO] Building jar: <http://54.241.6.143/job/HBase-TRUNK-Hadoop-2/ws/hbase-hadoop2-compat/target/hbase-hadoop2-compat-0.97.0-SNAPSHOT-tests.jar>
[INFO] 
[INFO] --- maven-jar-plugin:2.4:jar (default-jar) @ hbase-hadoop2-compat ---
[INFO] Building jar: <http://54.241.6.143/job/HBase-TRUNK-Hadoop-2/ws/hbase-hadoop2-compat/target/hbase-hadoop2-compat-0.97.0-SNAPSHOT.jar>
[INFO] [INFO] Installing <http://54.241.6.143/job/HBase-TRUNK-Hadoop-2/ws/hbase-hadoop2-compat/target/hbase-hadoop2-compat-0.97.0-SNAPSHOT.jar>
to /home/ec2-user/jenkins/maven-repositories/0/org/apache/hbase/hbase-hadoop2-compat/0.97.0-SNAPSHOT/hbase-hadoop2-compat-0.97.0-SNAPSHOT.jar
[INFO] Installing <http://54.241.6.143/job/HBase-TRUNK-Hadoop-2/ws/hbase-hadoop2-compat/pom.xml>
to /home/ec2-user/jenkins/maven-repositories/0/org/apache/hbase/hbase-hadoop2-compat/0.97.0-SNAPSHOT/hbase-hadoop2-compat-0.97.0-SNAPSHOT.pom

[INFO] Installing <http://54.241.6.143/job/HBase-TRUNK-Hadoop-2/ws/hbase-hadoop2-compat/target/hbase-hadoop2-compat-0.97.0-SNAPSHOT-sources.jar>
to /home/ec2-user/jenkins/maven-repositories/0/org/apache/hbase/hbase-hadoop2-compat/0.97.0-SNAPSHOT/hbase-hadoop2-compat-0.97.0-SNAPSHOT-sources.jar
[INFO] --- maven-install-plugin:2.3.1:install (default-install) @ hbase-hadoop2-compat ---[INFO]
Installing <http://54.241.6.143/job/HBase-TRUNK-Hadoop-2/ws/hbase-hadoop2-compat/target/hbase-hadoop2-compat-0.97.0-SNAPSHOT-tests.jar>
to /home/ec2-user/jenkins/maven-repositories/0/org/apache/hbase/hbase-hadoop2-compat/0.97.0-SNAPSHOT/hbase-hadoop2-compat-0.97.0-SNAPSHOT-tests.jar

[INFO]                                                                         
[INFO] ------------------------------------------------------------------------
[INFO] Building HBase - Server 0.97.0-SNAPSHOT
[INFO] ------------------------------------------------------------------------
[INFO] 
[INFO] --- maven-antrun-plugin:1.6:run (generate) @ hbase-server ---
[INFO] Executing tasks

main:
    [mkdir] Created dir: <http://54.241.6.143/job/HBase-TRUNK-Hadoop-2/ws/hbase-server/target/hbase-webapps>
     [copy] Copying 17 files to <http://54.241.6.143/job/HBase-TRUNK-Hadoop-2/ws/hbase-server/target/hbase-webapps>
2013-07-12 17:51:42,785 INFO  [pool-1-thread-1] mortbay.log (Slf4jLog.java:info(67)) - Logging
to org.slf4j.impl.Log4jLoggerAdapter(org.mortbay.log) via org.mortbay.log.Slf4jLog
    [mkdir] Created dir: <http://54.241.6.143/job/HBase-TRUNK-Hadoop-2/ws/hbase-server/target/hbase-webapps/master/WEB-INF>
    [mkdir] Created dir: <http://54.241.6.143/job/HBase-TRUNK-Hadoop-2/ws/hbase-server/target/hbase-webapps/regionserver/WEB-INF>
    [mkdir] Created dir: <http://54.241.6.143/job/HBase-TRUNK-Hadoop-2/ws/hbase-server/target/hbase-webapps/rest/WEB-INF>
    [mkdir] Created dir: <http://54.241.6.143/job/HBase-TRUNK-Hadoop-2/ws/hbase-server/target/hbase-webapps/thrift/WEB-INF>
[INFO] Executed tasks
[INFO] [INFO] Source directory: <http://54.241.6.143/job/HBase-TRUNK-Hadoop-2/ws/hbase-server/target/generated-jamon>
added.
[INFO] Source directory: <http://54.241.6.143/job/HBase-TRUNK-Hadoop-2/ws/hbase-server/target/generated-sources/java>
added.

[INFO] --- build-helper-maven-plugin:1.5:add-source (jspcSource-packageInfo-Avro-source) @
hbase-server ---
[INFO] 
[INFO] --- jamon-maven-plugin:2.3.4:translate (default) @ hbase-server ---
[INFO] Translating 8 templates from <http://54.241.6.143/job/HBase-TRUNK-Hadoop-2/ws/hbase-server/src/main/jamon>
to <http://54.241.6.143/job/HBase-TRUNK-Hadoop-2/ws/hbase-server/target/generated-jamon>
[INFO] 
[INFO] --- maven-remote-resources-plugin:1.4:process (default) @ hbase-server ---
[INFO] [INFO] Using 'UTF-8' encoding to copy filtered resources.

[INFO] --- maven-resources-plugin:2.6:resources (default-resources) @ hbase-server ---[INFO]
Copying 21 resources

[INFO] Copying 3 resources
[INFO] 
[INFO] --- maven-compiler-plugin:2.5.1:compile (default-compile) @ hbase-server ---
[INFO] Compiling 632 source files to <http://54.241.6.143/job/HBase-TRUNK-Hadoop-2/ws/hbase-server/target/classes>
[INFO] 
[INFO] [INFO] Wrote classpath file '<http://54.241.6.143/job/HBase-TRUNK-Hadoop-2/ws/hbase-server/target/test-classes/mrapp-generated-classpath'.>
--- maven-dependency-plugin:2.1:build-classpath (create-mrapp-generated-classpath) @ hbase-server
---
[INFO] [INFO] Using 'UTF-8' encoding to copy filtered resources.

[INFO] [INFO] Copying 7 resources
--- maven-resources-plugin:2.6:testResources (default-testResources) @ hbase-server ---
[INFO] Copying 3 resources
[INFO] 
[INFO] --- maven-compiler-plugin:2.5.1:testCompile (default-testCompile) @ hbase-server ---
[INFO] Compiling 494 source files to <http://54.241.6.143/job/HBase-TRUNK-Hadoop-2/ws/hbase-server/target/test-classes>
[INFO] -------------------------------------------------------------
[ERROR] COMPILATION ERROR : 
[INFO] -------------------------------------------------------------
[ERROR] <http://54.241.6.143/job/HBase-TRUNK-Hadoop-2/ws/hbase-server/src/test/java/org/apache/hadoop/hbase/client/TestAdmin.java>:[42,30]
cannot find symbol
symbol  : class DoNotRetryIOException
location: package org.apache.hadoop.hbase
[ERROR] <http://54.241.6.143/job/HBase-TRUNK-Hadoop-2/ws/hbase-server/src/test/java/org/apache/hadoop/hbase/client/TestAdmin.java>:[48,30]
cannot find symbol
symbol  : class HServerAddress
location: package org.apache.hadoop.hbase
[ERROR] <http://54.241.6.143/job/HBase-TRUNK-Hadoop-2/ws/hbase-server/src/test/java/org/apache/hadoop/hbase/client/TestAdmin.java>:[50,30]
cannot find symbol
symbol  : class InvalidFamilyOperationException
location: package org.apache.hadoop.hbase
[ERROR] <http://54.241.6.143/job/HBase-TRUNK-Hadoop-2/ws/hbase-server/src/test/java/org/apache/hadoop/hbase/client/TestAdmin.java>:[53,30]
cannot find symbol
symbol  : class TableExistsException
location: package org.apache.hadoop.hbase
[ERROR] <http://54.241.6.143/job/HBase-TRUNK-Hadoop-2/ws/hbase-server/src/test/java/org/apache/hadoop/hbase/client/TestAdmin.java>:[54,30]
cannot find symbol
symbol  : class TableNotDisabledException
location: package org.apache.hadoop.hbase
[ERROR] <http://54.241.6.143/job/HBase-TRUNK-Hadoop-2/ws/hbase-server/src/test/java/org/apache/hadoop/hbase/client/TestAdmin.java>:[55,30]
cannot find symbol
symbol  : class TableNotEnabledException
location: package org.apache.hadoop.hbase
[ERROR] <http://54.241.6.143/job/HBase-TRUNK-Hadoop-2/ws/hbase-server/src/test/java/org/apache/hadoop/hbase/client/TestAdmin.java>:[56,30]
cannot find symbol
symbol  : class TableNotFoundException
location: package org.apache.hadoop.hbase
[ERROR] <http://54.241.6.143/job/HBase-TRUNK-Hadoop-2/ws/hbase-server/src/test/java/org/apache/hadoop/hbase/client/TestAdmin.java>:[1557,4]
cannot find symbol
symbol  : class MiniHBaseCluster
location: class org.apache.hadoop.hbase.client.TestAdmin
[ERROR] <http://54.241.6.143/job/HBase-TRUNK-Hadoop-2/ws/hbase-server/src/test/java/org/apache/hadoop/hbase/client/TestScannerTimeout.java>:[175,18]
cannot find symbol
symbol  : variable HBASE_REGIONSERVER_LEASE_PERIOD_KEY
location: class org.apache.hadoop.hbase.HConstants
[INFO] 9 errors 
[INFO] -------------------------------------------------------------
[INFO]                                                                         
[INFO] ------------------------------------------------------------------------
[INFO] Skipping HBase
[INFO] This project has been banned from the build due to previous failures.
[INFO] ------------------------------------------------------------------------
[INFO]                                                                         
[INFO] ------------------------------------------------------------------------
[INFO] Skipping HBase
[INFO] This project has been banned from the build due to previous failures.
[INFO] ------------------------------------------------------------------------
[INFO] ------------------------------------------------------------------------
[INFO] Reactor Summary:
[INFO] 
[INFO] HBase ............................................. SUCCESS [9.273s]
[INFO] HBase - Common .................................... SUCCESS [22.753s]
[INFO] HBase - Protocol .................................. SUCCESS [18.034s]
[INFO] HBase - Client .................................... SUCCESS [22.636s]
[INFO] HBase - Prefix Tree ............................... SUCCESS [4.811s]
[INFO] HBase - Hadoop Compatibility ...................... SUCCESS [5.868s]
[INFO] HBase - Hadoop Two Compatibility .................. SUCCESS [3.818s]
[INFO] HBase - Server .................................... FAILURE [11.994s]
[INFO] HBase - Integration Tests ......................... SKIPPED
[INFO] HBase - Examples .................................. SKIPPED
[INFO] HBase - Assembly .................................. SKIPPED
[INFO] ------------------------------------------------------------------------
[INFO] BUILD FAILURE
[INFO] ------------------------------------------------------------------------
[INFO] Total time: 1:41.487s
[INFO] Finished at: Fri Jul 12 17:51:54 UTC 2013
[INFO] Final Memory: 74M/925M
[INFO] ------------------------------------------------------------------------
[JENKINS] Archiving <http://54.241.6.143/job/HBase-TRUNK-Hadoop-2/ws/hbase-hadoop2-compat/pom.xml>
to /var/lib/jenkins/jobs/HBase-TRUNK-Hadoop-2/modules/org.apache.hbase$hbase-hadoop2-compat/builds/2013-07-12_17-50-06/archive/org.apache.hbase/hbase-hadoop2-compat/0.97.0-SNAPSHOT/hbase-hadoop2-compat-0.97.0-SNAPSHOT.pom
[JENKINS] Archiving <http://54.241.6.143/job/HBase-TRUNK-Hadoop-2/ws/hbase-hadoop2-compat/target/hbase-hadoop2-compat-0.97.0-SNAPSHOT.jar>
to /var/lib/jenkins/jobs/HBase-TRUNK-Hadoop-2/modules/org.apache.hbase$hbase-hadoop2-compat/builds/2013-07-12_17-50-06/archive/org.apache.hbase/hbase-hadoop2-compat/0.97.0-SNAPSHOT/hbase-hadoop2-compat-0.97.0-SNAPSHOT.jar
[JENKINS] Archiving <http://54.241.6.143/job/HBase-TRUNK-Hadoop-2/ws/hbase-hadoop2-compat/target/hbase-hadoop2-compat-0.97.0-SNAPSHOT-sources.jar>
to /var/lib/jenkins/jobs/HBase-TRUNK-Hadoop-2/modules/org.apache.hbase$hbase-hadoop2-compat/builds/2013-07-12_17-50-06/archive/org.apache.hbase/hbase-hadoop2-compat/0.97.0-SNAPSHOT/hbase-hadoop2-compat-0.97.0-SNAPSHOT-sources.jar
[JENKINS] Archiving <http://54.241.6.143/job/HBase-TRUNK-Hadoop-2/ws/hbase-hadoop2-compat/target/hbase-hadoop2-compat-0.97.0-SNAPSHOT-tests.jar>
to /var/lib/jenkins/jobs/HBase-TRUNK-Hadoop-2/modules/org.apache.hbase$hbase-hadoop2-compat/builds/2013-07-12_17-50-06/archive/org.apache.hbase/hbase-hadoop2-compat/0.97.0-SNAPSHOT/hbase-hadoop2-compat-0.97.0-SNAPSHOT-tests.jar
[JENKINS] Archiving <http://54.241.6.143/job/HBase-TRUNK-Hadoop-2/ws/hbase-common/pom.xml>
to /var/lib/jenkins/jobs/HBase-TRUNK-Hadoop-2/modules/org.apache.hbase$hbase-common/builds/2013-07-12_17-50-06/archive/org.apache.hbase/hbase-common/0.97.0-SNAPSHOT/hbase-common-0.97.0-SNAPSHOT.pom
[JENKINS] Archiving <http://54.241.6.143/job/HBase-TRUNK-Hadoop-2/ws/hbase-common/target/hbase-common-0.97.0-SNAPSHOT.jar>
to /var/lib/jenkins/jobs/HBase-TRUNK-Hadoop-2/modules/org.apache.hbase$hbase-common/builds/2013-07-12_17-50-06/archive/org.apache.hbase/hbase-common/0.97.0-SNAPSHOT/hbase-common-0.97.0-SNAPSHOT.jar
[JENKINS] Archiving <http://54.241.6.143/job/HBase-TRUNK-Hadoop-2/ws/hbase-common/target/hbase-common-0.97.0-SNAPSHOT-sources.jar>
to /var/lib/jenkins/jobs/HBase-TRUNK-Hadoop-2/modules/org.apache.hbase$hbase-common/builds/2013-07-12_17-50-06/archive/org.apache.hbase/hbase-common/0.97.0-SNAPSHOT/hbase-common-0.97.0-SNAPSHOT-sources.jar
[JENKINS] Archiving <http://54.241.6.143/job/HBase-TRUNK-Hadoop-2/ws/hbase-common/target/hbase-common-0.97.0-SNAPSHOT-tests.jar>
to /var/lib/jenkins/jobs/HBase-TRUNK-Hadoop-2/modules/org.apache.hbase$hbase-common/builds/2013-07-12_17-50-06/archive/org.apache.hbase/hbase-common/0.97.0-SNAPSHOT/hbase-common-0.97.0-SNAPSHOT-tests.jar
[JENKINS] Archiving <http://54.241.6.143/job/HBase-TRUNK-Hadoop-2/ws/hbase-hadoop-compat/pom.xml>
to /var/lib/jenkins/jobs/HBase-TRUNK-Hadoop-2/modules/org.apache.hbase$hbase-hadoop-compat/builds/2013-07-12_17-50-06/archive/org.apache.hbase/hbase-hadoop-compat/0.97.0-SNAPSHOT/hbase-hadoop-compat-0.97.0-SNAPSHOT.pom
[JENKINS] Archiving <http://54.241.6.143/job/HBase-TRUNK-Hadoop-2/ws/hbase-hadoop-compat/target/hbase-hadoop-compat-0.97.0-SNAPSHOT.jar>
to /var/lib/jenkins/jobs/HBase-TRUNK-Hadoop-2/modules/org.apache.hbase$hbase-hadoop-compat/builds/2013-07-12_17-50-06/archive/org.apache.hbase/hbase-hadoop-compat/0.97.0-SNAPSHOT/hbase-hadoop-compat-0.97.0-SNAPSHOT.jar
[JENKINS] Archiving <http://54.241.6.143/job/HBase-TRUNK-Hadoop-2/ws/hbase-hadoop-compat/target/hbase-hadoop-compat-0.97.0-SNAPSHOT-sources.jar>
to /var/lib/jenkins/jobs/HBase-TRUNK-Hadoop-2/modules/org.apache.hbase$hbase-hadoop-compat/builds/2013-07-12_17-50-06/archive/org.apache.hbase/hbase-hadoop-compat/0.97.0-SNAPSHOT/hbase-hadoop-compat-0.97.0-SNAPSHOT-sources.jar
[JENKINS] Archiving <http://54.241.6.143/job/HBase-TRUNK-Hadoop-2/ws/hbase-hadoop-compat/target/hbase-hadoop-compat-0.97.0-SNAPSHOT-tests.jar>
to /var/lib/jenkins/jobs/HBase-TRUNK-Hadoop-2/modules/org.apache.hbase$hbase-hadoop-compat/builds/2013-07-12_17-50-06/archive/org.apache.hbase/hbase-hadoop-compat/0.97.0-SNAPSHOT/hbase-hadoop-compat-0.97.0-SNAPSHOT-tests.jar
[JENKINS] Archiving <http://54.241.6.143/job/HBase-TRUNK-Hadoop-2/ws/hbase-examples/pom.xml>
to /var/lib/jenkins/jobs/HBase-TRUNK-Hadoop-2/modules/org.apache.hbase$hbase-examples/builds/2013-07-12_17-50-06/archive/org.apache.hbase/hbase-examples/0.97.0-SNAPSHOT/hbase-examples-0.97.0-SNAPSHOT.pom
[JENKINS] Archiving <http://54.241.6.143/job/HBase-TRUNK-Hadoop-2/ws/hbase-it/pom.xml>
to /var/lib/jenkins/jobs/HBase-TRUNK-Hadoop-2/modules/org.apache.hbase$hbase-it/builds/2013-07-12_17-50-06/archive/org.apache.hbase/hbase-it/0.97.0-SNAPSHOT/hbase-it-0.97.0-SNAPSHOT.pom
[JENKINS] Archiving <http://54.241.6.143/job/HBase-TRUNK-Hadoop-2/ws/pom.xml> to /var/lib/jenkins/jobs/HBase-TRUNK-Hadoop-2/modules/org.apache.hbase$hbase/builds/2013-07-12_17-50-06/archive/org.apache.hbase/hbase/0.97.0-SNAPSHOT/hbase-0.97.0-SNAPSHOT.pom
[JENKINS] Archiving <http://54.241.6.143/job/HBase-TRUNK-Hadoop-2/ws/target/hbase-0.97.0-SNAPSHOT-site.xml>
to /var/lib/jenkins/jobs/HBase-TRUNK-Hadoop-2/modules/org.apache.hbase$hbase/builds/2013-07-12_17-50-06/archive/org.apache.hbase/hbase/0.97.0-SNAPSHOT/hbase-0.97.0-SNAPSHOT-site.xml
[JENKINS] Archiving <http://54.241.6.143/job/HBase-TRUNK-Hadoop-2/ws/hbase-assembly/pom.xml>
to /var/lib/jenkins/jobs/HBase-TRUNK-Hadoop-2/modules/org.apache.hbase$hbase-assembly/builds/2013-07-12_17-50-06/archive/org.apache.hbase/hbase-assembly/0.97.0-SNAPSHOT/hbase-assembly-0.97.0-SNAPSHOT.pom
[JENKINS] Archiving <http://54.241.6.143/job/HBase-TRUNK-Hadoop-2/ws/hbase-client/pom.xml>
to /var/lib/jenkins/jobs/HBase-TRUNK-Hadoop-2/modules/org.apache.hbase$hbase-client/builds/2013-07-12_17-50-06/archive/org.apache.hbase/hbase-client/0.97.0-SNAPSHOT/hbase-client-0.97.0-SNAPSHOT.pom
[JENKINS] Archiving <http://54.241.6.143/job/HBase-TRUNK-Hadoop-2/ws/hbase-client/target/hbase-client-0.97.0-SNAPSHOT.jar>
to /var/lib/jenkins/jobs/HBase-TRUNK-Hadoop-2/modules/org.apache.hbase$hbase-client/builds/2013-07-12_17-50-06/archive/org.apache.hbase/hbase-client/0.97.0-SNAPSHOT/hbase-client-0.97.0-SNAPSHOT.jar
[JENKINS] Archiving <http://54.241.6.143/job/HBase-TRUNK-Hadoop-2/ws/hbase-client/target/hbase-client-0.97.0-SNAPSHOT-sources.jar>
to /var/lib/jenkins/jobs/HBase-TRUNK-Hadoop-2/modules/org.apache.hbase$hbase-client/builds/2013-07-12_17-50-06/archive/org.apache.hbase/hbase-client/0.97.0-SNAPSHOT/hbase-client-0.97.0-SNAPSHOT-sources.jar
[JENKINS] Archiving <http://54.241.6.143/job/HBase-TRUNK-Hadoop-2/ws/hbase-client/target/hbase-client-0.97.0-SNAPSHOT-tests.jar>
to /var/lib/jenkins/jobs/HBase-TRUNK-Hadoop-2/modules/org.apache.hbase$hbase-client/builds/2013-07-12_17-50-06/archive/org.apache.hbase/hbase-client/0.97.0-SNAPSHOT/hbase-client-0.97.0-SNAPSHOT-tests.jar
[JENKINS] Archiving <http://54.241.6.143/job/HBase-TRUNK-Hadoop-2/ws/hbase-prefix-tree/pom.xml>
to /var/lib/jenkins/jobs/HBase-TRUNK-Hadoop-2/modules/org.apache.hbase$hbase-prefix-tree/builds/2013-07-12_17-50-06/archive/org.apache.hbase/hbase-prefix-tree/0.97.0-SNAPSHOT/hbase-prefix-tree-0.97.0-SNAPSHOT.pom
[JENKINS] Archiving <http://54.241.6.143/job/HBase-TRUNK-Hadoop-2/ws/hbase-prefix-tree/target/hbase-prefix-tree-0.97.0-SNAPSHOT.jar>
to /var/lib/jenkins/jobs/HBase-TRUNK-Hadoop-2/modules/org.apache.hbase$hbase-prefix-tree/builds/2013-07-12_17-50-06/archive/org.apache.hbase/hbase-prefix-tree/0.97.0-SNAPSHOT/hbase-prefix-tree-0.97.0-SNAPSHOT.jar
[JENKINS] Archiving <http://54.241.6.143/job/HBase-TRUNK-Hadoop-2/ws/hbase-prefix-tree/target/hbase-prefix-tree-0.97.0-SNAPSHOT-sources.jar>
to /var/lib/jenkins/jobs/HBase-TRUNK-Hadoop-2/modules/org.apache.hbase$hbase-prefix-tree/builds/2013-07-12_17-50-06/archive/org.apache.hbase/hbase-prefix-tree/0.97.0-SNAPSHOT/hbase-prefix-tree-0.97.0-SNAPSHOT-sources.jar
[JENKINS] Archiving <http://54.241.6.143/job/HBase-TRUNK-Hadoop-2/ws/hbase-prefix-tree/target/hbase-prefix-tree-0.97.0-SNAPSHOT-tests.jar>
to /var/lib/jenkins/jobs/HBase-TRUNK-Hadoop-2/modules/org.apache.hbase$hbase-prefix-tree/builds/2013-07-12_17-50-06/archive/org.apache.hbase/hbase-prefix-tree/0.97.0-SNAPSHOT/hbase-prefix-tree-0.97.0-SNAPSHOT-tests.jar
[JENKINS] Archiving <http://54.241.6.143/job/HBase-TRUNK-Hadoop-2/ws/hbase-protocol/pom.xml>
to /var/lib/jenkins/jobs/HBase-TRUNK-Hadoop-2/modules/org.apache.hbase$hbase-protocol/builds/2013-07-12_17-50-06/archive/org.apache.hbase/hbase-protocol/0.97.0-SNAPSHOT/hbase-protocol-0.97.0-SNAPSHOT.pom
[JENKINS] Archiving <http://54.241.6.143/job/HBase-TRUNK-Hadoop-2/ws/hbase-protocol/target/hbase-protocol-0.97.0-SNAPSHOT.jar>
to /var/lib/jenkins/jobs/HBase-TRUNK-Hadoop-2/modules/org.apache.hbase$hbase-protocol/builds/2013-07-12_17-50-06/archive/org.apache.hbase/hbase-protocol/0.97.0-SNAPSHOT/hbase-protocol-0.97.0-SNAPSHOT.jar
[JENKINS] Archiving <http://54.241.6.143/job/HBase-TRUNK-Hadoop-2/ws/hbase-protocol/target/hbase-protocol-0.97.0-SNAPSHOT-sources.jar>
to /var/lib/jenkins/jobs/HBase-TRUNK-Hadoop-2/modules/org.apache.hbase$hbase-protocol/builds/2013-07-12_17-50-06/archive/org.apache.hbase/hbase-protocol/0.97.0-SNAPSHOT/hbase-protocol-0.97.0-SNAPSHOT-sources.jar
[JENKINS] Archiving <http://54.241.6.143/job/HBase-TRUNK-Hadoop-2/ws/hbase-protocol/target/hbase-protocol-0.97.0-SNAPSHOT-tests.jar>
to /var/lib/jenkins/jobs/HBase-TRUNK-Hadoop-2/modules/org.apache.hbase$hbase-protocol/builds/2013-07-12_17-50-06/archive/org.apache.hbase/hbase-protocol/0.97.0-SNAPSHOT/hbase-protocol-0.97.0-SNAPSHOT-tests.jar
[JENKINS] Archiving <http://54.241.6.143/job/HBase-TRUNK-Hadoop-2/ws/hbase-server/pom.xml>
to /var/lib/jenkins/jobs/HBase-TRUNK-Hadoop-2/modules/org.apache.hbase$hbase-server/builds/2013-07-12_17-50-06/archive/org.apache.hbase/hbase-server/0.97.0-SNAPSHOT/hbase-server-0.97.0-SNAPSHOT.pom
Waiting for Jenkins to finish collecting data
mavenExecutionResult exceptions not empty
message : Failed to execute goal org.apache.maven.plugins:maven-compiler-plugin:2.5.1:testCompile
(default-testCompile) on project hbase-server: Compilation failure
cause : Compilation failure
Stack trace : 
org.apache.maven.lifecycle.LifecycleExecutionException: Failed to execute goal org.apache.maven.plugins:maven-compiler-plugin:2.5.1:testCompile
(default-testCompile) on project hbase-server: Compilation failure
	at org.apache.maven.lifecycle.internal.MojoExecutor.execute(MojoExecutor.java:213)
	at org.apache.maven.lifecycle.internal.MojoExecutor.execute(MojoExecutor.java:153)
	at org.apache.maven.lifecycle.internal.MojoExecutor.execute(MojoExecutor.java:145)
	at org.apache.maven.lifecycle.internal.LifecycleModuleBuilder.buildProject(LifecycleModuleBuilder.java:84)
	at org.apache.maven.lifecycle.internal.LifecycleModuleBuilder.buildProject(LifecycleModuleBuilder.java:59)
	at org.apache.maven.lifecycle.internal.LifecycleStarter.singleThreadedBuild(LifecycleStarter.java:183)
	at org.apache.maven.lifecycle.internal.LifecycleStarter.execute(LifecycleStarter.java:161)
	at org.apache.maven.DefaultMaven.doExecute(DefaultMaven.java:320)
	at org.apache.maven.DefaultMaven.execute(DefaultMaven.java:156)
	at org.jvnet.hudson.maven3.launcher.Maven3Launcher.main(Maven3Launcher.java:79)
	at sun.reflect.NativeMethodAccessorImpl.invoke0(Native Method)
	at sun.reflect.NativeMethodAccessorImpl.invoke(NativeMethodAccessorImpl.java:39)
	at sun.reflect.DelegatingMethodAccessorImpl.invoke(DelegatingMethodAccessorImpl.java:25)
	at java.lang.reflect.Method.invoke(Method.java:597)
	at org.codehaus.plexus.classworlds.launcher.Launcher.launchStandard(Launcher.java:329)
	at org.codehaus.plexus.classworlds.launcher.Launcher.launch(Launcher.java:239)
	at org.jvnet.hudson.maven3.agent.Maven3Main.launch(Maven3Main.java:158)
	at hudson.maven.Maven3Builder.call(Maven3Builder.java:100)
	at hudson.maven.Maven3Builder.call(Maven3Builder.java:66)
	at hudson.remoting.UserRequest.perform(UserRequest.java:118)
	at hudson.remoting.UserRequest.perform(UserRequest.java:48)
	at hudson.remoting.Request$2.run(Request.java:326)
	at hudson.remoting.InterceptingExecutorService$1.call(InterceptingExecutorService.java:72)
	at java.util.concurrent.FutureTask$Sync.innerRun(FutureTask.java:303)
	at java.util.concurrent.FutureTask.run(FutureTask.java:138)
	at java.util.concurrent.ThreadPoolExecutor$Worker.runTask(ThreadPoolExecutor.java:895)
	at java.util.concurrent.ThreadPoolExecutor$Worker.run(ThreadPoolExecutor.java:918)
	at java.lang.Thread.run(Thread.java:662)
Caused by: org.apache.maven.plugin.CompilationFailureException: Compilation failure
	at org.apache.maven.plugin.AbstractCompilerMojo.execute(AbstractCompilerMojo.java:729)
	at org.apache.maven.plugin.TestCompilerMojo.execute(TestCompilerMojo.java:161)
	at org.apache.maven.plugin.DefaultBuildPluginManager.executeMojo(DefaultBuildPluginManager.java:101)
	at org.apache.maven.lifecycle.internal.MojoExecutor.execute(MojoExecutor.java:209)
	... 27 more
channel stopped

Mime
View raw message