hbase-builds mailing list archives

Site index · List index
Message view « Date » · « Thread »
Top « Date » · « Thread »
From Apache Jenkins Server <jenk...@builds.apache.org>
Subject Build failed in Jenkins: hbase-0.95 #281
Date Tue, 02 Jul 2013 21:52:13 GMT
See <https://builds.apache.org/job/hbase-0.95/281/changes>

Changes:

[stack] HBASE-8737 [replication] Change replication RPC to use cell blocks

------------------------------------------
[...truncated 2960 lines...]
[INFO] Installing <https://builds.apache.org/job/hbase-0.95/ws/0.95/hbase-prefix-tree/target/hbase-prefix-tree-0.95.2-SNAPSHOT.jar>
to /home/jenkins/.m2/repository/org/apache/hbase/hbase-prefix-tree/0.95.2-SNAPSHOT/hbase-prefix-tree-0.95.2-SNAPSHOT.jar
[INFO] Installing <https://builds.apache.org/job/hbase-0.95/ws/0.95/hbase-prefix-tree/pom.xml>
to /home/jenkins/.m2/repository/org/apache/hbase/hbase-prefix-tree/0.95.2-SNAPSHOT/hbase-prefix-tree-0.95.2-SNAPSHOT.pom
[INFO] Installing <https://builds.apache.org/job/hbase-0.95/ws/0.95/hbase-prefix-tree/target/hbase-prefix-tree-0.95.2-SNAPSHOT-sources.jar>
to /home/jenkins/.m2/repository/org/apache/hbase/hbase-prefix-tree/0.95.2-SNAPSHOT/hbase-prefix-tree-0.95.2-SNAPSHOT-sources.jar
[INFO] Installing <https://builds.apache.org/job/hbase-0.95/ws/0.95/hbase-prefix-tree/target/hbase-prefix-tree-0.95.2-SNAPSHOT-tests.jar>
to /home/jenkins/.m2/repository/org/apache/hbase/hbase-prefix-tree/0.95.2-SNAPSHOT/hbase-prefix-tree-0.95.2-SNAPSHOT-tests.jar
[INFO]                                                                         
[INFO] ------------------------------------------------------------------------
[INFO] Building HBase - Hadoop Compatibility 0.95.2-SNAPSHOT
[INFO] ------------------------------------------------------------------------
[INFO] 
[INFO] --- maven-remote-resources-plugin:1.4:process (default) @ hbase-hadoop-compat ---
[INFO] 
[INFO] --- maven-resources-plugin:2.6:resources (default-resources) @ hbase-hadoop-compat
---
[INFO] Using 'UTF-8' encoding to copy filtered resources.
[INFO] skip non existing resourceDirectory <https://builds.apache.org/job/hbase-0.95/ws/0.95/hbase-hadoop-compat/src/main/resources>
[INFO] Copying 3 resources
[INFO] 
[INFO] --- maven-compiler-plugin:2.5.1:compile (default-compile) @ hbase-hadoop-compat ---
[INFO] Compiling 24 source files to <https://builds.apache.org/job/hbase-0.95/ws/0.95/hbase-hadoop-compat/target/classes>
[INFO] 
[INFO] --- maven-resources-plugin:2.6:testResources (default-testResources) @ hbase-hadoop-compat
---
[INFO] Using 'UTF-8' encoding to copy filtered resources.
[INFO] Copying 1 resource
[INFO] Copying 3 resources
[INFO] 
[INFO] --- maven-compiler-plugin:2.5.1:testCompile (default-testCompile) @ hbase-hadoop-compat
---
[INFO] Compiling 11 source files to <https://builds.apache.org/job/hbase-0.95/ws/0.95/hbase-hadoop-compat/target/test-classes>
[INFO] 
[INFO] --- maven-surefire-plugin:2.12-TRUNK-HBASE-2:test (default-test) @ hbase-hadoop-compat
---
[INFO] Surefire report directory: <https://builds.apache.org/job/hbase-0.95/ws/0.95/hbase-hadoop-compat/target/surefire-reports>
[INFO] Using configured provider org.apache.maven.surefire.junitcore.JUnitCoreProvider

-------------------------------------------------------
 T E S T S
-------------------------------------------------------
Running org.apache.hadoop.hbase.thrift.TestMetricsThriftServerSourceFactory
Tests run: 1, Failures: 0, Errors: 0, Skipped: 0, Time elapsed: 0.028 sec
Running org.apache.hadoop.hbase.TestCompatibilitySingletonFactory
Tests run: 1, Failures: 0, Errors: 0, Skipped: 0, Time elapsed: 4.651 sec
Running org.apache.hadoop.hbase.rest.TestMetricsRESTSource
Tests run: 1, Failures: 0, Errors: 0, Skipped: 0, Time elapsed: 0.002 sec
Running org.apache.hadoop.hbase.regionserver.wal.TestMetricsHLogSource
Tests run: 1, Failures: 0, Errors: 0, Skipped: 0, Time elapsed: 0.001 sec
Running org.apache.hadoop.hbase.regionserver.TestMetricsRegionServerSourceFactory
Tests run: 1, Failures: 0, Errors: 0, Skipped: 0, Time elapsed: 0.002 sec
Running org.apache.hadoop.hbase.replication.regionserver.TestMetricsReplicationSourceFactory
Tests run: 1, Failures: 0, Errors: 0, Skipped: 0, Time elapsed: 0.001 sec
Running org.apache.hadoop.hbase.master.TestMetricsMasterSourceFactory
Tests run: 1, Failures: 0, Errors: 0, Skipped: 0, Time elapsed: 4.703 sec

Results :

Tests run: 7, Failures: 0, Errors: 0, Skipped: 0

[INFO] 
[INFO] --- maven-surefire-plugin:2.12-TRUNK-HBASE-2:test (secondPartTestsExecution) @ hbase-hadoop-compat
---
[INFO] Tests are skipped.
[INFO] 
[INFO] --- maven-source-plugin:2.2.1:jar-no-fork (attach-sources) @ hbase-hadoop-compat ---
[INFO] Building jar: <https://builds.apache.org/job/hbase-0.95/ws/0.95/hbase-hadoop-compat/target/hbase-hadoop-compat-0.95.2-SNAPSHOT-sources.jar>
[INFO] 
[INFO] --- maven-jar-plugin:2.4:test-jar (default) @ hbase-hadoop-compat ---
[INFO] Building jar: <https://builds.apache.org/job/hbase-0.95/ws/0.95/hbase-hadoop-compat/target/hbase-hadoop-compat-0.95.2-SNAPSHOT-tests.jar>
[INFO] 
[INFO] --- maven-jar-plugin:2.4:jar (default-jar) @ hbase-hadoop-compat ---
[INFO] Building jar: <https://builds.apache.org/job/hbase-0.95/ws/0.95/hbase-hadoop-compat/target/hbase-hadoop-compat-0.95.2-SNAPSHOT.jar>
[INFO] 
[INFO] --- maven-install-plugin:2.3.1:install (default-install) @ hbase-hadoop-compat ---
[INFO] Installing <https://builds.apache.org/job/hbase-0.95/ws/0.95/hbase-hadoop-compat/target/hbase-hadoop-compat-0.95.2-SNAPSHOT.jar>
to /home/jenkins/.m2/repository/org/apache/hbase/hbase-hadoop-compat/0.95.2-SNAPSHOT/hbase-hadoop-compat-0.95.2-SNAPSHOT.jar
[INFO] Installing <https://builds.apache.org/job/hbase-0.95/ws/0.95/hbase-hadoop-compat/pom.xml>
to /home/jenkins/.m2/repository/org/apache/hbase/hbase-hadoop-compat/0.95.2-SNAPSHOT/hbase-hadoop-compat-0.95.2-SNAPSHOT.pom
[INFO] Installing <https://builds.apache.org/job/hbase-0.95/ws/0.95/hbase-hadoop-compat/target/hbase-hadoop-compat-0.95.2-SNAPSHOT-sources.jar>
to /home/jenkins/.m2/repository/org/apache/hbase/hbase-hadoop-compat/0.95.2-SNAPSHOT/hbase-hadoop-compat-0.95.2-SNAPSHOT-sources.jar
[INFO] Installing <https://builds.apache.org/job/hbase-0.95/ws/0.95/hbase-hadoop-compat/target/hbase-hadoop-compat-0.95.2-SNAPSHOT-tests.jar>
to /home/jenkins/.m2/repository/org/apache/hbase/hbase-hadoop-compat/0.95.2-SNAPSHOT/hbase-hadoop-compat-0.95.2-SNAPSHOT-tests.jar
[INFO]                                                                         
[INFO] ------------------------------------------------------------------------
[INFO] Building HBase - Hadoop One Compatibility 0.95.2-SNAPSHOT
[INFO] ------------------------------------------------------------------------
[INFO] 
[INFO] --- maven-remote-resources-plugin:1.4:process (default) @ hbase-hadoop1-compat ---
[INFO] 
[INFO] --- maven-resources-plugin:2.6:resources (default-resources) @ hbase-hadoop1-compat
---
[INFO] Using 'UTF-8' encoding to copy filtered resources.
[INFO] Copying 10 resources
[INFO] Copying 3 resources
[INFO] 
[INFO] --- maven-compiler-plugin:2.5.1:compile (default-compile) @ hbase-hadoop1-compat ---
[INFO] Compiling 24 source files to <https://builds.apache.org/job/hbase-0.95/ws/0.95/hbase-hadoop1-compat/target/classes>
[INFO] 
[INFO] --- maven-resources-plugin:2.6:testResources (default-testResources) @ hbase-hadoop1-compat
---
[INFO] Using 'UTF-8' encoding to copy filtered resources.
[INFO] Copying 2 resources
[INFO] Copying 3 resources
[INFO] 
[INFO] --- maven-compiler-plugin:2.5.1:testCompile (default-testCompile) @ hbase-hadoop1-compat
---
[INFO] Compiling 10 source files to <https://builds.apache.org/job/hbase-0.95/ws/0.95/hbase-hadoop1-compat/target/test-classes>
[INFO] 
[INFO] --- maven-surefire-plugin:2.12-TRUNK-HBASE-2:test (default-test) @ hbase-hadoop1-compat
---
[INFO] Surefire report directory: <https://builds.apache.org/job/hbase-0.95/ws/0.95/hbase-hadoop1-compat/target/surefire-reports>
[INFO] Using configured provider org.apache.maven.surefire.junitcore.JUnitCoreProvider

-------------------------------------------------------
 T E S T S
-------------------------------------------------------
Running org.apache.hadoop.hbase.thrift.TestThriftServerMetricsSourceFactoryImpl
Tests run: 3, Failures: 0, Errors: 0, Skipped: 0, Time elapsed: 0.395 sec
Running org.apache.hadoop.hbase.rest.TestRESTMetricsSourceImpl
Tests run: 1, Failures: 0, Errors: 0, Skipped: 0, Time elapsed: 0.003 sec
Running org.apache.hadoop.hbase.metrics.TestBaseSourceImpl
Tests run: 5, Failures: 0, Errors: 0, Skipped: 0, Time elapsed: 0.002 sec
Running org.apache.hadoop.hbase.regionserver.TestMetricsRegionServerSourceImpl
Tests run: 2, Failures: 0, Errors: 0, Skipped: 0, Time elapsed: 0.017 sec
Running org.apache.hadoop.hbase.regionserver.wal.TestMetricsWALSourceImpl
Tests run: 1, Failures: 0, Errors: 0, Skipped: 0, Time elapsed: 0.002 sec
Running org.apache.hadoop.hbase.regionserver.TestMetricsRegionSourceImpl
Tests run: 2, Failures: 0, Errors: 0, Skipped: 0, Time elapsed: 0.004 sec
Running org.apache.hadoop.hbase.replication.regionserver.TestReplicationMetricsSourceImpl
Tests run: 1, Failures: 0, Errors: 0, Skipped: 0, Time elapsed: 0.002 sec
Running org.apache.hadoop.hbase.master.TestMetricsMasterSourceImpl
Tests run: 1, Failures: 0, Errors: 0, Skipped: 0, Time elapsed: 0.451 sec

Results :

Tests run: 16, Failures: 0, Errors: 0, Skipped: 0

[INFO] 
[INFO] --- maven-surefire-plugin:2.12-TRUNK-HBASE-2:test (secondPartTestsExecution) @ hbase-hadoop1-compat
---
[INFO] Tests are skipped.
[INFO] 
[INFO] --- maven-source-plugin:2.2.1:jar-no-fork (attach-sources) @ hbase-hadoop1-compat ---
[INFO] Building jar: <https://builds.apache.org/job/hbase-0.95/ws/0.95/hbase-hadoop1-compat/target/hbase-hadoop1-compat-0.95.2-SNAPSHOT-sources.jar>
[INFO] 
[INFO] --- maven-jar-plugin:2.4:test-jar (default) @ hbase-hadoop1-compat ---
[INFO] Building jar: <https://builds.apache.org/job/hbase-0.95/ws/0.95/hbase-hadoop1-compat/target/hbase-hadoop1-compat-0.95.2-SNAPSHOT-tests.jar>
[INFO] 
[INFO] --- maven-jar-plugin:2.4:jar (default-jar) @ hbase-hadoop1-compat ---
[INFO] Building jar: <https://builds.apache.org/job/hbase-0.95/ws/0.95/hbase-hadoop1-compat/target/hbase-hadoop1-compat-0.95.2-SNAPSHOT.jar>
[INFO] 
[INFO] --- maven-install-plugin:2.3.1:install (default-install) @ hbase-hadoop1-compat ---
[INFO] Installing <https://builds.apache.org/job/hbase-0.95/ws/0.95/hbase-hadoop1-compat/target/hbase-hadoop1-compat-0.95.2-SNAPSHOT.jar>
to /home/jenkins/.m2/repository/org/apache/hbase/hbase-hadoop1-compat/0.95.2-SNAPSHOT/hbase-hadoop1-compat-0.95.2-SNAPSHOT.jar
[INFO] Installing <https://builds.apache.org/job/hbase-0.95/ws/0.95/hbase-hadoop1-compat/pom.xml>
to /home/jenkins/.m2/repository/org/apache/hbase/hbase-hadoop1-compat/0.95.2-SNAPSHOT/hbase-hadoop1-compat-0.95.2-SNAPSHOT.pom
[INFO] Installing <https://builds.apache.org/job/hbase-0.95/ws/0.95/hbase-hadoop1-compat/target/hbase-hadoop1-compat-0.95.2-SNAPSHOT-sources.jar>
to /home/jenkins/.m2/repository/org/apache/hbase/hbase-hadoop1-compat/0.95.2-SNAPSHOT/hbase-hadoop1-compat-0.95.2-SNAPSHOT-sources.jar
[INFO] Installing <https://builds.apache.org/job/hbase-0.95/ws/0.95/hbase-hadoop1-compat/target/hbase-hadoop1-compat-0.95.2-SNAPSHOT-tests.jar>
to /home/jenkins/.m2/repository/org/apache/hbase/hbase-hadoop1-compat/0.95.2-SNAPSHOT/hbase-hadoop1-compat-0.95.2-SNAPSHOT-tests.jar
[INFO]                                                                         
[INFO] ------------------------------------------------------------------------
[INFO] Building HBase - Server 0.95.2-SNAPSHOT
[INFO] ------------------------------------------------------------------------
[INFO] 
[INFO] --- maven-antrun-plugin:1.6:run (generate) @ hbase-server ---
[INFO] Executing tasks

main:
    [mkdir] Created dir: <https://builds.apache.org/job/hbase-0.95/ws/0.95/hbase-server/target/hbase-webapps>
     [copy] Copying 17 files to <https://builds.apache.org/job/hbase-0.95/ws/0.95/hbase-server/target/hbase-webapps>
13/07/02 21:51:57 INFO mortbay.log: Logging to org.slf4j.impl.Log4jLoggerAdapter(org.mortbay.log)
via org.mortbay.log.Slf4jLog
    [mkdir] Created dir: <https://builds.apache.org/job/hbase-0.95/ws/0.95/hbase-server/target/hbase-webapps/master/WEB-INF>
    [mkdir] Created dir: <https://builds.apache.org/job/hbase-0.95/ws/0.95/hbase-server/target/hbase-webapps/regionserver/WEB-INF>
    [mkdir] Created dir: <https://builds.apache.org/job/hbase-0.95/ws/0.95/hbase-server/target/hbase-webapps/rest/WEB-INF>
    [mkdir] Created dir: <https://builds.apache.org/job/hbase-0.95/ws/0.95/hbase-server/target/hbase-webapps/thrift/WEB-INF>
[INFO] Executed tasks
[INFO] 
[INFO] --- build-helper-maven-plugin:1.5:add-source (jspcSource-packageInfo-Avro-source) @
hbase-server ---
[INFO] Source directory: <https://builds.apache.org/job/hbase-0.95/ws/0.95/hbase-server/target/generated-jamon>
added.
[INFO] Source directory: <https://builds.apache.org/job/hbase-0.95/ws/0.95/hbase-server/target/generated-sources/java>
added.
[INFO] 
[INFO] --- jamon-maven-plugin:2.3.4:translate (default) @ hbase-server ---
[INFO] Translating 8 templates from <https://builds.apache.org/job/hbase-0.95/ws/0.95/hbase-server/src/main/jamon>
to <https://builds.apache.org/job/hbase-0.95/ws/0.95/hbase-server/target/generated-jamon>
[INFO] 
[INFO] --- maven-remote-resources-plugin:1.4:process (default) @ hbase-server ---
[INFO] 
[INFO] --- maven-resources-plugin:2.6:resources (default-resources) @ hbase-server ---
[INFO] Using 'UTF-8' encoding to copy filtered resources.
[INFO] Copying 21 resources
[INFO] Copying 3 resources
[INFO] 
[INFO] --- maven-compiler-plugin:2.5.1:compile (default-compile) @ hbase-server ---
[INFO] Compiling 630 source files to <https://builds.apache.org/job/hbase-0.95/ws/0.95/hbase-server/target/classes>
[INFO] 
[INFO] --- maven-resources-plugin:2.6:testResources (default-testResources) @ hbase-server
---
[INFO] Using 'UTF-8' encoding to copy filtered resources.
[INFO] Copying 7 resources
[INFO] Copying 3 resources
[INFO] 
[INFO] --- maven-compiler-plugin:2.5.1:testCompile (default-testCompile) @ hbase-server ---
[INFO] Compiling 486 source files to <https://builds.apache.org/job/hbase-0.95/ws/0.95/hbase-server/target/test-classes>
[INFO] -------------------------------------------------------------
[ERROR] COMPILATION ERROR : 
[INFO] -------------------------------------------------------------
[ERROR] <https://builds.apache.org/job/hbase-0.95/ws/0.95/hbase-server/src/test/java/org/apache/hadoop/hbase/replication/regionserver/TestReplicationSink.java>:[124,8]
error: method replicateEntries in class ReplicationSink cannot be applied to given types;
[ERROR]   reason: actual and formal argument lists differ in length
<https://builds.apache.org/job/hbase-0.95/ws/0.95/hbase-server/src/test/java/org/apache/hadoop/hbase/replication/regionserver/TestReplicationSink.java>:[140,8]
error: method replicateEntries in class ReplicationSink cannot be applied to given types;
[ERROR]   reason: actual and formal argument lists differ in length
<https://builds.apache.org/job/hbase-0.95/ws/0.95/hbase-server/src/test/java/org/apache/hadoop/hbase/replication/regionserver/TestReplicationSink.java>:[148,8]
error: method replicateEntries in class ReplicationSink cannot be applied to given types;
[ERROR]   reason: actual and formal argument lists differ in length
<https://builds.apache.org/job/hbase-0.95/ws/0.95/hbase-server/src/test/java/org/apache/hadoop/hbase/replication/regionserver/TestReplicationSink.java>:[167,8]
error: method replicateEntries in class ReplicationSink cannot be applied to given types;
[ERROR]   reason: actual and formal argument lists differ in length
<https://builds.apache.org/job/hbase-0.95/ws/0.95/hbase-server/src/test/java/org/apache/hadoop/hbase/replication/regionserver/TestReplicationSink.java>:[185,8]
error: method replicateEntries in class ReplicationSink cannot be applied to given types;
[ERROR]   reason: actual and formal argument lists differ in length
<https://builds.apache.org/job/hbase-0.95/ws/0.95/hbase-server/src/test/java/org/apache/hadoop/hbase/replication/regionserver/TestReplicationSink.java>:[192,8]
error: method replicateEntries in class ReplicationSink cannot be applied to given types;
[ERROR]   reason: actual and formal argument lists differ in length
<https://builds.apache.org/job/hbase-0.95/ws/0.95/hbase-server/src/test/java/org/apache/hadoop/hbase/replication/regionserver/TestReplicationSink.java>:[214,8]
error: method replicateEntries in class ReplicationSink cannot be applied to given types;
[INFO] 7 errors 
[INFO] -------------------------------------------------------------
[INFO] ------------------------------------------------------------------------
[INFO] Reactor Summary:
[INFO] 
[INFO] HBase ............................................. SUCCESS [6.390s]
[INFO] HBase - Common .................................... SUCCESS [21.647s]
[INFO] HBase - Protocol .................................. SUCCESS [8.071s]
[INFO] HBase - Client .................................... SUCCESS [21.175s]
[INFO] HBase - Prefix Tree ............................... SUCCESS [3.153s]
[INFO] HBase - Hadoop Compatibility ...................... SUCCESS [5.283s]
[INFO] HBase - Hadoop One Compatibility .................. SUCCESS [1.837s]
[INFO] HBase - Server .................................... FAILURE [11.066s]
[INFO] HBase - Integration Tests ......................... SKIPPED
[INFO] HBase - Examples .................................. SKIPPED
[INFO] HBase - Assembly .................................. SKIPPED
[INFO] ------------------------------------------------------------------------
[INFO] BUILD FAILURE
[INFO] ------------------------------------------------------------------------
[INFO] Total time: 1:19.399s
[INFO] Finished at: Tue Jul 02 21:52:08 UTC 2013
[INFO] Final Memory: 69M/855M
[INFO] ------------------------------------------------------------------------
[ERROR] Failed to execute goal org.apache.maven.plugins:maven-compiler-plugin:2.5.1:testCompile
(default-testCompile) on project hbase-server: Compilation failure: Compilation failure:
[ERROR] <https://builds.apache.org/job/hbase-0.95/ws/0.95/hbase-server/src/test/java/org/apache/hadoop/hbase/replication/regionserver/TestReplicationSink.java>:[124,8]
error: method replicateEntries in class ReplicationSink cannot be applied to given types;
[ERROR] reason: actual and formal argument lists differ in length
[ERROR] <https://builds.apache.org/job/hbase-0.95/ws/0.95/hbase-server/src/test/java/org/apache/hadoop/hbase/replication/regionserver/TestReplicationSink.java>:[140,8]
error: method replicateEntries in class ReplicationSink cannot be applied to given types;
[ERROR] reason: actual and formal argument lists differ in length
[ERROR] <https://builds.apache.org/job/hbase-0.95/ws/0.95/hbase-server/src/test/java/org/apache/hadoop/hbase/replication/regionserver/TestReplicationSink.java>:[148,8]
error: method replicateEntries in class ReplicationSink cannot be applied to given types;
[ERROR] reason: actual and formal argument lists differ in length
[ERROR] <https://builds.apache.org/job/hbase-0.95/ws/0.95/hbase-server/src/test/java/org/apache/hadoop/hbase/replication/regionserver/TestReplicationSink.java>:[167,8]
error: method replicateEntries in class ReplicationSink cannot be applied to given types;
[ERROR] reason: actual and formal argument lists differ in length
[ERROR] <https://builds.apache.org/job/hbase-0.95/ws/0.95/hbase-server/src/test/java/org/apache/hadoop/hbase/replication/regionserver/TestReplicationSink.java>:[185,8]
error: method replicateEntries in class ReplicationSink cannot be applied to given types;
[ERROR] reason: actual and formal argument lists differ in length
[ERROR] <https://builds.apache.org/job/hbase-0.95/ws/0.95/hbase-server/src/test/java/org/apache/hadoop/hbase/replication/regionserver/TestReplicationSink.java>:[192,8]
error: method replicateEntries in class ReplicationSink cannot be applied to given types;
[ERROR] reason: actual and formal argument lists differ in length
[ERROR] <https://builds.apache.org/job/hbase-0.95/ws/0.95/hbase-server/src/test/java/org/apache/hadoop/hbase/replication/regionserver/TestReplicationSink.java>:[214,8]
error: method replicateEntries in class ReplicationSink cannot be applied to given types;
[ERROR] -> [Help 1]
[ERROR] 
[ERROR] To see the full stack trace of the errors, re-run Maven with the -e switch.
[ERROR] Re-run Maven using the -X switch to enable full debug logging.
[ERROR] 
[ERROR] For more information about the errors and possible solutions, please read the following
articles:
[ERROR] [Help 1] http://cwiki.apache.org/confluence/display/MAVEN/MojoFailureException
[ERROR] 
[ERROR] After correcting the problems, you can resume the build with the command
[ERROR]   mvn <goals> -rf :hbase-server
Build step 'Invoke top-level Maven targets' marked build as failure
Archiving artifacts
Recording test results
Updating HBASE-8737

Mime
View raw message