hbase-builds mailing list archives

Site index · List index
Message view « Date » · « Thread »
Top « Date » · « Thread »
From Apache Jenkins Server <jenk...@builds.apache.org>
Subject Build failed in Jenkins: hbase-0.95-on-hadoop2 #152
Date Fri, 28 Jun 2013 00:00:52 GMT
See <https://builds.apache.org/job/hbase-0.95-on-hadoop2/152/changes>

Changes:

[stack] HBASE-8813 Fix time b/w recoverLease invocations from HBASE 8449

[stack] HBASE-8799 TestAccessController#testBulkLoad has been failing for some time on trunk/0.95; DISABLING FALING TEST FOR NOW

------------------------------------------
[...truncated 24114 lines...]
Running org.apache.hadoop.hbase.fs.TestBlockReorder
Tests run: 3, Failures: 0, Errors: 0, Skipped: 0, Time elapsed: 17.593 sec
Forking command line: /bin/sh -c cd <https://builds.apache.org/job/hbase-0.95-on-hadoop2/ws/0.95-on-hadoop2/hbase-server> && /home/jenkins/tools/java/jdk1.6.0_45-32/jre/bin/java -enableassertions -Xmx1900m -Djava.security.egd=file:/dev/./urandom -Djava.net.preferIPv4Stack=true -jar <https://builds.apache.org/job/hbase-0.95-on-hadoop2/ws/0.95-on-hadoop2/hbase-server/target/surefire/surefirebooter1611570080570898963.jar> <https://builds.apache.org/job/hbase-0.95-on-hadoop2/ws/0.95-on-hadoop2/hbase-server/target/surefire/surefire8172265821937188010tmp> <https://builds.apache.org/job/hbase-0.95-on-hadoop2/ws/0.95-on-hadoop2/hbase-server/target/surefire/surefire_1911628957917947377408tmp>
Running org.apache.hadoop.hbase.coprocessor.TestRegionServerCoprocessorExceptionWithRemove
Tests run: 1, Failures: 0, Errors: 0, Skipped: 0, Time elapsed: 13.178 sec
Forking command line: /bin/sh -c cd <https://builds.apache.org/job/hbase-0.95-on-hadoop2/ws/0.95-on-hadoop2/hbase-server> && /home/jenkins/tools/java/jdk1.6.0_45-32/jre/bin/java -enableassertions -Xmx1900m -Djava.security.egd=file:/dev/./urandom -Djava.net.preferIPv4Stack=true -jar <https://builds.apache.org/job/hbase-0.95-on-hadoop2/ws/0.95-on-hadoop2/hbase-server/target/surefire/surefirebooter7536556671157013296.jar> <https://builds.apache.org/job/hbase-0.95-on-hadoop2/ws/0.95-on-hadoop2/hbase-server/target/surefire/surefire5864552284927718770tmp> <https://builds.apache.org/job/hbase-0.95-on-hadoop2/ws/0.95-on-hadoop2/hbase-server/target/surefire/surefire_1924950615317877700107tmp>
Running org.apache.hadoop.hbase.coprocessor.TestCoprocessorEndpoint
Tests run: 6, Failures: 0, Errors: 0, Skipped: 0, Time elapsed: 10.235 sec
Forking command line: /bin/sh -c cd <https://builds.apache.org/job/hbase-0.95-on-hadoop2/ws/0.95-on-hadoop2/hbase-server> && /home/jenkins/tools/java/jdk1.6.0_45-32/jre/bin/java -enableassertions -Xmx1900m -Djava.security.egd=file:/dev/./urandom -Djava.net.preferIPv4Stack=true -jar <https://builds.apache.org/job/hbase-0.95-on-hadoop2/ws/0.95-on-hadoop2/hbase-server/target/surefire/surefirebooter6522080477121574027.jar> <https://builds.apache.org/job/hbase-0.95-on-hadoop2/ws/0.95-on-hadoop2/hbase-server/target/surefire/surefire3095793231509943770tmp> <https://builds.apache.org/job/hbase-0.95-on-hadoop2/ws/0.95-on-hadoop2/hbase-server/target/surefire/surefire_1937534426409483030760tmp>
Running org.apache.hadoop.hbase.coprocessor.TestWALObserver
Tests run: 3, Failures: 0, Errors: 0, Skipped: 0, Time elapsed: 13.567 sec
Forking command line: /bin/sh -c cd <https://builds.apache.org/job/hbase-0.95-on-hadoop2/ws/0.95-on-hadoop2/hbase-server> && /home/jenkins/tools/java/jdk1.6.0_45-32/jre/bin/java -enableassertions -Xmx1900m -Djava.security.egd=file:/dev/./urandom -Djava.net.preferIPv4Stack=true -jar <https://builds.apache.org/job/hbase-0.95-on-hadoop2/ws/0.95-on-hadoop2/hbase-server/target/surefire/surefirebooter7323533837131961919.jar> <https://builds.apache.org/job/hbase-0.95-on-hadoop2/ws/0.95-on-hadoop2/hbase-server/target/surefire/surefire7444154758404193482tmp> <https://builds.apache.org/job/hbase-0.95-on-hadoop2/ws/0.95-on-hadoop2/hbase-server/target/surefire/surefire_1945745779599206782424tmp>
Running org.apache.hadoop.hbase.coprocessor.TestRegionObserverInterface
Tests run: 7, Failures: 0, Errors: 0, Skipped: 0, Time elapsed: 30.298 sec
Forking command line: /bin/sh -c cd <https://builds.apache.org/job/hbase-0.95-on-hadoop2/ws/0.95-on-hadoop2/hbase-server> && /home/jenkins/tools/java/jdk1.6.0_45-32/jre/bin/java -enableassertions -Xmx1900m -Djava.security.egd=file:/dev/./urandom -Djava.net.preferIPv4Stack=true -jar <https://builds.apache.org/job/hbase-0.95-on-hadoop2/ws/0.95-on-hadoop2/hbase-server/target/surefire/surefirebooter5032118870502769988.jar> <https://builds.apache.org/job/hbase-0.95-on-hadoop2/ws/0.95-on-hadoop2/hbase-server/target/surefire/surefire8609962512643724628tmp> <https://builds.apache.org/job/hbase-0.95-on-hadoop2/ws/0.95-on-hadoop2/hbase-server/target/surefire/surefire_1959134813071280028261tmp>
Running org.apache.hadoop.hbase.coprocessor.TestMasterObserver
Tests run: 5, Failures: 0, Errors: 0, Skipped: 0, Time elapsed: 31.985 sec
Forking command line: /bin/sh -c cd <https://builds.apache.org/job/hbase-0.95-on-hadoop2/ws/0.95-on-hadoop2/hbase-server> && /home/jenkins/tools/java/jdk1.6.0_45-32/jre/bin/java -enableassertions -Xmx1900m -Djava.security.egd=file:/dev/./urandom -Djava.net.preferIPv4Stack=true -jar <https://builds.apache.org/job/hbase-0.95-on-hadoop2/ws/0.95-on-hadoop2/hbase-server/target/surefire/surefirebooter2709826275159580651.jar> <https://builds.apache.org/job/hbase-0.95-on-hadoop2/ws/0.95-on-hadoop2/hbase-server/target/surefire/surefire6809645889757320548tmp> <https://builds.apache.org/job/hbase-0.95-on-hadoop2/ws/0.95-on-hadoop2/hbase-server/target/surefire/surefire_1963379384742378350819tmp>
Running org.apache.hadoop.hbase.coprocessor.TestRegionObserverBypass
Tests run: 2, Failures: 0, Errors: 0, Skipped: 0, Time elapsed: 13.412 sec
Forking command line: /bin/sh -c cd <https://builds.apache.org/job/hbase-0.95-on-hadoop2/ws/0.95-on-hadoop2/hbase-server> && /home/jenkins/tools/java/jdk1.6.0_45-32/jre/bin/java -enableassertions -Xmx1900m -Djava.security.egd=file:/dev/./urandom -Djava.net.preferIPv4Stack=true -jar <https://builds.apache.org/job/hbase-0.95-on-hadoop2/ws/0.95-on-hadoop2/hbase-server/target/surefire/surefirebooter1341268619651111416.jar> <https://builds.apache.org/job/hbase-0.95-on-hadoop2/ws/0.95-on-hadoop2/hbase-server/target/surefire/surefire8532525613007112238tmp> <https://builds.apache.org/job/hbase-0.95-on-hadoop2/ws/0.95-on-hadoop2/hbase-server/target/surefire/surefire_1977138322331591755184tmp>
Running org.apache.hadoop.hbase.TestAcidGuarantees
Tests run: 3, Failures: 0, Errors: 0, Skipped: 0, Time elapsed: 82.948 sec
Forking command line: /bin/sh -c cd <https://builds.apache.org/job/hbase-0.95-on-hadoop2/ws/0.95-on-hadoop2/hbase-server> && /home/jenkins/tools/java/jdk1.6.0_45-32/jre/bin/java -enableassertions -Xmx1900m -Djava.security.egd=file:/dev/./urandom -Djava.net.preferIPv4Stack=true -jar <https://builds.apache.org/job/hbase-0.95-on-hadoop2/ws/0.95-on-hadoop2/hbase-server/target/surefire/surefirebooter4609349425546626770.jar> <https://builds.apache.org/job/hbase-0.95-on-hadoop2/ws/0.95-on-hadoop2/hbase-server/target/surefire/surefire3265180217397789788tmp> <https://builds.apache.org/job/hbase-0.95-on-hadoop2/ws/0.95-on-hadoop2/hbase-server/target/surefire/surefire_1984169020668213379435tmp>
Running org.apache.hadoop.hbase.coprocessor.TestRegionServerCoprocessorExceptionWithAbort
Tests run: 1, Failures: 0, Errors: 0, Skipped: 0, Time elapsed: 11.222 sec
Forking command line: /bin/sh -c cd <https://builds.apache.org/job/hbase-0.95-on-hadoop2/ws/0.95-on-hadoop2/hbase-server> && /home/jenkins/tools/java/jdk1.6.0_45-32/jre/bin/java -enableassertions -Xmx1900m -Djava.security.egd=file:/dev/./urandom -Djava.net.preferIPv4Stack=true -jar <https://builds.apache.org/job/hbase-0.95-on-hadoop2/ws/0.95-on-hadoop2/hbase-server/target/surefire/surefirebooter2376234539196908495.jar> <https://builds.apache.org/job/hbase-0.95-on-hadoop2/ws/0.95-on-hadoop2/hbase-server/target/surefire/surefire6211652085321728460tmp> <https://builds.apache.org/job/hbase-0.95-on-hadoop2/ws/0.95-on-hadoop2/hbase-server/target/surefire/surefire_1996547983094082617395tmp>
Running org.apache.hadoop.hbase.coprocessor.TestMasterCoprocessorExceptionWithAbort
Tests run: 1, Failures: 0, Errors: 0, Skipped: 0, Time elapsed: 22.555 sec
Forking command line: /bin/sh -c cd <https://builds.apache.org/job/hbase-0.95-on-hadoop2/ws/0.95-on-hadoop2/hbase-server> && /home/jenkins/tools/java/jdk1.6.0_45-32/jre/bin/java -enableassertions -Xmx1900m -Djava.security.egd=file:/dev/./urandom -Djava.net.preferIPv4Stack=true -jar <https://builds.apache.org/job/hbase-0.95-on-hadoop2/ws/0.95-on-hadoop2/hbase-server/target/surefire/surefirebooter3889192659664436360.jar> <https://builds.apache.org/job/hbase-0.95-on-hadoop2/ws/0.95-on-hadoop2/hbase-server/target/surefire/surefire3302397369635715627tmp> <https://builds.apache.org/job/hbase-0.95-on-hadoop2/ws/0.95-on-hadoop2/hbase-server/target/surefire/surefire_2003972045010243230783tmp>
Running org.apache.hadoop.hbase.coprocessor.TestMasterCoprocessorExceptionWithRemove
Tests run: 1, Failures: 0, Errors: 0, Skipped: 0, Time elapsed: 11.362 sec
Forking command line: /bin/sh -c cd <https://builds.apache.org/job/hbase-0.95-on-hadoop2/ws/0.95-on-hadoop2/hbase-server> && /home/jenkins/tools/java/jdk1.6.0_45-32/jre/bin/java -enableassertions -Xmx1900m -Djava.security.egd=file:/dev/./urandom -Djava.net.preferIPv4Stack=true -jar <https://builds.apache.org/job/hbase-0.95-on-hadoop2/ws/0.95-on-hadoop2/hbase-server/target/surefire/surefirebooter3017333992148175561.jar> <https://builds.apache.org/job/hbase-0.95-on-hadoop2/ws/0.95-on-hadoop2/hbase-server/target/surefire/surefire2988037139712820872tmp> <https://builds.apache.org/job/hbase-0.95-on-hadoop2/ws/0.95-on-hadoop2/hbase-server/target/surefire/surefire_2019124903961539603692tmp>
Running org.apache.hadoop.hbase.coprocessor.TestRegionObserverScannerOpenHook
Tests run: 1, Failures: 0, Errors: 0, Skipped: 0, Time elapsed: 9.477 sec
Forking command line: /bin/sh -c cd <https://builds.apache.org/job/hbase-0.95-on-hadoop2/ws/0.95-on-hadoop2/hbase-server> && /home/jenkins/tools/java/jdk1.6.0_45-32/jre/bin/java -enableassertions -Xmx1900m -Djava.security.egd=file:/dev/./urandom -Djava.net.preferIPv4Stack=true -jar <https://builds.apache.org/job/hbase-0.95-on-hadoop2/ws/0.95-on-hadoop2/hbase-server/target/surefire/surefirebooter1008388682956414174.jar> <https://builds.apache.org/job/hbase-0.95-on-hadoop2/ws/0.95-on-hadoop2/hbase-server/target/surefire/surefire2250698140574432851tmp> <https://builds.apache.org/job/hbase-0.95-on-hadoop2/ws/0.95-on-hadoop2/hbase-server/target/surefire/surefire_202969426249129643253tmp>
Running org.apache.hadoop.hbase.coprocessor.TestOpenTableInCoprocessor
Tests run: 1, Failures: 0, Errors: 0, Skipped: 0, Time elapsed: 26.05 sec
Forking command line: /bin/sh -c cd <https://builds.apache.org/job/hbase-0.95-on-hadoop2/ws/0.95-on-hadoop2/hbase-server> && /home/jenkins/tools/java/jdk1.6.0_45-32/jre/bin/java -enableassertions -Xmx1900m -Djava.security.egd=file:/dev/./urandom -Djava.net.preferIPv4Stack=true -jar <https://builds.apache.org/job/hbase-0.95-on-hadoop2/ws/0.95-on-hadoop2/hbase-server/target/surefire/surefirebooter2968605570079614811.jar> <https://builds.apache.org/job/hbase-0.95-on-hadoop2/ws/0.95-on-hadoop2/hbase-server/target/surefire/surefire5016901073932924369tmp> <https://builds.apache.org/job/hbase-0.95-on-hadoop2/ws/0.95-on-hadoop2/hbase-server/target/surefire/surefire_2032071197762876103013tmp>
Running org.apache.hadoop.hbase.procedure.TestZKProcedureControllers
Tests run: 4, Failures: 0, Errors: 0, Skipped: 0, Time elapsed: 1.842 sec
Forking command line: /bin/sh -c cd <https://builds.apache.org/job/hbase-0.95-on-hadoop2/ws/0.95-on-hadoop2/hbase-server> && /home/jenkins/tools/java/jdk1.6.0_45-32/jre/bin/java -enableassertions -Xmx1900m -Djava.security.egd=file:/dev/./urandom -Djava.net.preferIPv4Stack=true -jar <https://builds.apache.org/job/hbase-0.95-on-hadoop2/ws/0.95-on-hadoop2/hbase-server/target/surefire/surefirebooter6088953696408720185.jar> <https://builds.apache.org/job/hbase-0.95-on-hadoop2/ws/0.95-on-hadoop2/hbase-server/target/surefire/surefire3096166013662363290tmp> <https://builds.apache.org/job/hbase-0.95-on-hadoop2/ws/0.95-on-hadoop2/hbase-server/target/surefire/surefire_2043744855251124695510tmp>
Running org.apache.hadoop.hbase.procedure.TestZKProcedure
Tests run: 4, Failures: 0, Errors: 0, Skipped: 0, Time elapsed: 1.867 sec
Forking command line: /bin/sh -c cd <https://builds.apache.org/job/hbase-0.95-on-hadoop2/ws/0.95-on-hadoop2/hbase-server> && /home/jenkins/tools/java/jdk1.6.0_45-32/jre/bin/java -enableassertions -Xmx1900m -Djava.security.egd=file:/dev/./urandom -Djava.net.preferIPv4Stack=true -jar <https://builds.apache.org/job/hbase-0.95-on-hadoop2/ws/0.95-on-hadoop2/hbase-server/target/surefire/surefirebooter7644014328091631856.jar> <https://builds.apache.org/job/hbase-0.95-on-hadoop2/ws/0.95-on-hadoop2/hbase-server/target/surefire/surefire6759058078652290407tmp> <https://builds.apache.org/job/hbase-0.95-on-hadoop2/ws/0.95-on-hadoop2/hbase-server/target/surefire/surefire_205954872138336653232tmp>
Running org.apache.hadoop.hbase.coprocessor.TestClassLoading
Tests run: 8, Failures: 0, Errors: 0, Skipped: 0, Time elapsed: 27.9 sec
Forking command line: /bin/sh -c cd <https://builds.apache.org/job/hbase-0.95-on-hadoop2/ws/0.95-on-hadoop2/hbase-server> && /home/jenkins/tools/java/jdk1.6.0_45-32/jre/bin/java -enableassertions -Xmx1900m -Djava.security.egd=file:/dev/./urandom -Djava.net.preferIPv4Stack=true -jar <https://builds.apache.org/job/hbase-0.95-on-hadoop2/ws/0.95-on-hadoop2/hbase-server/target/surefire/surefirebooter229619910978406544.jar> <https://builds.apache.org/job/hbase-0.95-on-hadoop2/ws/0.95-on-hadoop2/hbase-server/target/surefire/surefire5726560525371106210tmp> <https://builds.apache.org/job/hbase-0.95-on-hadoop2/ws/0.95-on-hadoop2/hbase-server/target/surefire/surefire_206900151435709794319tmp>
Running org.apache.hadoop.hbase.coprocessor.TestRowProcessorEndpoint
Tests run: 4, Failures: 0, Errors: 0, Skipped: 0, Time elapsed: 23.024 sec
Forking command line: /bin/sh -c cd <https://builds.apache.org/job/hbase-0.95-on-hadoop2/ws/0.95-on-hadoop2/hbase-server> && /home/jenkins/tools/java/jdk1.6.0_45-32/jre/bin/java -enableassertions -Xmx1900m -Djava.security.egd=file:/dev/./urandom -Djava.net.preferIPv4Stack=true -jar <https://builds.apache.org/job/hbase-0.95-on-hadoop2/ws/0.95-on-hadoop2/hbase-server/target/surefire/surefirebooter4784005092895129001.jar> <https://builds.apache.org/job/hbase-0.95-on-hadoop2/ws/0.95-on-hadoop2/hbase-server/target/surefire/surefire7551627792881164319tmp> <https://builds.apache.org/job/hbase-0.95-on-hadoop2/ws/0.95-on-hadoop2/hbase-server/target/surefire/surefire_2078831250975018959108tmp>
Running org.apache.hadoop.hbase.snapshot.TestSnapshotDescriptionUtils
Tests run: 2, Failures: 0, Errors: 0, Skipped: 0, Time elapsed: 0.987 sec
Forking command line: /bin/sh -c cd <https://builds.apache.org/job/hbase-0.95-on-hadoop2/ws/0.95-on-hadoop2/hbase-server> && /home/jenkins/tools/java/jdk1.6.0_45-32/jre/bin/java -enableassertions -Xmx1900m -Djava.security.egd=file:/dev/./urandom -Djava.net.preferIPv4Stack=true -jar <https://builds.apache.org/job/hbase-0.95-on-hadoop2/ws/0.95-on-hadoop2/hbase-server/target/surefire/surefirebooter5312386015522900048.jar> <https://builds.apache.org/job/hbase-0.95-on-hadoop2/ws/0.95-on-hadoop2/hbase-server/target/surefire/surefire5013691193196907191tmp> <https://builds.apache.org/job/hbase-0.95-on-hadoop2/ws/0.95-on-hadoop2/hbase-server/target/surefire/surefire_20861801626169248742tmp>
Running org.apache.hadoop.hbase.constraint.TestConstraint
Tests run: 5, Failures: 0, Errors: 0, Skipped: 0, Time elapsed: 22.897 sec
Forking command line: /bin/sh -c cd <https://builds.apache.org/job/hbase-0.95-on-hadoop2/ws/0.95-on-hadoop2/hbase-server> && /home/jenkins/tools/java/jdk1.6.0_45-32/jre/bin/java -enableassertions -Xmx1900m -Djava.security.egd=file:/dev/./urandom -Djava.net.preferIPv4Stack=true -jar <https://builds.apache.org/job/hbase-0.95-on-hadoop2/ws/0.95-on-hadoop2/hbase-server/target/surefire/surefirebooter2321033710033074003.jar> <https://builds.apache.org/job/hbase-0.95-on-hadoop2/ws/0.95-on-hadoop2/hbase-server/target/surefire/surefire9048620876779994987tmp> <https://builds.apache.org/job/hbase-0.95-on-hadoop2/ws/0.95-on-hadoop2/hbase-server/target/surefire/surefire_2093941905681628553666tmp>
Running org.apache.hadoop.hbase.snapshot.TestExportSnapshot
Tests run: 4, Failures: 0, Errors: 0, Skipped: 0, Time elapsed: 22.18 sec
Forking command line: /bin/sh -c cd <https://builds.apache.org/job/hbase-0.95-on-hadoop2/ws/0.95-on-hadoop2/hbase-server> && /home/jenkins/tools/java/jdk1.6.0_45-32/jre/bin/java -enableassertions -Xmx1900m -Djava.security.egd=file:/dev/./urandom -Djava.net.preferIPv4Stack=true -jar <https://builds.apache.org/job/hbase-0.95-on-hadoop2/ws/0.95-on-hadoop2/hbase-server/target/surefire/surefirebooter5345632407842360398.jar> <https://builds.apache.org/job/hbase-0.95-on-hadoop2/ws/0.95-on-hadoop2/hbase-server/target/surefire/surefire2523681999805777293tmp> <https://builds.apache.org/job/hbase-0.95-on-hadoop2/ws/0.95-on-hadoop2/hbase-server/target/surefire/surefire_2102696254293048517711tmp>
Running org.apache.hadoop.hbase.snapshot.TestFlushSnapshotFromClient
Tests run: 5, Failures: 0, Errors: 0, Skipped: 0, Time elapsed: 35.391 sec
Forking command line: /bin/sh -c cd <https://builds.apache.org/job/hbase-0.95-on-hadoop2/ws/0.95-on-hadoop2/hbase-server> && /home/jenkins/tools/java/jdk1.6.0_45-32/jre/bin/java -enableassertions -Xmx1900m -Djava.security.egd=file:/dev/./urandom -Djava.net.preferIPv4Stack=true -jar <https://builds.apache.org/job/hbase-0.95-on-hadoop2/ws/0.95-on-hadoop2/hbase-server/target/surefire/surefirebooter2283667373590096950.jar> <https://builds.apache.org/job/hbase-0.95-on-hadoop2/ws/0.95-on-hadoop2/hbase-server/target/surefire/surefire3752169573745659726tmp> <https://builds.apache.org/job/hbase-0.95-on-hadoop2/ws/0.95-on-hadoop2/hbase-server/target/surefire/surefire_2116969213052564248046tmp>
Running org.apache.hadoop.hbase.mapred.TestTableInputFormat
Tests run: 10, Failures: 0, Errors: 0, Skipped: 0, Time elapsed: 18.879 sec
Forking command line: /bin/sh -c cd <https://builds.apache.org/job/hbase-0.95-on-hadoop2/ws/0.95-on-hadoop2/hbase-server> && /home/jenkins/tools/java/jdk1.6.0_45-32/jre/bin/java -enableassertions -Xmx1900m -Djava.security.egd=file:/dev/./urandom -Djava.net.preferIPv4Stack=true -jar <https://builds.apache.org/job/hbase-0.95-on-hadoop2/ws/0.95-on-hadoop2/hbase-server/target/surefire/surefirebooter2198636042798030798.jar> <https://builds.apache.org/job/hbase-0.95-on-hadoop2/ws/0.95-on-hadoop2/hbase-server/target/surefire/surefire1163617774197435105tmp> <https://builds.apache.org/job/hbase-0.95-on-hadoop2/ws/0.95-on-hadoop2/hbase-server/target/surefire/surefire_2125080862176805358083tmp>
Running org.apache.hadoop.hbase.master.TestOpenedRegionHandler
Tests run: 2, Failures: 0, Errors: 0, Skipped: 0, Time elapsed: 11.935 sec
Forking command line: /bin/sh -c cd <https://builds.apache.org/job/hbase-0.95-on-hadoop2/ws/0.95-on-hadoop2/hbase-server> && /home/jenkins/tools/java/jdk1.6.0_45-32/jre/bin/java -enableassertions -Xmx1900m -Djava.security.egd=file:/dev/./urandom -Djava.net.preferIPv4Stack=true -jar <https://builds.apache.org/job/hbase-0.95-on-hadoop2/ws/0.95-on-hadoop2/hbase-server/target/surefire/surefirebooter3327053251894673493.jar> <https://builds.apache.org/job/hbase-0.95-on-hadoop2/ws/0.95-on-hadoop2/hbase-server/target/surefire/surefire5474679982450796425tmp> <https://builds.apache.org/job/hbase-0.95-on-hadoop2/ws/0.95-on-hadoop2/hbase-server/target/surefire/surefire_2136067393162107746622tmp>
Running org.apache.hadoop.hbase.master.TestActiveMasterManager
Tests run: 2, Failures: 0, Errors: 0, Skipped: 0, Time elapsed: 1.798 sec
Forking command line: /bin/sh -c cd <https://builds.apache.org/job/hbase-0.95-on-hadoop2/ws/0.95-on-hadoop2/hbase-server> && /home/jenkins/tools/java/jdk1.6.0_45-32/jre/bin/java -enableassertions -Xmx1900m -Djava.security.egd=file:/dev/./urandom -Djava.net.preferIPv4Stack=true -jar <https://builds.apache.org/job/hbase-0.95-on-hadoop2/ws/0.95-on-hadoop2/hbase-server/target/surefire/surefirebooter8356510426222147276.jar> <https://builds.apache.org/job/hbase-0.95-on-hadoop2/ws/0.95-on-hadoop2/hbase-server/target/surefire/surefire3324107620530456563tmp> <https://builds.apache.org/job/hbase-0.95-on-hadoop2/ws/0.95-on-hadoop2/hbase-server/target/surefire/surefire_2146176518652454600496tmp>
Running org.apache.hadoop.hbase.snapshot.TestRestoreFlushSnapshotFromClient
Tests run: 5, Failures: 0, Errors: 0, Skipped: 0, Time elapsed: 54.375 sec
Forking command line: /bin/sh -c cd <https://builds.apache.org/job/hbase-0.95-on-hadoop2/ws/0.95-on-hadoop2/hbase-server> && /home/jenkins/tools/java/jdk1.6.0_45-32/jre/bin/java -enableassertions -Xmx1900m -Djava.security.egd=file:/dev/./urandom -Djava.net.preferIPv4Stack=true -jar <https://builds.apache.org/job/hbase-0.95-on-hadoop2/ws/0.95-on-hadoop2/hbase-server/target/surefire/surefirebooter6772239905323836104.jar> <https://builds.apache.org/job/hbase-0.95-on-hadoop2/ws/0.95-on-hadoop2/hbase-server/target/surefire/surefire8649656865584108688tmp> <https://builds.apache.org/job/hbase-0.95-on-hadoop2/ws/0.95-on-hadoop2/hbase-server/target/surefire/surefire_2151402163411392857273tmp>
Running org.apache.hadoop.hbase.master.TestAssignmentManager
Tests run: 15, Failures: 0, Errors: 0, Skipped: 0, Time elapsed: 4.946 sec
Forking command line: /bin/sh -c cd <https://builds.apache.org/job/hbase-0.95-on-hadoop2/ws/0.95-on-hadoop2/hbase-server> && /home/jenkins/tools/java/jdk1.6.0_45-32/jre/bin/java -enableassertions -Xmx1900m -Djava.security.egd=file:/dev/./urandom -Djava.net.preferIPv4Stack=true -jar <https://builds.apache.org/job/hbase-0.95-on-hadoop2/ws/0.95-on-hadoop2/hbase-server/target/surefire/surefirebooter839731510305488113.jar> <https://builds.apache.org/job/hbase-0.95-on-hadoop2/ws/0.95-on-hadoop2/hbase-server/target/surefire/surefire1168703285491372344tmp> <https://builds.apache.org/job/hbase-0.95-on-hadoop2/ws/0.95-on-hadoop2/hbase-server/target/surefire/surefire_2162541218838077292728tmp>
Running org.apache.hadoop.hbase.mapred.TestTableMapReduce
Tests run: 1, Failures: 0, Errors: 0, Skipped: 0, Time elapsed: 51.444 sec
Forking command line: /bin/sh -c cd <https://builds.apache.org/job/hbase-0.95-on-hadoop2/ws/0.95-on-hadoop2/hbase-server> && /home/jenkins/tools/java/jdk1.6.0_45-32/jre/bin/java -enableassertions -Xmx1900m -Djava.security.egd=file:/dev/./urandom -Djava.net.preferIPv4Stack=true -jar <https://builds.apache.org/job/hbase-0.95-on-hadoop2/ws/0.95-on-hadoop2/hbase-server/target/surefire/surefirebooter6881477164945558238.jar> <https://builds.apache.org/job/hbase-0.95-on-hadoop2/ws/0.95-on-hadoop2/hbase-server/target/surefire/surefire1573021326564416813tmp> <https://builds.apache.org/job/hbase-0.95-on-hadoop2/ws/0.95-on-hadoop2/hbase-server/target/surefire/surefire_2175621275600079483576tmp>
Running org.apache.hadoop.hbase.master.TestMasterRestartAfterDisablingTable
Tests run: 1, Failures: 0, Errors: 0, Skipped: 0, Time elapsed: 12.723 sec
Forking command line: /bin/sh -c cd <https://builds.apache.org/job/hbase-0.95-on-hadoop2/ws/0.95-on-hadoop2/hbase-server> && /home/jenkins/tools/java/jdk1.6.0_45-32/jre/bin/java -enableassertions -Xmx1900m -Djava.security.egd=file:/dev/./urandom -Djava.net.preferIPv4Stack=true -jar <https://builds.apache.org/job/hbase-0.95-on-hadoop2/ws/0.95-on-hadoop2/hbase-server/target/surefire/surefirebooter1680719419139974036.jar> <https://builds.apache.org/job/hbase-0.95-on-hadoop2/ws/0.95-on-hadoop2/hbase-server/target/surefire/surefire6270209618033093449tmp> <https://builds.apache.org/job/hbase-0.95-on-hadoop2/ws/0.95-on-hadoop2/hbase-server/target/surefire/surefire_2184794863383848008153tmp>
Running org.apache.hadoop.hbase.master.TestMasterFailoverBalancerPersistence
Tests run: 1, Failures: 0, Errors: 0, Skipped: 0, Time elapsed: 12.289 sec
Forking command line: /bin/sh -c cd <https://builds.apache.org/job/hbase-0.95-on-hadoop2/ws/0.95-on-hadoop2/hbase-server> && /home/jenkins/tools/java/jdk1.6.0_45-32/jre/bin/java -enableassertions -Xmx1900m -Djava.security.egd=file:/dev/./urandom -Djava.net.preferIPv4Stack=true -jar <https://builds.apache.org/job/hbase-0.95-on-hadoop2/ws/0.95-on-hadoop2/hbase-server/target/surefire/surefirebooter1101838520506618920.jar> <https://builds.apache.org/job/hbase-0.95-on-hadoop2/ws/0.95-on-hadoop2/hbase-server/target/surefire/surefire8069787713236731454tmp> <https://builds.apache.org/job/hbase-0.95-on-hadoop2/ws/0.95-on-hadoop2/hbase-server/target/surefire/surefire_2195214249220910939452tmp>
Running org.apache.hadoop.hbase.master.TestMasterTransitions
Tests run: 3, Failures: 0, Errors: 0, Skipped: 3, Time elapsed: 11.894 sec
Forking command line: /bin/sh -c cd <https://builds.apache.org/job/hbase-0.95-on-hadoop2/ws/0.95-on-hadoop2/hbase-server> && /home/jenkins/tools/java/jdk1.6.0_45-32/jre/bin/java -enableassertions -Xmx1900m -Djava.security.egd=file:/dev/./urandom -Djava.net.preferIPv4Stack=true -jar <https://builds.apache.org/job/hbase-0.95-on-hadoop2/ws/0.95-on-hadoop2/hbase-server/target/surefire/surefirebooter1055660529716328952.jar> <https://builds.apache.org/job/hbase-0.95-on-hadoop2/ws/0.95-on-hadoop2/hbase-server/target/surefire/surefire4742999559836320604tmp> <https://builds.apache.org/job/hbase-0.95-on-hadoop2/ws/0.95-on-hadoop2/hbase-server/target/surefire/surefire_2204512686874893323992tmp>
Running org.apache.hadoop.hbase.master.TestMasterFailover
Tests run: 4, Failures: 0, Errors: 0, Skipped: 0, Time elapsed: 34.882 sec
Forking command line: /bin/sh -c cd <https://builds.apache.org/job/hbase-0.95-on-hadoop2/ws/0.95-on-hadoop2/hbase-server> && /home/jenkins/tools/java/jdk1.6.0_45-32/jre/bin/java -enableassertions -Xmx1900m -Djava.security.egd=file:/dev/./urandom -Djava.net.preferIPv4Stack=true -jar <https://builds.apache.org/job/hbase-0.95-on-hadoop2/ws/0.95-on-hadoop2/hbase-server/target/surefire/surefirebooter5385743886156093625.jar> <https://builds.apache.org/job/hbase-0.95-on-hadoop2/ws/0.95-on-hadoop2/hbase-server/target/surefire/surefire2772398011024261011tmp> <https://builds.apache.org/job/hbase-0.95-on-hadoop2/ws/0.95-on-hadoop2/hbase-server/target/surefire/surefire_2211781806743435156434tmp>
Running org.apache.hadoop.hbase.master.TestRollingRestart
Tests run: 1, Failures: 0, Errors: 0, Skipped: 0, Time elapsed: 31.474 sec
Forking command line: /bin/sh -c cd <https://builds.apache.org/job/hbase-0.95-on-hadoop2/ws/0.95-on-hadoop2/hbase-server> && /home/jenkins/tools/java/jdk1.6.0_45-32/jre/bin/java -enableassertions -Xmx1900m -Djava.security.egd=file:/dev/./urandom -Djava.net.preferIPv4Stack=true -jar <https://builds.apache.org/job/hbase-0.95-on-hadoop2/ws/0.95-on-hadoop2/hbase-server/target/surefire/surefirebooter7873724840963603143.jar> <https://builds.apache.org/job/hbase-0.95-on-hadoop2/ws/0.95-on-hadoop2/hbase-server/target/surefire/surefire7243940118023177077tmp> <https://builds.apache.org/job/hbase-0.95-on-hadoop2/ws/0.95-on-hadoop2/hbase-server/target/surefire/surefire_222150312790926653492tmp>
Running org.apache.hadoop.hbase.master.TestMasterStatusServlet
Tests run: 4, Failures: 0, Errors: 0, Skipped: 0, Time elapsed: 1.45 sec
Forking command line: /bin/sh -c cd <https://builds.apache.org/job/hbase-0.95-on-hadoop2/ws/0.95-on-hadoop2/hbase-server> && /home/jenkins/tools/java/jdk1.6.0_45-32/jre/bin/java -enableassertions -Xmx1900m -Djava.security.egd=file:/dev/./urandom -Djava.net.preferIPv4Stack=true -jar <https://builds.apache.org/job/hbase-0.95-on-hadoop2/ws/0.95-on-hadoop2/hbase-server/target/surefire/surefirebooter7123856511904571473.jar> <https://builds.apache.org/job/hbase-0.95-on-hadoop2/ws/0.95-on-hadoop2/hbase-server/target/surefire/surefire7508757802335310185tmp> <https://builds.apache.org/job/hbase-0.95-on-hadoop2/ws/0.95-on-hadoop2/hbase-server/target/surefire/surefire_2236157550923452720025tmp>
Running org.apache.hadoop.hbase.master.TestHMasterRPCException
Tests run: 1, Failures: 0, Errors: 0, Skipped: 0, Time elapsed: 2.131 sec
Forking command line: /bin/sh -c cd <https://builds.apache.org/job/hbase-0.95-on-hadoop2/ws/0.95-on-hadoop2/hbase-server> && /home/jenkins/tools/java/jdk1.6.0_45-32/jre/bin/java -enableassertions -Xmx1900m -Djava.security.egd=file:/dev/./urandom -Djava.net.preferIPv4Stack=true -jar <https://builds.apache.org/job/hbase-0.95-on-hadoop2/ws/0.95-on-hadoop2/hbase-server/target/surefire/surefirebooter5453658655985522747.jar> <https://builds.apache.org/job/hbase-0.95-on-hadoop2/ws/0.95-on-hadoop2/hbase-server/target/surefire/surefire3230825440223704986tmp> <https://builds.apache.org/job/hbase-0.95-on-hadoop2/ws/0.95-on-hadoop2/hbase-server/target/surefire/surefire_2245490834967773208057tmp>
Running org.apache.hadoop.hbase.master.TestRestartCluster
Tests run: 2, Failures: 0, Errors: 0, Skipped: 0, Time elapsed: 22.913 sec
Forking command line: /bin/sh -c cd <https://builds.apache.org/job/hbase-0.95-on-hadoop2/ws/0.95-on-hadoop2/hbase-server> && /home/jenkins/tools/java/jdk1.6.0_45-32/jre/bin/java -enableassertions -Xmx1900m -Djava.security.egd=file:/dev/./urandom -Djava.net.preferIPv4Stack=true -jar <https://builds.apache.org/job/hbase-0.95-on-hadoop2/ws/0.95-on-hadoop2/hbase-server/target/surefire/surefirebooter3298329276612795736.jar> <https://builds.apache.org/job/hbase-0.95-on-hadoop2/ws/0.95-on-hadoop2/hbase-server/target/surefire/surefire3892278052207233617tmp> <https://builds.apache.org/job/hbase-0.95-on-hadoop2/ws/0.95-on-hadoop2/hbase-server/target/surefire/surefire_2253641852988241273162tmp>
Running org.apache.hadoop.hbase.master.TestMasterMetrics
Tests run: 2, Failures: 0, Errors: 0, Skipped: 0, Time elapsed: 20.926 sec
Forking command line: /bin/sh -c cd <https://builds.apache.org/job/hbase-0.95-on-hadoop2/ws/0.95-on-hadoop2/hbase-server> && /home/jenkins/tools/java/jdk1.6.0_45-32/jre/bin/java -enableassertions -Xmx1900m -Djava.security.egd=file:/dev/./urandom -Djava.net.preferIPv4Stack=true -jar <https://builds.apache.org/job/hbase-0.95-on-hadoop2/ws/0.95-on-hadoop2/hbase-server/target/surefire/surefirebooter2609678869674431415.jar> <https://builds.apache.org/job/hbase-0.95-on-hadoop2/ws/0.95-on-hadoop2/hbase-server/target/surefire/surefire4761234189732518751tmp> <https://builds.apache.org/job/hbase-0.95-on-hadoop2/ws/0.95-on-hadoop2/hbase-server/target/surefire/surefire_226778048352847677477tmp>
Running org.apache.hadoop.hbase.master.TestRegionPlacement
Tests run: 3, Failures: 0, Errors: 0, Skipped: 0, Time elapsed: 10.339 sec
Forking command line: /bin/sh -c cd <https://builds.apache.org/job/hbase-0.95-on-hadoop2/ws/0.95-on-hadoop2/hbase-server> && /home/jenkins/tools/java/jdk1.6.0_45-32/jre/bin/java -enableassertions -Xmx1900m -Djava.security.egd=file:/dev/./urandom -Djava.net.preferIPv4Stack=true -jar <https://builds.apache.org/job/hbase-0.95-on-hadoop2/ws/0.95-on-hadoop2/hbase-server/target/surefire/surefirebooter9057875247056825592.jar> <https://builds.apache.org/job/hbase-0.95-on-hadoop2/ws/0.95-on-hadoop2/hbase-server/target/surefire/surefire2374997422734431310tmp> <https://builds.apache.org/job/hbase-0.95-on-hadoop2/ws/0.95-on-hadoop2/hbase-server/target/surefire/surefire_2275942443443599830184tmp>
Running org.apache.hadoop.hbase.master.balancer.TestBaseLoadBalancer
Tests run: 3, Failures: 0, Errors: 0, Skipped: 0, Time elapsed: 0.567 sec
Forking command line: /bin/sh -c cd <https://builds.apache.org/job/hbase-0.95-on-hadoop2/ws/0.95-on-hadoop2/hbase-server> && /home/jenkins/tools/java/jdk1.6.0_45-32/jre/bin/java -enableassertions -Xmx1900m -Djava.security.egd=file:/dev/./urandom -Djava.net.preferIPv4Stack=true -jar <https://builds.apache.org/job/hbase-0.95-on-hadoop2/ws/0.95-on-hadoop2/hbase-server/target/surefire/surefirebooter4705770328281651645.jar> <https://builds.apache.org/job/hbase-0.95-on-hadoop2/ws/0.95-on-hadoop2/hbase-server/target/surefire/surefire7798987824185779014tmp> <https://builds.apache.org/job/hbase-0.95-on-hadoop2/ws/0.95-on-hadoop2/hbase-server/target/surefire/surefire_2284116256426129651506tmp>
Running org.apache.hadoop.hbase.master.TestAssignmentManagerOnCluster
Tests run: 9, Failures: 0, Errors: 0, Skipped: 0, Time elapsed: 37.106 sec
Forking command line: /bin/sh -c cd <https://builds.apache.org/job/hbase-0.95-on-hadoop2/ws/0.95-on-hadoop2/hbase-server> && /home/jenkins/tools/java/jdk1.6.0_45-32/jre/bin/java -enableassertions -Xmx1900m -Djava.security.egd=file:/dev/./urandom -Djava.net.preferIPv4Stack=true -jar <https://builds.apache.org/job/hbase-0.95-on-hadoop2/ws/0.95-on-hadoop2/hbase-server/target/surefire/surefirebooter3041233265681238322.jar> <https://builds.apache.org/job/hbase-0.95-on-hadoop2/ws/0.95-on-hadoop2/hbase-server/target/surefire/surefire542500104706169062tmp> <https://builds.apache.org/job/hbase-0.95-on-hadoop2/ws/0.95-on-hadoop2/hbase-server/target/surefire/surefire_2296204229096291169759tmp>
Running org.apache.hadoop.hbase.master.balancer.TestDefaultLoadBalancer
Tests run: 1, Failures: 0, Errors: 0, Skipped: 0, Time elapsed: 1.601 sec
Forking command line: /bin/sh -c cd <https://builds.apache.org/job/hbase-0.95-on-hadoop2/ws/0.95-on-hadoop2/hbase-server> && /home/jenkins/tools/java/jdk1.6.0_45-32/jre/bin/java -enableassertions -Xmx1900m -Djava.security.egd=file:/dev/./urandom -Djava.net.preferIPv4Stack=true -jar <https://builds.apache.org/job/hbase-0.95-on-hadoop2/ws/0.95-on-hadoop2/hbase-server/target/surefire/surefirebooter6105092053762695899.jar> <https://builds.apache.org/job/hbase-0.95-on-hadoop2/ws/0.95-on-hadoop2/hbase-server/target/surefire/surefire5756545348745502879tmp> <https://builds.apache.org/job/hbase-0.95-on-hadoop2/ws/0.95-on-hadoop2/hbase-server/target/surefire/surefire_2308773494987076851031tmp>
Running org.apache.hadoop.hbase.master.TestMaster
Tests run: 4, Failures: 0, Errors: 0, Skipped: 0, Time elapsed: 17.346 sec
Forking command line: /bin/sh -c cd <https://builds.apache.org/job/hbase-0.95-on-hadoop2/ws/0.95-on-hadoop2/hbase-server> && /home/jenkins/tools/java/jdk1.6.0_45-32/jre/bin/java -enableassertions -Xmx1900m -Djava.security.egd=file:/dev/./urandom -Djava.net.preferIPv4Stack=true -jar <https://builds.apache.org/job/hbase-0.95-on-hadoop2/ws/0.95-on-hadoop2/hbase-server/target/surefire/surefirebooter3828302312508427842.jar> <https://builds.apache.org/job/hbase-0.95-on-hadoop2/ws/0.95-on-hadoop2/hbase-server/target/surefire/surefire2649898682829039540tmp> <https://builds.apache.org/job/hbase-0.95-on-hadoop2/ws/0.95-on-hadoop2/hbase-server/target/surefire/surefire_2312916609837654050109tmp>
Running org.apache.hadoop.hbase.master.cleaner.TestHFileCleaner
Tests run: 3, Failures: 0, Errors: 0, Skipped: 0, Time elapsed: 4.239 sec
Forking command line: /bin/sh -c cd <https://builds.apache.org/job/hbase-0.95-on-hadoop2/ws/0.95-on-hadoop2/hbase-server> && /home/jenkins/tools/java/jdk1.6.0_45-32/jre/bin/java -enableassertions -Xmx1900m -Djava.security.egd=file:/dev/./urandom -Djava.net.preferIPv4Stack=true -jar <https://builds.apache.org/job/hbase-0.95-on-hadoop2/ws/0.95-on-hadoop2/hbase-server/target/surefire/surefirebooter4912725091364955983.jar> <https://builds.apache.org/job/hbase-0.95-on-hadoop2/ws/0.95-on-hadoop2/hbase-server/target/surefire/surefire7190739513483871314tmp> <https://builds.apache.org/job/hbase-0.95-on-hadoop2/ws/0.95-on-hadoop2/hbase-server/target/surefire/surefire_2325467058774874857469tmp>
Running org.apache.hadoop.hbase.master.TestTableLockManager
Tests run: 5, Failures: 0, Errors: 0, Skipped: 0, Time elapsed: 103.807 sec
Forking command line: /bin/sh -c cd <https://builds.apache.org/job/hbase-0.95-on-hadoop2/ws/0.95-on-hadoop2/hbase-server> && /home/jenkins/tools/java/jdk1.6.0_45-32/jre/bin/java -enableassertions -Xmx1900m -Djava.security.egd=file:/dev/./urandom -Djava.net.preferIPv4Stack=true -jar <https://builds.apache.org/job/hbase-0.95-on-hadoop2/ws/0.95-on-hadoop2/hbase-server/target/surefire/surefirebooter5696323044957926122.jar> <https://builds.apache.org/job/hbase-0.95-on-hadoop2/ws/0.95-on-hadoop2/hbase-server/target/surefire/surefire533697009723222974tmp> <https://builds.apache.org/job/hbase-0.95-on-hadoop2/ws/0.95-on-hadoop2/hbase-server/target/surefire/surefire_233810371507955036644tmp>
Running org.apache.hadoop.hbase.master.cleaner.TestLogsCleaner
Tests run: 1, Failures: 0, Errors: 0, Skipped: 0, Time elapsed: 11.641 sec
Forking command line: /bin/sh -c cd <https://builds.apache.org/job/hbase-0.95-on-hadoop2/ws/0.95-on-hadoop2/hbase-server> && /home/jenkins/tools/java/jdk1.6.0_45-32/jre/bin/java -enableassertions -Xmx1900m -Djava.security.egd=file:/dev/./urandom -Djava.net.preferIPv4Stack=true -jar <https://builds.apache.org/job/hbase-0.95-on-hadoop2/ws/0.95-on-hadoop2/hbase-server/target/surefire/surefirebooter4162575851534383230.jar> <https://builds.apache.org/job/hbase-0.95-on-hadoop2/ws/0.95-on-hadoop2/hbase-server/target/surefire/surefire9098161580413901865tmp> <https://builds.apache.org/job/hbase-0.95-on-hadoop2/ws/0.95-on-hadoop2/hbase-server/target/surefire/surefire_2342913878070057210300tmp>
Running org.apache.hadoop.hbase.master.TestMasterShutdown
Tests run: 2, Failures: 0, Errors: 0, Skipped: 0, Time elapsed: 14.521 sec
Forking command line: /bin/sh -c cd <https://builds.apache.org/job/hbase-0.95-on-hadoop2/ws/0.95-on-hadoop2/hbase-server> && /home/jenkins/tools/java/jdk1.6.0_45-32/jre/bin/java -enableassertions -Xmx1900m -Djava.security.egd=file:/dev/./urandom -Djava.net.preferIPv4Stack=true -jar <https://builds.apache.org/job/hbase-0.95-on-hadoop2/ws/0.95-on-hadoop2/hbase-server/target/surefire/surefirebooter4116791792194555727.jar> <https://builds.apache.org/job/hbase-0.95-on-hadoop2/ws/0.95-on-hadoop2/hbase-server/target/surefire/surefire6383891204925747365tmp> <https://builds.apache.org/job/hbase-0.95-on-hadoop2/ws/0.95-on-hadoop2/hbase-server/target/surefire/surefire_2359155387457951855233tmp>
Running org.apache.hadoop.hbase.master.cleaner.TestSnapshotFromMaster
Tests run: 4, Failures: 0, Errors: 0, Skipped: 0, Time elapsed: 25.252 sec
Forking command line: /bin/sh -c cd <https://builds.apache.org/job/hbase-0.95-on-hadoop2/ws/0.95-on-hadoop2/hbase-server> && /home/jenkins/tools/java/jdk1.6.0_45-32/jre/bin/java -enableassertions -Xmx1900m -Djava.security.egd=file:/dev/./urandom -Djava.net.preferIPv4Stack=true -jar <https://builds.apache.org/job/hbase-0.95-on-hadoop2/ws/0.95-on-hadoop2/hbase-server/target/surefire/surefirebooter1601594810062172359.jar> <https://builds.apache.org/job/hbase-0.95-on-hadoop2/ws/0.95-on-hadoop2/hbase-server/target/surefire/surefire8952726732666456706tmp> <https://builds.apache.org/job/hbase-0.95-on-hadoop2/ws/0.95-on-hadoop2/hbase-server/target/surefire/surefire_2367947785053412104860tmp>
Running org.apache.hadoop.hbase.master.TestMasterFileSystem
Tests run: 2, Failures: 0, Errors: 0, Skipped: 0, Time elapsed: 6.771 sec
Forking command line: /bin/sh -c cd <https://builds.apache.org/job/hbase-0.95-on-hadoop2/ws/0.95-on-hadoop2/hbase-server> && /home/jenkins/tools/java/jdk1.6.0_45-32/jre/bin/java -enableassertions -Xmx1900m -Djava.security.egd=file:/dev/./urandom -Djava.net.preferIPv4Stack=true -jar <https://builds.apache.org/job/hbase-0.95-on-hadoop2/ws/0.95-on-hadoop2/hbase-server/target/surefire/surefirebooter1515145383158755729.jar> <https://builds.apache.org/job/hbase-0.95-on-hadoop2/ws/0.95-on-hadoop2/hbase-server/target/surefire/surefire1487854047342907276tmp> <https://builds.apache.org/job/hbase-0.95-on-hadoop2/ws/0.95-on-hadoop2/hbase-server/target/surefire/surefire_2373141625341174219274tmp>
Running org.apache.hadoop.hbase.master.handler.TestCreateTableHandler
Tests run: 2, Failures: 0, Errors: 0, Skipped: 0, Time elapsed: 15.312 sec
Forking command line: /bin/sh -c cd <https://builds.apache.org/job/hbase-0.95-on-hadoop2/ws/0.95-on-hadoop2/hbase-server> && /home/jenkins/tools/java/jdk1.6.0_45-32/jre/bin/java -enableassertions -Xmx1900m -Djava.security.egd=file:/dev/./urandom -Djava.net.preferIPv4Stack=true -jar <https://builds.apache.org/job/hbase-0.95-on-hadoop2/ws/0.95-on-hadoop2/hbase-server/target/surefire/surefirebooter2609247796368087313.jar> <https://builds.apache.org/job/hbase-0.95-on-hadoop2/ws/0.95-on-hadoop2/hbase-server/target/surefire/surefire6738995309553155750tmp> <https://builds.apache.org/job/hbase-0.95-on-hadoop2/ws/0.95-on-hadoop2/hbase-server/target/surefire/surefire_238393188766922384549tmp>
Running org.apache.hadoop.hbase.master.handler.TestTableDeleteFamilyHandler
Tests run: 1, Failures: 0, Errors: 0, Skipped: 0, Time elapsed: 18.879 sec
Forking command line: /bin/sh -c cd <https://builds.apache.org/job/hbase-0.95-on-hadoop2/ws/0.95-on-hadoop2/hbase-server> && /home/jenkins/tools/java/jdk1.6.0_45-32/jre/bin/java -enableassertions -Xmx1900m -Djava.security.egd=file:/dev/./urandom -Djava.net.preferIPv4Stack=true -jar <https://builds.apache.org/job/hbase-0.95-on-hadoop2/ws/0.95-on-hadoop2/hbase-server/target/surefire/surefirebooter207396163479744771.jar> <https://builds.apache.org/job/hbase-0.95-on-hadoop2/ws/0.95-on-hadoop2/hbase-server/target/surefire/surefire7415662588870930829tmp> <https://builds.apache.org/job/hbase-0.95-on-hadoop2/ws/0.95-on-hadoop2/hbase-server/target/surefire/surefire_2392809540488825093734tmp>
Running org.apache.hadoop.hbase.master.handler.TestTableDescriptorModification
Tests run: 3, Failures: 0, Errors: 0, Skipped: 0, Time elapsed: 17.197 sec
Forking command line: /bin/sh -c cd <https://builds.apache.org/job/hbase-0.95-on-hadoop2/ws/0.95-on-hadoop2/hbase-server> && /home/jenkins/tools/java/jdk1.6.0_45-32/jre/bin/java -enableassertions -Xmx1900m -Djava.security.egd=file:/dev/./urandom -Djava.net.preferIPv4Stack=true -jar <https://builds.apache.org/job/hbase-0.95-on-hadoop2/ws/0.95-on-hadoop2/hbase-server/target/surefire/surefirebooter6470920690096832116.jar> <https://builds.apache.org/job/hbase-0.95-on-hadoop2/ws/0.95-on-hadoop2/hbase-server/target/surefire/surefire4593949177940354319tmp> <https://builds.apache.org/job/hbase-0.95-on-hadoop2/ws/0.95-on-hadoop2/hbase-server/target/surefire/surefire_2405571842827811659117tmp>
Running org.apache.hadoop.hbase.master.TestClusterStatusPublisher
Tests run: 3, Failures: 0, Errors: 0, Skipped: 0, Time elapsed: 0.339 sec
Forking command line: /bin/sh -c cd <https://builds.apache.org/job/hbase-0.95-on-hadoop2/ws/0.95-on-hadoop2/hbase-server> && /home/jenkins/tools/java/jdk1.6.0_45-32/jre/bin/java -enableassertions -Xmx1900m -Djava.security.egd=file:/dev/./urandom -Djava.net.preferIPv4Stack=true -jar <https://builds.apache.org/job/hbase-0.95-on-hadoop2/ws/0.95-on-hadoop2/hbase-server/target/surefire/surefirebooter1556454005761272387.jar> <https://builds.apache.org/job/hbase-0.95-on-hadoop2/ws/0.95-on-hadoop2/hbase-server/target/surefire/surefire4303108420137363265tmp> <https://builds.apache.org/job/hbase-0.95-on-hadoop2/ws/0.95-on-hadoop2/hbase-server/target/surefire/surefire_2412778935388899988292tmp>
Running org.apache.hadoop.hbase.master.snapshot.TestSnapshotFileCache
Tests run: 4, Failures: 0, Errors: 0, Skipped: 0, Time elapsed: 3.945 sec
Forking command line: /bin/sh -c cd <https://builds.apache.org/job/hbase-0.95-on-hadoop2/ws/0.95-on-hadoop2/hbase-server> && /home/jenkins/tools/java/jdk1.6.0_45-32/jre/bin/java -enableassertions -Xmx1900m -Djava.security.egd=file:/dev/./urandom -Djava.net.preferIPv4Stack=true -jar <https://builds.apache.org/job/hbase-0.95-on-hadoop2/ws/0.95-on-hadoop2/hbase-server/target/surefire/surefirebooter6413404204897776090.jar> <https://builds.apache.org/job/hbase-0.95-on-hadoop2/ws/0.95-on-hadoop2/hbase-server/target/surefire/surefire5228643147541104225tmp> <https://builds.apache.org/job/hbase-0.95-on-hadoop2/ws/0.95-on-hadoop2/hbase-server/target/surefire/surefire_242565032053057167007tmp>
Running org.apache.hadoop.hbase.master.TestMasterMetricsWrapper
Tests run: 1, Failures: 0, Errors: 0, Skipped: 0, Time elapsed: 9.293 sec
Forking command line: /bin/sh -c cd <https://builds.apache.org/job/hbase-0.95-on-hadoop2/ws/0.95-on-hadoop2/hbase-server> && /home/jenkins/tools/java/jdk1.6.0_45-32/jre/bin/java -enableassertions -Xmx1900m -Djava.security.egd=file:/dev/./urandom -Djava.net.preferIPv4Stack=true -jar <https://builds.apache.org/job/hbase-0.95-on-hadoop2/ws/0.95-on-hadoop2/hbase-server/target/surefire/surefirebooter7432858305945079390.jar> <https://builds.apache.org/job/hbase-0.95-on-hadoop2/ws/0.95-on-hadoop2/hbase-server/target/surefire/surefire2706090445305777747tmp> <https://builds.apache.org/job/hbase-0.95-on-hadoop2/ws/0.95-on-hadoop2/hbase-server/target/surefire/surefire_2433203341126081238862tmp>
Running org.apache.hadoop.hbase.master.TestMasterNoCluster
Tests run: 4, Failures: 0, Errors: 0, Skipped: 0, Time elapsed: 8.642 sec
Forking command line: /bin/sh -c cd <https://builds.apache.org/job/hbase-0.95-on-hadoop2/ws/0.95-on-hadoop2/hbase-server> && /home/jenkins/tools/java/jdk1.6.0_45-32/jre/bin/java -enableassertions -Xmx1900m -Djava.security.egd=file:/dev/./urandom -Djava.net.preferIPv4Stack=true -jar <https://builds.apache.org/job/hbase-0.95-on-hadoop2/ws/0.95-on-hadoop2/hbase-server/target/surefire/surefirebooter8406642391489453776.jar> <https://builds.apache.org/job/hbase-0.95-on-hadoop2/ws/0.95-on-hadoop2/hbase-server/target/surefire/surefire3163728162044220632tmp> <https://builds.apache.org/job/hbase-0.95-on-hadoop2/ws/0.95-on-hadoop2/hbase-server/target/surefire/surefire_2448566923430224732274tmp>
Running org.apache.hadoop.hbase.master.TestDeadServer
Tests run: 3, Failures: 0, Errors: 0, Skipped: 0, Time elapsed: 0.352 sec
Forking command line: /bin/sh -c cd <https://builds.apache.org/job/hbase-0.95-on-hadoop2/ws/0.95-on-hadoop2/hbase-server> && /home/jenkins/tools/java/jdk1.6.0_45-32/jre/bin/java -enableassertions -Xmx1900m -Djava.security.egd=file:/dev/./urandom -Djava.net.preferIPv4Stack=true -jar <https://builds.apache.org/job/hbase-0.95-on-hadoop2/ws/0.95-on-hadoop2/hbase-server/target/surefire/surefirebooter5351948043134468184.jar> <https://builds.apache.org/job/hbase-0.95-on-hadoop2/ws/0.95-on-hadoop2/hbase-server/target/surefire/surefire7279681925523401118tmp> <https://builds.apache.org/job/hbase-0.95-on-hadoop2/ws/0.95-on-hadoop2/hbase-server/target/surefire/surefire_2456163906575004508308tmp>
Running org.apache.hadoop.hbase.master.TestZKBasedOpenCloseRegion
Tests run: 4, Failures: 0, Errors: 0, Skipped: 0, Time elapsed: 12.055 sec
Running org.apache.hadoop.hbase.master.TestDistributedLogSplitting
Tests run: 14, Failures: 0, Errors: 0, Skipped: 0, Time elapsed: 183.584 sec
Running org.apache.hadoop.hbase.master.TestSplitLogManager
Tests run: 13, Failures: 0, Errors: 0, Skipped: 0, Time elapsed: 82.324 sec
Running org.apache.hadoop.hbase.master.balancer.TestStochasticLoadBalancer
Tests run: 12, Failures: 0, Errors: 0, Skipped: 0, Time elapsed: 191.843 sec

Results :

Tests in error: 
  testTokenAuthentication(org.apache.hadoop.hbase.security.token.TestTokenAuthentication): Can't get Kerberos realm

Tests run: 1487, Failures: 0, Errors: 1, Skipped: 15

[INFO]                                                                         
[INFO] ------------------------------------------------------------------------
[INFO] Skipping HBase
[INFO] This project has been banned from the build due to previous failures.
[INFO] ------------------------------------------------------------------------
[INFO] ------------------------------------------------------------------------
[INFO] Reactor Summary:
[INFO] 
[INFO] HBase ............................................. SUCCESS [6.664s]
[INFO] HBase - Common .................................... SUCCESS [21.383s]
[INFO] HBase - Protocol .................................. SUCCESS [17.144s]
[INFO] HBase - Client .................................... SUCCESS [21.228s]
[INFO] HBase - Prefix Tree ............................... SUCCESS [3.659s]
[INFO] HBase - Hadoop Compatibility ...................... SUCCESS [5.436s]
[INFO] HBase - Hadoop Two Compatibility .................. SUCCESS [3.163s]
[INFO] HBase - Server .................................... FAILURE [41:22.450s]
[INFO] HBase - Integration Tests ......................... SKIPPED
[INFO] HBase - Examples .................................. SKIPPED
[INFO] HBase - Assembly .................................. SKIPPED
[INFO] ------------------------------------------------------------------------
[INFO] BUILD FAILURE
[INFO] ------------------------------------------------------------------------
[INFO] Total time: 42:45.071s
[INFO] Finished at: Thu Jun 27 23:59:58 UTC 2013
[INFO] Final Memory: 117M/784M
[INFO] ------------------------------------------------------------------------
[ERROR] Failed to execute goal org.apache.maven.plugins:maven-surefire-plugin:2.12-TRUNK-HBASE-2:test (secondPartTestsExecution) on project hbase-server: Failure or timeout -> [Help 1]
org.apache.maven.lifecycle.LifecycleExecutionException: Failed to execute goal org.apache.maven.plugins:maven-surefire-plugin:2.12-TRUNK-HBASE-2:test (secondPartTestsExecution) on project hbase-server: Failure or timeout
	at org.apache.maven.lifecycle.internal.MojoExecutor.execute(MojoExecutor.java:217)
	at org.apache.maven.lifecycle.internal.MojoExecutor.execute(MojoExecutor.java:153)
	at org.apache.maven.lifecycle.internal.MojoExecutor.execute(MojoExecutor.java:145)
	at org.apache.maven.lifecycle.internal.LifecycleModuleBuilder.buildProject(LifecycleModuleBuilder.java:84)
	at org.apache.maven.lifecycle.internal.LifecycleModuleBuilder.buildProject(LifecycleModuleBuilder.java:59)
	at org.apache.maven.lifecycle.internal.LifecycleStarter.singleThreadedBuild(LifecycleStarter.java:183)
	at org.apache.maven.lifecycle.internal.LifecycleStarter.execute(LifecycleStarter.java:161)
	at org.apache.maven.DefaultMaven.doExecute(DefaultMaven.java:320)
	at org.apache.maven.DefaultMaven.execute(DefaultMaven.java:156)
	at org.apache.maven.cli.MavenCli.execute(MavenCli.java:537)
	at org.apache.maven.cli.MavenCli.doMain(MavenCli.java:196)
	at org.apache.maven.cli.MavenCli.main(MavenCli.java:141)
	at sun.reflect.NativeMethodAccessorImpl.invoke0(Native Method)
	at sun.reflect.NativeMethodAccessorImpl.invoke(NativeMethodAccessorImpl.java:39)
	at sun.reflect.DelegatingMethodAccessorImpl.invoke(DelegatingMethodAccessorImpl.java:25)
	at java.lang.reflect.Method.invoke(Method.java:597)
	at org.codehaus.plexus.classworlds.launcher.Launcher.launchEnhanced(Launcher.java:290)
	at org.codehaus.plexus.classworlds.launcher.Launcher.launch(Launcher.java:230)
	at org.codehaus.plexus.classworlds.launcher.Launcher.mainWithExitCode(Launcher.java:409)
	at org.codehaus.plexus.classworlds.launcher.Launcher.main(Launcher.java:352)
Caused by: org.apache.maven.plugin.MojoExecutionException: Failure or timeout
	at org.apache.maven.plugin.surefire.SurefirePlugin.assertNoFailureOrTimeout(SurefirePlugin.java:643)
	at org.apache.maven.plugin.surefire.SurefirePlugin.handleSummary(SurefirePlugin.java:624)
	at org.apache.maven.plugin.surefire.AbstractSurefireMojo.executeAfterPreconditionsChecked(AbstractSurefireMojo.java:137)
	at org.apache.maven.plugin.surefire.AbstractSurefireMojo.execute(AbstractSurefireMojo.java:98)
	at org.apache.maven.plugin.DefaultBuildPluginManager.executeMojo(DefaultBuildPluginManager.java:101)
	at org.apache.maven.lifecycle.internal.MojoExecutor.execute(MojoExecutor.java:209)
	... 19 more
[ERROR] 
[ERROR] 
[ERROR] For more information about the errors and possible solutions, please read the following articles:
[ERROR] [Help 1] http://cwiki.apache.org/confluence/display/MAVEN/MojoExecutionException
[ERROR] 
[ERROR] After correcting the problems, you can resume the build with the command
[ERROR]   mvn <goals> -rf :hbase-server
Build step 'Invoke top-level Maven targets' marked build as failure
Archiving artifacts
Recording test results
Updating HBASE-8813
Updating HBASE-8799

Mime
View raw message