hawq-dev mailing list archives

Site index · List index
Message view « Date » · « Thread »
Top « Date » · « Thread »
From "Ed Espino (JIRA)" <j...@apache.org>
Subject [jira] [Created] (HAWQ-1481) Travis CI build fails the Maven 3.0.0 check
Date Tue, 06 Jun 2017 06:46:18 GMT
Ed Espino created HAWQ-1481:
-------------------------------

             Summary: Travis CI build fails the Maven 3.0.0 check
                 Key: HAWQ-1481
                 URL: https://issues.apache.org/jira/browse/HAWQ-1481
             Project: Apache HAWQ
          Issue Type: Bug
          Components: Build
            Reporter: Ed Espino
            Assignee: Radar Lei
             Fix For: 2.3.0.0-incubating


Travis CI uses Apache Maven 3.5.0 and the minimum 3.0.0 version check is failing. This causes
the build to fail. Here is the failure.

{code}
***
ERROR: `mvn' is missing on your system.
***
make[2]: *** [hawq-mapreduce-tool/target/hawq-mapreduce-tool-1.1.0.jar] Error 1
make[1]: *** [all] Error 2
make: *** [all] Error 2
{code}




--
This message was sent by Atlassian JIRA
(v6.3.15#6346)

Mime
View raw message