hawq-dev mailing list archives

Site index · List index
Message view « Date » · « Thread »
Top « Date » · « Thread »
From Apache Jenkins Server <jenk...@builds.apache.org>
Subject Build failed in Jenkins: HAWQ-rat #197
Date Fri, 23 Jun 2017 04:25:22 GMT
See <https://builds.apache.org/job/HAWQ-rat/197/display/redirect?page=changes>

Changes:

[wlin] HAWQ-1458. The maximum value of guc

[Ed Espino] HAWQ-1489. Add LICENSE, DISCLAIMER and NOTICE to pxf jar files.

------------------------------------------
[...truncated 725 B...]
 > git config remote.origin.url https://github.com/apache/incubator-hawq.git # timeout=10
 > git config --add remote.origin.fetch +refs/heads/*:refs/remotes/origin/* # timeout=10
 > git config remote.origin.url https://github.com/apache/incubator-hawq.git # timeout=10
Fetching upstream changes from https://github.com/apache/incubator-hawq.git
 > git fetch --tags --progress https://github.com/apache/incubator-hawq.git +refs/heads/*:refs/remotes/origin/*
 > git rev-parse origin/master^{commit} # timeout=10
Checking out Revision f157d59fa8d16329ba0166e36085980b1a0ef6ff (origin/master)
 > git config core.sparsecheckout # timeout=10
 > git checkout -f f157d59fa8d16329ba0166e36085980b1a0ef6ff
 > git rev-list 29a160839949a1a08244962c5255933f714af46c # timeout=10
[HAWQ-rat] $ /home/jenkins/tools/maven/apache-maven-3.0.5/bin/mvn org.apache.rat:apache-rat-plugin:0.12:check
Java HotSpot(TM) 64-Bit Server VM warning: Insufficient space for shared memory file:
   /tmp/hsperfdata_jenkins/21108
Try using the -Djava.io.tmpdir= option to select an alternate temp location.

[INFO] Scanning for projects...
[INFO]                                                                         
[INFO] ------------------------------------------------------------------------
[INFO] Building hawq 2.2
[INFO] ------------------------------------------------------------------------
[INFO] 
[INFO] --- apache-rat-plugin:0.12:check (default-cli) @ hawq ---
[INFO] Added 1 additional default licenses.
[INFO] Enabled default license matchers.
[INFO] Added 2 custom approved licenses.
[INFO] Will parse SCM ignores for exclusions...
[INFO] Parsing exclusions from <https://builds.apache.org/job/HAWQ-rat/ws/.gitignore>
[INFO] Finished adding exclusions from SCM ignore files.
[INFO] 102 implicit excludes (use -debug for more details).
[INFO] Exclude: tools/bin/src/stream/*
[INFO] Exclude: tools/bin/pythonSrc/PyGreSQL-4.0/**
[INFO] Exclude: tools/bin/pythonSrc/lockfile-0.9.1/**
[INFO] Exclude: tools/bin/pythonSrc/PSI-0.3b2_gp/**
[INFO] Exclude: tools/bin/ext/simplejson/**
[INFO] Exclude: tools/bin/ext/yaml/**
[INFO] Exclude: depends/libhdfs3/CMake/**
[INFO] Exclude: depends/libyarn/CMake/**
[INFO] Exclude: tools/bin/pythonSrc/pychecker-0.8.18/**
[INFO] Exclude: tools/bin/pythonSrc/unittest2-0.5.1/**
[INFO] Exclude: tools/bin/ext/figleaf/**
[INFO] Exclude: tools/bin/ext/pg8000/**
[INFO] Exclude: src/include/port/win32_msvc/bzlib.h
[INFO] Exclude: depends/thirdparty/googletest/**
[INFO] Exclude: contrib/orafce/*
[INFO] Exclude: tools/bin/lib/pexpect.py
[INFO] Exclude: tools/bin/pythonSrc/pexpect-4.2/**
[INFO] Exclude: tools/bin/pythonSrc/ptyprocess-0.5.1/**
[INFO] Exclude: src/bin/gpfdist/src/gpfdist/glob.c
[INFO] Exclude: src/bin/gpfdist/src/gpfdist/include/glob.h
[INFO] Exclude: src/include/port/win32_msvc/glob.h
[INFO] Exclude: aclocal.m4
[INFO] Exclude: GNUmakefile.in
[INFO] Exclude: configure.in
[INFO] Exclude: configure
[INFO] Exclude: Makefile
[INFO] Exclude: config/*
[INFO] Exclude: src/makefiles/*
[INFO] Exclude: src/DEVELOPERS
[INFO] Exclude: src/backend/catalog/Makefile
[INFO] Exclude: src/backend/port/beos/*.c
[INFO] Exclude: src/backend/port/tas/*.s
[INFO] Exclude: src/backend/regex/re_syntax.n
[INFO] Exclude: src/backend/utils/mb/conversion_procs/regress_epilogue
[INFO] Exclude: src/backend/utils/mb/conversion_procs/regress_prolog
[INFO] Exclude: src/backend/utils/mb/Unicode/ISO10646-GB18030.TXT
[INFO] Exclude: src/backend/utils/misc/check_guc
[INFO] Exclude: src/backend/port/hpux/tas.c.template
[INFO] Exclude: src/backend/utils/mb/conversion_procs/proc.mk
[INFO] Exclude: src/include/pg_config.h.win32
[INFO] Exclude: src/bin/scripts/common.h
[INFO] Exclude: src/include/pg_config.h.in
[INFO] Exclude: src/bin/initdb/*
[INFO] Exclude: src/bin/initlocation/*
[INFO] Exclude: src/bin/ipcclean/*
[INFO] Exclude: src/bin/pg_*/**/*
[INFO] Exclude: src/bin/psql/**/*
[INFO] Exclude: src/bin/scripts/*.c
[INFO] Exclude: src/interfaces/**/*
[INFO] Exclude: src/tools/**/*
[INFO] Exclude: src/tutorial/*
[INFO] Exclude: src/pl/**/*
[INFO] Exclude: src/port/*
[INFO] Exclude: src/template/*
[INFO] Exclude: src/test/bench/query*
[INFO] Exclude: src/test/regress/**/*.in
[INFO] Exclude: src/test/regress/**/*.mdp
[INFO] Exclude: src/test/regress/**/*.xml
[INFO] Exclude: src/test/regress/data/fixedwidth/fixedwidth_3chars_line_delimiter.tbl
[INFO] Exclude: src/test/regress/data/fixedwidth/fixedwidth_big.tbl
[INFO] Exclude: src/test/regress/data/fixedwidth/fixedwidth_no_line_delimiter.tbl
[INFO] Exclude: src/test/regress/data/fixedwidth/fixedwidth_out.tbl
[INFO] Exclude: src/test/regress/data/fixedwidth/fixedwidth_small_blankfields.tbl
[INFO] Exclude: src/test/regress/data/fixedwidth/fixedwidth_small_blankfields_and_nulls.tbl
[INFO] Exclude: src/test/regress/data/fixedwidth/fixedwidth_small_correct.tbl
[INFO] Exclude: src/test/regress/data/fixedwidth/fixedwidth_small_error_fieldtoolong.tbl
[INFO] Exclude: src/test/regress/data/fixedwidth/fixedwidth_small_error_fieldtype.tbl
[INFO] Exclude: src/test/regress/data/fixedwidth/fixedwidth_small_error_rejectlimitcrossed.tbl
[INFO] Exclude: src/test/regress/data/fixedwidth/fixedwidth_small_error_rejectlimitnotcrossed.tbl
[INFO] Exclude: src/test/regress/data/fixedwidth/fixedwidth_small_error_toofewfields.tbl
[INFO] Exclude: src/test/regress/data/fixedwidth/fixedwidth_small_error_toomanyfields.tbl
[INFO] Exclude: src/test/regress/data/fixedwidth/fixedwidth_small_nulldefined.tbl
[INFO] Exclude: src/test/regress/data/nation.tbl
[INFO] Exclude: src/test/regress/data/nation_error50.tbl
[INFO] Exclude: src/test/regress/data/region.tbl
[INFO] Exclude: src/test/regress/expected_statuses
[INFO] Exclude: src/test/feature/ExternalSource/data/nation.tbl
[INFO] Exclude: src/test/feature/ExternalSource/data/nation_error50.tbl
[INFO] Exclude: src/test/feature/ExternalSource/data/region.tbl
[INFO] Exclude: src/test/feature/ManagementTool/test_hawq_register_hawq.paq
[INFO] Exclude: src/test/feature/ManagementTool/test_hawq_register_hive.paq
[INFO] Exclude: src/test/feature/ManagementTool/data/parquet200/dat.paq
[INFO] Exclude: src/test/feature/ManagementTool/data/parquet200sum/a.paq
[INFO] Exclude: src/test/feature/ManagementTool/data/parquet200sum/b.paq
[INFO] Exclude: src/test/feature/ManagementTool/test_hawq_register_data_types.paq
[INFO] Exclude: src/test/feature/ManagementTool/test_hawq_register_not_paq
[INFO] Exclude: src/test/feature/ManagementTool/test_hawq_register_null.paq
[INFO] Exclude: src/test/feature/ManagementTool/usage2case2/10
[INFO] Exclude: src/test/feature/ManagementTool/usage2case2/11
[INFO] Exclude: src/test/feature/ManagementTool/usage2case2/12
[INFO] Exclude: src/test/feature/ManagementTool/usage2case2/13
[INFO] Exclude: src/test/feature/ManagementTool/usage2case2/8
[INFO] Exclude: src/test/feature/ManagementTool/usage2case2/9
[INFO] Exclude: src/test/feature/UDF/ans/function_basics.ans.orca
[INFO] Exclude: src/test/feature/UDF/ans/function_basics.ans.planner
[INFO] Exclude: src/test/feature/UDF/ans/function_basics.ranger.ans.orca
[INFO] Exclude: src/test/feature/UDF/ans/function_basics.ranger.ans.planner
[INFO] Exclude: src/test/locale/**/Makefile
[INFO] Exclude: src/test/locale/**/runall
[INFO] Exclude: src/test/locale/de_DE.ISO8859-1/test-de-select.sql.in
[INFO] Exclude: src/test/locale/de_DE.ISO8859-1/test-de-sort.in
[INFO] Exclude: src/test/locale/de_DE.ISO8859-1/test-de-upper.sql.in
[INFO] Exclude: src/test/locale/de_DE.ISO8859-1/test-de.sql.in
[INFO] Exclude: src/test/locale/gr_GR.ISO8859-7/test-gr-select.sql.in
[INFO] Exclude: src/test/locale/gr_GR.ISO8859-7/test-gr-sort.in
[INFO] Exclude: src/test/locale/gr_GR.ISO8859-7/test-gr.sql.in
[INFO] Exclude: src/test/locale/koi8-r/test-koi8-select.sql.in
[INFO] Exclude: src/test/locale/koi8-r/test-koi8-sort.in
[INFO] Exclude: src/test/locale/koi8-r/test-koi8.sql.in
[INFO] Exclude: src/test/locale/koi8-to-win1251/test-koi8-select.sql.in
[INFO] Exclude: src/test/locale/koi8-to-win1251/test-koi8-sort.in
[INFO] Exclude: src/test/locale/koi8-to-win1251/test-koi8.sql.in
[INFO] Exclude: src/test/performance/results/PgSQL.970926
[INFO] Exclude: src/test/performance/sqls/connection
[INFO] Exclude: src/test/performance/sqls/crtsimple
[INFO] Exclude: src/test/performance/sqls/crtsimpleidx
[INFO] Exclude: src/test/performance/sqls/drpsimple
[INFO] Exclude: src/test/performance/sqls/orbsimple
[INFO] Exclude: src/test/performance/sqls/slcsimple
[INFO] Exclude: src/test/performance/sqls/vacuum
[INFO] Exclude: src/test/regress/resultmap
[INFO] Exclude: src/timezone/**/*
[INFO] Exclude: doc/src/sgml/fixrtf
[INFO] Exclude: doc/**/*.sgml
[INFO] Exclude: contrib/pgcrypto/*
[INFO] Exclude: depends/libhdfs3/test/data/*
[INFO] Exclude: depends/libhdfs3/debian/**
[INFO] Exclude: depends/libyarn/test/data/*
[INFO] Exclude: contrib/hawq-hadoop/hawq-mapreduce-common/src/test/resources/**/*.yaml
[INFO] Exclude: contrib/hawq-hadoop/hawq-mapreduce-tool/test-data/**/*.yaml
[INFO] Exclude: contrib/hawq-hadoop/hawq-mapreduce-tool/src/test/resources/dataset
[INFO] Exclude: contrib/hawq-ambari-plugin/build.properties
[INFO] Exclude: contrib/hawq-ambari-plugin/README.md
[INFO] Exclude: src/backend/access/index/caql.files
[INFO] Exclude: src/backend/gpopt/library.ver
[INFO] Exclude: src/backend/utils/misc/etc/slaves
[INFO] Exclude: tools/bin/.rcfile
[INFO] Exclude: tools/bin/postgresql_conf_gp_additions
[INFO] Exclude: tools/doc/**/*
[INFO] Exclude: tools/demo/gpfdist_transform/*.yaml
[INFO] Exclude: tools/bin/gppylib/operations/madlib_depcheck/changelist.yaml
[INFO] Exclude: .git/**
[INFO] Exclude: **/*.md
[INFO] Exclude: **/*.md5
[INFO] Exclude: **/*.json
[INFO] Exclude: **/*.ans
[INFO] Exclude: **/*.sql
[INFO] Exclude: **/*.out
[INFO] Exclude: **/*.po
[INFO] Exclude: **/*.map
[INFO] Exclude: **/*.stderr
[INFO] Exclude: **/*.stdout
[INFO] Exclude: **/*.source
[INFO] Exclude: **/*.txt
[INFO] Exclude: **/*.data
[INFO] Exclude: **/*.csv
[INFO] Exclude: **/*.pm
[INFO] Exclude: **/*.1
[INFO] Exclude: **/*.sample
[INFO] Exclude: **/*.pgc
[INFO] Exclude: **/*.cnf
[INFO] Exclude: **/*.stx
[INFO] Exclude: **/*.gdb
[INFO] Exclude: **/*.patch
[INFO] Exclude: **/*.commit
[INFO] Exclude: **/__init__.py
[INFO] Exclude: **/*README*
[INFO] 3297 resources included (use -debug for more details)
[INFO] Rat check: Summary over all files. Unapproved: 0, unknown: 0, generated: 0, approved:
3287 licenses.
[INFO] ------------------------------------------------------------------------
[INFO] BUILD SUCCESS
[INFO] ------------------------------------------------------------------------
[INFO] Total time: 6.341s
[INFO] Finished at: Fri Jun 23 04:25:19 UTC 2017
[INFO] Final Memory: 10M/606M
[INFO] ------------------------------------------------------------------------
FATAL: Unable to produce a script file
java.io.IOException: No space left on device
	at java.io.FileOutputStream.writeBytes(Native Method)
	at java.io.FileOutputStream.write(FileOutputStream.java:326)
	at sun.nio.cs.StreamEncoder.writeBytes(StreamEncoder.java:221)
	at sun.nio.cs.StreamEncoder.implClose(StreamEncoder.java:316)
	at sun.nio.cs.StreamEncoder.close(StreamEncoder.java:149)
	at java.io.OutputStreamWriter.close(OutputStreamWriter.java:233)
	at hudson.FilePath$17.invoke(FilePath.java:1379)
	at hudson.FilePath$17.invoke(FilePath.java:1362)
	at hudson.FilePath$FileCallableWrapper.call(FilePath.java:2731)
	at hudson.remoting.UserRequest.perform(UserRequest.java:153)
	at hudson.remoting.UserRequest.perform(UserRequest.java:50)
	at hudson.remoting.Request$2.run(Request.java:336)
	at hudson.remoting.InterceptingExecutorService$1.call(InterceptingExecutorService.java:68)
	at java.util.concurrent.FutureTask.run(FutureTask.java:266)
	at java.util.concurrent.ThreadPoolExecutor.runWorker(ThreadPoolExecutor.java:1142)
	at java.util.concurrent.ThreadPoolExecutor$Worker.run(ThreadPoolExecutor.java:617)
	at java.lang.Thread.run(Thread.java:745)
	at ......remote call to qnode3(Native Method)
	at hudson.remoting.Channel.attachCallSiteStackTrace(Channel.java:1545)
	at hudson.remoting.UserResponse.retrieve(UserRequest.java:253)
	at hudson.remoting.Channel.call(Channel.java:830)
	at hudson.FilePath.act(FilePath.java:985)
Caused: java.io.IOException: remote file operation failed: <https://builds.apache.org/job/HAWQ-rat/ws/>
at hudson.remoting.Channel@546b94dd:qnode3
	at hudson.FilePath.act(FilePath.java:992)
	at hudson.FilePath.act(FilePath.java:974)
	at hudson.FilePath.createTextTempFile(FilePath.java:1362)
Caused: java.io.IOException: Failed to create a temp file on <https://builds.apache.org/job/HAWQ-rat/ws/>
	at hudson.FilePath.createTextTempFile(FilePath.java:1385)
	at hudson.tasks.CommandInterpreter.createScriptFile(CommandInterpreter.java:162)
	at hudson.tasks.CommandInterpreter.perform(CommandInterpreter.java:94)
	at hudson.tasks.CommandInterpreter.perform(CommandInterpreter.java:66)
	at hudson.tasks.BuildStepMonitor$1.perform(BuildStepMonitor.java:20)
	at hudson.model.AbstractBuild$AbstractBuildExecution.perform(AbstractBuild.java:779)
	at hudson.model.Build$BuildExecution.build(Build.java:206)
	at hudson.model.Build$BuildExecution.doRun(Build.java:163)
	at hudson.model.AbstractBuild$AbstractBuildExecution.run(AbstractBuild.java:534)
	at hudson.model.Run.execute(Run.java:1728)
	at hudson.model.FreeStyleBuild.run(FreeStyleBuild.java:43)
	at hudson.model.ResourceController.execute(ResourceController.java:98)
	at hudson.model.Executor.run(Executor.java:405)
Build step 'Execute shell' marked build as failure
Archiving artifacts

Mime
View raw message