hawq-dev mailing list archives

Site index · List index
Message view « Date » · « Thread »
Top « Date » · « Thread »
From Apache Jenkins Server <jenk...@builds.apache.org>
Subject Build failed in Jenkins: HAWQ-rat #90
Date Thu, 02 Mar 2017 01:55:39 GMT
See <https://builds.apache.org/job/HAWQ-rat/90/display/redirect?page=changes>

Changes:

[wangchunling14] HAWQ-1359. Add policy test for HAWQ with Ranger enabled.

------------------------------------------
[...truncated 8.37 KB...]
[INFO] Exclude: src/test/performance/sqls/crtsimpleidx
[INFO] Exclude: src/test/performance/sqls/drpsimple
[INFO] Exclude: src/test/performance/sqls/orbsimple
[INFO] Exclude: src/test/performance/sqls/slcsimple
[INFO] Exclude: src/test/performance/sqls/vacuum
[INFO] Exclude: src/test/regress/resultmap
[INFO] Exclude: src/timezone/**/*
[INFO] Exclude: doc/src/sgml/fixrtf
[INFO] Exclude: doc/**/*.sgml
[INFO] Exclude: contrib/pgcrypto/*
[INFO] Exclude: depends/libhdfs3/test/data/*
[INFO] Exclude: depends/libhdfs3/debian/**
[INFO] Exclude: depends/libyarn/test/data/*
[INFO] Exclude: contrib/hawq-hadoop/hawq-mapreduce-common/src/test/resources/**/*.yaml
[INFO] Exclude: contrib/hawq-hadoop/hawq-mapreduce-tool/test-data/**/*.yaml
[INFO] Exclude: contrib/hawq-hadoop/hawq-mapreduce-tool/src/test/resources/dataset
[INFO] Exclude: contrib/hawq-ambari-plugin/build.properties
[INFO] Exclude: contrib/hawq-ambari-plugin/README.md
[INFO] Exclude: src/backend/access/index/caql.files
[INFO] Exclude: src/backend/gpopt/library.ver
[INFO] Exclude: src/backend/utils/misc/etc/slaves
[INFO] Exclude: tools/bin/.rcfile
[INFO] Exclude: tools/bin/postgresql_conf_gp_additions
[INFO] Exclude: tools/doc/**/*
[INFO] Exclude: tools/demo/gpfdist_transform/*.yaml
[INFO] Exclude: tools/bin/gppylib/operations/madlib_depcheck/changelist.yaml
[INFO] Exclude: .git/**
[INFO] Exclude: **/*.md
[INFO] Exclude: **/*.md5
[INFO] Exclude: **/*.json
[INFO] Exclude: **/*.ans
[INFO] Exclude: **/*.sql
[INFO] Exclude: **/*.out
[INFO] Exclude: **/*.po
[INFO] Exclude: **/*.map
[INFO] Exclude: **/*.stderr
[INFO] Exclude: **/*.stdout
[INFO] Exclude: **/*.source
[INFO] Exclude: **/*.txt
[INFO] Exclude: **/*.data
[INFO] Exclude: **/*.csv
[INFO] Exclude: **/*.pm
[INFO] Exclude: **/*.1
[INFO] Exclude: **/*.sample
[INFO] Exclude: **/*.pgc
[INFO] Exclude: **/*.cnf
[INFO] Exclude: **/*.stx
[INFO] Exclude: **/*.gdb
[INFO] Exclude: **/*.patch
[INFO] Exclude: **/*.commit
[INFO] Exclude: **/__init__.py
[INFO] Exclude: **/*README*
[INFO] 3256 resources included (use -debug for more details)
[INFO] Rat check: Summary over all files. Unapproved: 2, unknown: 2, generated: 0, approved:
3250 licenses.
[INFO] Added 1 additional default licenses.
[INFO] Enabled default license matchers.
[INFO] Added 2 custom approved licenses.
[INFO] Will parse SCM ignores for exclusions...
[INFO] Parsing exclusions from <https://builds.apache.org/job/HAWQ-rat/ws/.gitignore>
[INFO] Finished adding exclusions from SCM ignore files.
[INFO] 102 implicit excludes (use -debug for more details).
[INFO] Exclude: tools/bin/src/stream/*
[INFO] Exclude: tools/bin/pythonSrc/PyGreSQL-4.0/**
[INFO] Exclude: tools/bin/pythonSrc/lockfile-0.9.1/**
[INFO] Exclude: tools/bin/pythonSrc/PSI-0.3b2_gp/**
[INFO] Exclude: tools/bin/ext/simplejson/**
[INFO] Exclude: tools/bin/ext/yaml/**
[INFO] Exclude: depends/libhdfs3/CMake/**
[INFO] Exclude: depends/libyarn/CMake/**
[INFO] Exclude: tools/bin/pythonSrc/pychecker-0.8.18/**
[INFO] Exclude: tools/bin/pythonSrc/unittest2-0.5.1/**
[INFO] Exclude: tools/bin/ext/figleaf/**
[INFO] Exclude: tools/bin/ext/pg8000/**
[INFO] Exclude: src/include/port/win32_msvc/bzlib.h
[INFO] Exclude: depends/thirdparty/googletest/**
[INFO] Exclude: contrib/orafce/*
[INFO] Exclude: tools/bin/lib/pexpect.py
[INFO] Exclude: tools/bin/pythonSrc/pexpect-4.2/**
[INFO] Exclude: tools/bin/pythonSrc/ptyprocess-0.5.1/**
[INFO] Exclude: src/bin/gpfdist/src/gpfdist/glob.c
[INFO] Exclude: src/bin/gpfdist/src/gpfdist/include/glob.h
[INFO] Exclude: src/include/port/win32_msvc/glob.h
[INFO] Exclude: aclocal.m4
[INFO] Exclude: GNUmakefile.in
[INFO] Exclude: configure.in
[INFO] Exclude: configure
[INFO] Exclude: Makefile
[INFO] Exclude: config/*
[INFO] Exclude: src/makefiles/*
[INFO] Exclude: src/DEVELOPERS
[INFO] Exclude: src/backend/catalog/Makefile
[INFO] Exclude: src/backend/port/beos/*.c
[INFO] Exclude: src/backend/port/tas/*.s
[INFO] Exclude: src/backend/regex/re_syntax.n
[INFO] Exclude: src/backend/utils/mb/conversion_procs/regress_epilogue
[INFO] Exclude: src/backend/utils/mb/conversion_procs/regress_prolog
[INFO] Exclude: src/backend/utils/mb/Unicode/ISO10646-GB18030.TXT
[INFO] Exclude: src/backend/utils/misc/check_guc
[INFO] Exclude: src/backend/port/hpux/tas.c.template
[INFO] Exclude: src/backend/utils/mb/conversion_procs/proc.mk
[INFO] Exclude: src/include/pg_config.h.win32
[INFO] Exclude: src/bin/scripts/common.h
[INFO] Exclude: src/include/pg_config.h.in
[INFO] Exclude: src/bin/initdb/*
[INFO] Exclude: src/bin/initlocation/*
[INFO] Exclude: src/bin/ipcclean/*
[INFO] Exclude: src/bin/pg_*/**/*
[INFO] Exclude: src/bin/psql/**/*
[INFO] Exclude: src/bin/scripts/*.c
[INFO] Exclude: src/interfaces/**/*
[INFO] Exclude: src/tools/**/*
[INFO] Exclude: src/tutorial/*
[INFO] Exclude: src/pl/**/*
[INFO] Exclude: src/port/*
[INFO] Exclude: src/template/*
[INFO] Exclude: src/test/bench/query*
[INFO] Exclude: src/test/regress/**/*.in
[INFO] Exclude: src/test/regress/**/*.mdp
[INFO] Exclude: src/test/regress/**/*.xml
[INFO] Exclude: src/test/regress/data/fixedwidth/fixedwidth_3chars_line_delimiter.tbl
[INFO] Exclude: src/test/regress/data/fixedwidth/fixedwidth_big.tbl
[INFO] Exclude: src/test/regress/data/fixedwidth/fixedwidth_no_line_delimiter.tbl
[INFO] Exclude: src/test/regress/data/fixedwidth/fixedwidth_out.tbl
[INFO] Exclude: src/test/regress/data/fixedwidth/fixedwidth_small_blankfields.tbl
[INFO] Exclude: src/test/regress/data/fixedwidth/fixedwidth_small_blankfields_and_nulls.tbl
[INFO] Exclude: src/test/regress/data/fixedwidth/fixedwidth_small_correct.tbl
[INFO] Exclude: src/test/regress/data/fixedwidth/fixedwidth_small_error_fieldtoolong.tbl
[INFO] Exclude: src/test/regress/data/fixedwidth/fixedwidth_small_error_fieldtype.tbl
[INFO] Exclude: src/test/regress/data/fixedwidth/fixedwidth_small_error_rejectlimitcrossed.tbl
[INFO] Exclude: src/test/regress/data/fixedwidth/fixedwidth_small_error_rejectlimitnotcrossed.tbl
[INFO] Exclude: src/test/regress/data/fixedwidth/fixedwidth_small_error_toofewfields.tbl
[INFO] Exclude: src/test/regress/data/fixedwidth/fixedwidth_small_error_toomanyfields.tbl
[INFO] Exclude: src/test/regress/data/fixedwidth/fixedwidth_small_nulldefined.tbl
[INFO] Exclude: src/test/regress/data/nation.tbl
[INFO] Exclude: src/test/regress/data/nation_error50.tbl
[INFO] Exclude: src/test/regress/data/region.tbl
[INFO] Exclude: src/test/regress/expected_statuses
[INFO] Exclude: src/test/feature/ExternalSource/data/nation.tbl
[INFO] Exclude: src/test/feature/ExternalSource/data/nation_error50.tbl
[INFO] Exclude: src/test/feature/ExternalSource/data/region.tbl
[INFO] Exclude: src/test/feature/ManagementTool/test_hawq_register_hawq.paq
[INFO] Exclude: src/test/feature/ManagementTool/test_hawq_register_hive.paq
[INFO] Exclude: src/test/feature/ManagementTool/data/parquet200/dat.paq
[INFO] Exclude: src/test/feature/ManagementTool/data/parquet200sum/a.paq
[INFO] Exclude: src/test/feature/ManagementTool/data/parquet200sum/b.paq
[INFO] Exclude: src/test/feature/ManagementTool/test_hawq_register_data_types.paq
[INFO] Exclude: src/test/feature/ManagementTool/test_hawq_register_not_paq
[INFO] Exclude: src/test/feature/ManagementTool/test_hawq_register_null.paq
[INFO] Exclude: src/test/feature/ManagementTool/usage2case2/10
[INFO] Exclude: src/test/feature/ManagementTool/usage2case2/11
[INFO] Exclude: src/test/feature/ManagementTool/usage2case2/12
[INFO] Exclude: src/test/feature/ManagementTool/usage2case2/13
[INFO] Exclude: src/test/feature/ManagementTool/usage2case2/8
[INFO] Exclude: src/test/feature/ManagementTool/usage2case2/9
[INFO] Exclude: src/test/feature/UDF/ans/function_basics.ans.orca
[INFO] Exclude: src/test/feature/UDF/ans/function_basics.ans.planner
[INFO] Exclude: src/test/feature/UDF/ans/function_basics.ranger.ans.orca
[INFO] Exclude: src/test/feature/UDF/ans/function_basics.ranger.ans.planner
[INFO] Exclude: src/test/locale/**/Makefile
[INFO] Exclude: src/test/locale/**/runall
[INFO] Exclude: src/test/locale/de_DE.ISO8859-1/test-de-select.sql.in
[INFO] Exclude: src/test/locale/de_DE.ISO8859-1/test-de-sort.in
[INFO] Exclude: src/test/locale/de_DE.ISO8859-1/test-de-upper.sql.in
[INFO] Exclude: src/test/locale/de_DE.ISO8859-1/test-de.sql.in
[INFO] Exclude: src/test/locale/gr_GR.ISO8859-7/test-gr-select.sql.in
[INFO] Exclude: src/test/locale/gr_GR.ISO8859-7/test-gr-sort.in
[INFO] Exclude: src/test/locale/gr_GR.ISO8859-7/test-gr.sql.in
[INFO] Exclude: src/test/locale/koi8-r/test-koi8-select.sql.in
[INFO] Exclude: src/test/locale/koi8-r/test-koi8-sort.in
[INFO] Exclude: src/test/locale/koi8-r/test-koi8.sql.in
[INFO] Exclude: src/test/locale/koi8-to-win1251/test-koi8-select.sql.in
[INFO] Exclude: src/test/locale/koi8-to-win1251/test-koi8-sort.in
[INFO] Exclude: src/test/locale/koi8-to-win1251/test-koi8.sql.in
[INFO] Exclude: src/test/performance/results/PgSQL.970926
[INFO] Exclude: src/test/performance/sqls/connection
[INFO] Exclude: src/test/performance/sqls/crtsimple
[INFO] Exclude: src/test/performance/sqls/crtsimpleidx
[INFO] Exclude: src/test/performance/sqls/drpsimple
[INFO] Exclude: src/test/performance/sqls/orbsimple
[INFO] Exclude: src/test/performance/sqls/slcsimple
[INFO] Exclude: src/test/performance/sqls/vacuum
[INFO] Exclude: src/test/regress/resultmap
[INFO] Exclude: src/timezone/**/*
[INFO] Exclude: doc/src/sgml/fixrtf
[INFO] Exclude: doc/**/*.sgml
[INFO] Exclude: contrib/pgcrypto/*
[INFO] Exclude: depends/libhdfs3/test/data/*
[INFO] Exclude: depends/libhdfs3/debian/**
[INFO] Exclude: depends/libyarn/test/data/*
[INFO] Exclude: contrib/hawq-hadoop/hawq-mapreduce-common/src/test/resources/**/*.yaml
[INFO] Exclude: contrib/hawq-hadoop/hawq-mapreduce-tool/test-data/**/*.yaml
[INFO] Exclude: contrib/hawq-hadoop/hawq-mapreduce-tool/src/test/resources/dataset
[INFO] Exclude: contrib/hawq-ambari-plugin/build.properties
[INFO] Exclude: contrib/hawq-ambari-plugin/README.md
[INFO] Exclude: src/backend/access/index/caql.files
[INFO] Exclude: src/backend/gpopt/library.ver
[INFO] Exclude: src/backend/utils/misc/etc/slaves
[INFO] Exclude: tools/bin/.rcfile
[INFO] Exclude: tools/bin/postgresql_conf_gp_additions
[INFO] Exclude: tools/doc/**/*
[INFO] Exclude: tools/demo/gpfdist_transform/*.yaml
[INFO] Exclude: tools/bin/gppylib/operations/madlib_depcheck/changelist.yaml
[INFO] Exclude: .git/**
[INFO] Exclude: **/*.md
[INFO] Exclude: **/*.md5
[INFO] Exclude: **/*.json
[INFO] Exclude: **/*.ans
[INFO] Exclude: **/*.sql
[INFO] Exclude: **/*.out
[INFO] Exclude: **/*.po
[INFO] Exclude: **/*.map
[INFO] Exclude: **/*.stderr
[INFO] Exclude: **/*.stdout
[INFO] Exclude: **/*.source
[INFO] Exclude: **/*.txt
[INFO] Exclude: **/*.data
[INFO] Exclude: **/*.csv
[INFO] Exclude: **/*.pm
[INFO] Exclude: **/*.1
[INFO] Exclude: **/*.sample
[INFO] Exclude: **/*.pgc
[INFO] Exclude: **/*.cnf
[INFO] Exclude: **/*.stx
[INFO] Exclude: **/*.gdb
[INFO] Exclude: **/*.patch
[INFO] Exclude: **/*.commit
[INFO] Exclude: **/__init__.py
[INFO] Exclude: **/*README*
[INFO] 3256 resources included (use -debug for more details)
[WARNING] Files with unapproved licenses:
  src/test/feature/Ranger/sql/init_file
  src/test/feature/Ranger/sql/sqlsplitinput
[INFO] ------------------------------------------------------------------------
[INFO] BUILD FAILURE
[INFO] ------------------------------------------------------------------------
[INFO] Total time: 4.539s
[INFO] Finished at: Thu Mar 02 01:55:34 UTC 2017
[INFO] Final Memory: 9M/723M
[INFO] ------------------------------------------------------------------------
[ERROR] Failed to execute goal org.apache.rat:apache-rat-plugin:0.12:check (default-cli) on
project hawq: Too many files with unapproved license: 2 See RAT report in: <https://builds.apache.org/job/HAWQ-rat/90/artifact/target/rat.txt>
-> [Help 1]
[ERROR] 
[ERROR] To see the full stack trace of the errors, re-run Maven with the -e switch.
[ERROR] Re-run Maven using the -X switch to enable full debug logging.
[ERROR] 
[ERROR] For more information about the errors and possible solutions, please read the following
articles:
[ERROR] [Help 1] http://cwiki.apache.org/confluence/display/MAVEN/MojoFailureException
Build step 'Invoke top-level Maven targets' marked build as failure
Archiving artifacts
Compressed 176.55 KB of artifacts by 54.4% relative to #89

Mime
View raw message