hawq-dev mailing list archives

Site index · List index
Message view « Date » · « Thread »
Top « Date » · « Thread »
From Lei Chang <lei_ch...@apache.org>
Subject Re: HAWQ Compile Error
Date Fri, 03 Jun 2016 06:22:36 GMT
Looks you have some network issues, this link might help:
http://dblab.xmu.edu.cn/blog/maven-network-problem/

Cheers
Lei



On Thu, Jun 2, 2016 at 4:14 PM, yuansong <yyuansong@126.com> wrote:

> Hi, When I Complie HAWQ, I can pass the configure check, But Build Failure:
>
>
>
> [ERROR] Plugin org.apache.maven.plugins:maven-jar-plugin:2.4 or one of its
> dependencies could not be resolved: Failed to read artifact descriptor for
> org.apache.maven.plugins:maven-jar-plugin:jar:2.4: Could not transfer
> artifact org.apache.maven.plugins:maven-jar-plugin:pom:2.4 from/to central (
> https://repo.maven.apache.org/maven2): java.security.ProviderException:
> java.security.KeyException -> [Help 1]
> [ERROR] 发送
> [ERROR] To see the full stack trace of the errors, re-run Maven with the
> -e switch.
> [ERROR] Re-run Maven using the -X switch to enable full debug logging.
> [ERROR]
> [ERROR] For more information about the errors and possible solutions,
> please read the following articles:
> [ERROR] [Help 1]
> http://cwiki.apache.org/confluence/display/MAVEN/PluginResolutionException
> make[2]: *** [hawq-mapreduce-tool/target/hawq-mapreduce-tool-1.1.0.jar]
> Error 1
> make[2]: Leaving directory
> `/home/rpmbuild/rpmbuild/BUILD/hawq-2.0.0/contrib/hawq-hadoop'
> make[1]: *** [all] Error 2
> make[1]: Leaving directory
> `/home/rpmbuild/rpmbuild/BUILD/hawq-2.0.0/contrib'
> make: *** [all] Error 2
> error: Bad exit status from /var/tmp/rpm-tmp.qiEM91 (%build)
>
>
> Could somebody help me? Why we use the maven? Thanks!
>
>
>
>
>
>
>
>

Mime
  • Unnamed multipart/alternative (inline, None, 0 bytes)
View raw message