harmony-dev mailing list archives

Site index · List index
Message view « Date » · « Thread »
Top « Date » · « Thread »
From Tim Ellison <t.p.elli...@gmail.com>
Subject Re: Fwd: Build failed in Hudson: Harmony-1.5-head-linux-x86_64 #1012
Date Mon, 13 Dec 2010 11:32:44 GMT
Ok, builds are almost back to normal now.  It required re-installing a
number of dev packages on our build system after the machine was rebuilt.

I'm seeing a single failure in the sanity test
http://s.apache.org/fM

So building, but still not running clean just yet.

Regards,
Tim


On 08/Dec/2010 12:11, Ray Chen wrote:
> Seems the build system got some problems.
> Tim, Mark,
> Do you know how to fix this?
> 
> ---------- Forwarded message ----------
> From: Apache Hudson Server <hudson@hudson.apache.org>
> Date: Wed, Dec 8, 2010 at 7:34 PM
> Subject: Build failed in Hudson: Harmony-1.5-head-linux-x86_64 #1012
> To: tellison@apache.org, alerts@harmony.apache.org, clraychen@gmail.com
> 
> 
> See <
> https://hudson.apache.org/hudson/job/Harmony-1.5-head-linux-x86_64/1012/changes
>>
> 
> Changes:
> 
> [clraychen] Apply another fix for HARMONY-6661: Synchonrize on mutable field
> in Permissions.java readObject() is only reachable by one thread, so remove
> unnecessary synchronized block
> 
> ------------------------------------------
> [...truncated 14567 lines...]
> AU        classlib/modules/portlib/src/main/native/common/unix/makefile
> A         classlib/modules/portlib/src/main/native/common/shared
> AU        classlib/modules/portlib/src/main/native/common/shared/iohelp.c
> AU
>  classlib/modules/portlib/src/main/native/common/shared/exceptions.c
> AU        classlib/modules/portlib/src/main/native/common/shared/jclglob.h
> AU        classlib/modules/portlib/src/main/native/common/shared/strhelp.c
> AU
>  classlib/modules/portlib/src/main/native/common/shared/utf8encode.c
> AU        classlib/modules/portlib/src/main/native/common/shared/libglob.c
> AU
>  classlib/modules/portlib/src/main/native/common/shared/utf8decode.c
> A         classlib/modules/portlib/src/main/native/common/windows
> A
> classlib/modules/portlib/src/main/native/common/windows/windows.x86_64
> AU        classlib/modules/portlib/src/main/native/common/windows/makefile
> A
> classlib/modules/portlib/src/main/native/common/windows/windows.x86
> A         classlib/modules/portlib/src/main/native/pool
> A         classlib/modules/portlib/src/main/native/pool/unix
> AU
>  classlib/modules/portlib/src/main/native/pool/unix/DoxygenSupport.txt
> AU        classlib/modules/portlib/src/main/native/pool/unix/makefile
> A         classlib/modules/portlib/src/main/native/pool/shared
> AU        classlib/modules/portlib/src/main/native/pool/shared/pool.c
> AU        classlib/modules/portlib/src/main/native/pool/shared/pool_cap.c
> A         classlib/modules/portlib/src/main/native/pool/windows
> AU
>  classlib/modules/portlib/src/main/native/pool/windows/DoxygenSupport.txt
> AU        classlib/modules/portlib/src/main/native/pool/windows/makefile
> A         classlib/modules/portlib/src/main/native/thrstub
> A         classlib/modules/portlib/src/main/native/thrstub/unix
> AU        classlib/modules/portlib/src/main/native/thrstub/unix/exports.txt
> AU
>  classlib/modules/portlib/src/main/native/thrstub/unix/DoxygenSupport.txt
> AU        classlib/modules/portlib/src/main/native/thrstub/unix/makefile
> A         classlib/modules/portlib/src/main/native/thrstub/shared
> AU        classlib/modules/portlib/src/main/native/thrstub/shared/hythread.c
> AU        classlib/modules/portlib/src/main/native/thrstub/shared/hythread.h
> A         classlib/modules/portlib/src/main/native/thrstub/windows
> A         classlib/modules/portlib/src/main/native/thrstub/windows/hythr.rc
> AU
>  classlib/modules/portlib/src/main/native/thrstub/windows/DoxygenSupport.txt
> A         classlib/modules/portlib/src/main/native/thrstub/windows/hythr.def
> AU        classlib/modules/portlib/src/main/native/thrstub/windows/makefile
> A         classlib/modules/portlib/make
> AU        classlib/modules/portlib/build.xml
> AU        classlib/modules/README.txt
> AU        classlib/README.txt
> A         classlib/support
> AU        classlib/support/.classpath
> A         classlib/support/META-INF
> AU        classlib/support/META-INF/MANIFEST.MF
> AU        classlib/support/.project
> A         classlib/support/src
> A         classlib/support/src/test
> A         classlib/support/src/test/java
> A         classlib/support/src/test/java/tests
> A         classlib/support/src/test/java/tests/resources
> AU
>  classlib/support/src/test/java/tests/resources/hyts_constru(OD).bin
> AU        classlib/support/src/test/java/tests/resources/TestCodeSigners.jar
> AU        classlib/support/src/test/java/tests/resources/Modified_Class.jar
> AU        classlib/support/src/test/java/tests/resources/Broken_manifest.jar
> AU        classlib/support/src/test/java/tests/resources/Harmony.GIF
> AU        classlib/support/src/test/java/tests/resources/hyts_checkInput.txt
> A         classlib/support/src/test/java/tests/resources/subfolder
> A         classlib/support/src/test/java/tests/resources/subfolder/tests
> A
> classlib/support/src/test/java/tests/resources/subfolder/tests/resources
> AU
>  classlib/support/src/test/java/tests/resources/subfolder/tests/resources/hyts_resource.properties
> A         classlib/support/src/test/java/tests/resources/Package
> AU
>  classlib/support/src/test/java/tests/resources/Package/hyts_no_entry.jar
> AU
>  classlib/support/src/test/java/tests/resources/Package/hyts_all_attributes.jar
> AU        classlib/support/src/test/java/tests/resources/Package/hyts_pq.jar
> AU        classlib/support/src/test/java/tests/resources/Package/hyts_c.jar
> AU
>  classlib/support/src/test/java/tests/resources/Package/hyts_no_attributes.jar
> AU        classlib/support/src/test/java/tests/resources/Package/hyts_d.jar
> AU        classlib/support/src/test/java/tests/resources/Package/hyts_d1.jar
> AU        classlib/support/src/test/java/tests/resources/Package/hyts_d2.jar
> AU
>  classlib/support/src/test/java/tests/resources/Package/hyts_some_attributes.jar
> AU        classlib/support/src/test/java/tests/resources/hyts_signed.jar
> AU        classlib/support/src/test/java/tests/resources/Harmony.jpg
> AU
>  classlib/support/src/test/java/tests/resources/Modified_Manifest_MainAttributes.jar
> AU        classlib/support/src/test/java/tests/resources/Integrate.jar
> AU
>  classlib/support/src/test/java/tests/resources/hyts_PropertiesTest.properties
> AU        classlib/support/src/test/java/tests/resources/hyts_available.tst
> AU        classlib/support/src/test/java/tests/resources/Harmony.png
> AU        classlib/support/src/test/java/tests/resources/hyts_Bar.ser
> A         classlib/support/src/test/java/tests/resources/GZIPInputStream
> AU
>  classlib/support/src/test/java/tests/resources/GZIPInputStream/hyts_gInput.txt.gz
> A         classlib/support/src/test/java/tests/resources/manifest
> AU
>  classlib/support/src/test/java/tests/resources/manifest/hyts_MANIFEST.MF
> AU
>  classlib/support/src/test/java/tests/resources/Modified_Manifest_EntryAttributes.jar
> A         classlib/support/src/test/java/tests/resources/morestuff
> AU
>  classlib/support/src/test/java/tests/resources/morestuff/hyts_patch.jar
> AU
>  classlib/support/src/test/java/tests/resources/morestuff/hyts_patch2.jar
> AU        classlib/support/src/test/java/tests/resources/hyts_att.jar
> AU
>  classlib/support/src/test/java/tests/resources/Modified_SF_EntryAttributes.jar
> AU        classlib/support/src/test/java/tests/resources/Broken_entry.jar
> AU        classlib/support/src/test/java/tests/resources/hyts_compressD.bin
> AU        classlib/support/src/test/java/tests/resources/hyts_htmltest.html
> AU        classlib/support/src/test/java/tests/resources/Created_by_1_4.jar
> AU        classlib/support/src/test/java/tests/resources/hyts_patch.jar
> AU        classlib/support/src/test/java/tests/resources/hyts_Foo.ser
> AU
>  classlib/support/src/test/java/tests/resources/Inserted_Entry_Manifest_with_DigestCode.jar
> AU
>  classlib/support/src/test/java/tests/resources/hyts_compDiction.bin
> AU
>  classlib/support/src/test/java/tests/resources/hyts_constru(ODI).bin
> AU
>  classlib/support/src/test/java/tests/resources/hyts_resource.properties
> AU        classlib/support/src/test/java/tests/resources/hyts_security.jar
> AU
>  classlib/support/src/test/java/tests/resources/EmptyEntries_signed.jar
> AU
>  classlib/support/src/test/java/tests/resources/hyts_missingclass.ser
> AU
>  classlib/support/src/test/java/tests/resources/Inserted_Entry_Manifest.jar
> AU        classlib/support/src/test/java/tests/resources/hyts_patch2.jar
> A         classlib/support/src/test/java/tests/resources/JarIndex
> AU
>  classlib/support/src/test/java/tests/resources/JarIndex/hyts_11.jar
> AU
>  classlib/support/src/test/java/tests/resources/JarIndex/hyts_12.jar
> AU
>  classlib/support/src/test/java/tests/resources/JarIndex/hyts_21.jar
> AU
>  classlib/support/src/test/java/tests/resources/JarIndex/hyts_13.jar
> AU
>  classlib/support/src/test/java/tests/resources/JarIndex/hyts_22.jar
> AU
>  classlib/support/src/test/java/tests/resources/JarIndex/hyts_31.jar
> AU
>  classlib/support/src/test/java/tests/resources/JarIndex/hyts_14.jar
> AU
>  classlib/support/src/test/java/tests/resources/JarIndex/hyts_23.jar
> AU
>  classlib/support/src/test/java/tests/resources/JarIndex/hyts_32.jar
> AU
>  classlib/support/src/test/java/tests/resources/JarIndex/hyts_41.jar
> AU
>  classlib/support/src/test/java/tests/resources/JarIndex/hyts_33.jar
> AU
>  classlib/support/src/test/java/tests/resources/JarIndex/hyts_42.jar
> AU
>  classlib/support/src/test/java/tests/resources/JarIndex/hyts_22-new.jar
> AU        classlib/support/src/test/java/tests/resources/hyts_mainClass.ser
> AU        classlib/support/src/test/java/tests/resources/hyts_manifest1.jar
> AU        classlib/support/src/test/java/tests/resources/hyts_ZipFile.zip
> AU        classlib/support/src/test/java/tests/resources/hyts_constru(O).bin
> AU        classlib/support/src/test/java/tests/resources/hyts_flushed.jar
> A         classlib/support/src/test/java/tests/support
> AU
>  classlib/support/src/test/java/tests/support/Support_PermissionCollection.java
> AU
>  classlib/support/src/test/java/tests/support/Support_NetworkInterface.java
> AU        classlib/support/src/test/java/tests/support/Support_Proxy_I2.java
> A         classlib/support/src/test/java/tests/support/resource
> AU
>  classlib/support/src/test/java/tests/support/resource/Support_Resources.java
> AU
>  classlib/support/src/test/java/tests/support/Support_ProviderJCE.java
> AU
>  classlib/support/src/test/java/tests/support/Support_URLConnector.java
> AU
>  classlib/support/src/test/java/tests/support/Support_PortManager.java
> AU
>  classlib/support/src/test/java/tests/support/Support_HttpServerSocket.java
> AU        classlib/support/src/test/java/tests/support/Streams.java
> AU        classlib/support/src/test/java/tests/support/Support_Exec.java
> AU
>  classlib/support/src/test/java/tests/support/Support_ProcessReadWriteTest.java
> AU
>  classlib/support/src/test/java/tests/support/Support_GetResource.java
> AU
>  classlib/support/src/test/java/tests/support/Support_TestResource.java
> AU        classlib/support/src/test/java/tests/support/Support_Socket.java
> AU
>  classlib/support/src/test/java/tests/support/Support_StringReader.java
> AU        classlib/support/src/test/java/tests/support/Support_TimeZone.java
> AU
>  classlib/support/src/test/java/tests/support/Support_CollectionTest.java
> AU
>  classlib/support/src/test/java/tests/support/Support_UnmodifiableMapTest.java
> AU
>  classlib/support/src/test/java/tests/support/Support_AvailTest.java
> AU
>  classlib/support/src/test/java/tests/support/Support_ProviderTrust.java
> AU        classlib/support/src/test/java/tests/support/Support_Jetty.java
> AU        classlib/support/src/test/java/tests/support/Support_MapTest2.java
> AU
>  classlib/support/src/test/java/tests/support/Support_ProviderRSA.java
> AU
>  classlib/support/src/test/java/tests/support/Support_HttpTests.java
> AU
>  classlib/support/src/test/java/tests/support/Support_StringWriter.java
> AU
>  classlib/support/src/test/java/tests/support/Support_TestResource_fr_FR.java
> AU
>  classlib/support/src/test/java/tests/support/Support_DummyPKCS12Keystore.java
> AU
>  classlib/support/src/test/java/tests/support/Support_HttpServer.java
> AU
>  classlib/support/src/test/java/tests/support/Support_Configuration.java
> AU
>  classlib/support/src/test/java/tests/support/Support_TestResource_en.java
> AU
>  classlib/support/src/test/java/tests/support/Support_Proxy_ParentException.java
> AU
>  classlib/support/src/test/java/tests/support/Support_Proxy_SubException.java
> AU        classlib/support/src/test/java/tests/support/Support_Proxy_I1.java
> AU
>  classlib/support/src/test/java/tests/support/Support_UnmodifiableCollectionTest.java
> AU        classlib/support/src/test/java/tests/support/Support_ListTest.java
> AU
>  classlib/support/src/test/java/tests/support/Support_TestResource_fr_FR_VAR.java
> AU
>  classlib/support/src/test/java/tests/support/Support_TestResource_fr.java
> AU
>  classlib/support/src/test/java/tests/support/Support_ServerSocket.java
> AU
>  classlib/support/src/test/java/tests/support/Support_TestResource_en_US.java
> AU        classlib/support/src/test/java/tests/support/Support_Field.java
> AU
>  classlib/support/src/test/java/tests/support/Support_PlatformFile.java
> AU
>  classlib/support/src/test/java/tests/support/Support_HttpSocket.java
> AU
>  classlib/support/src/test/java/tests/support/Support_DeleteOnExitTest.java
> AU        classlib/support/src/test/java/tests/support/Support_GetLocal.java
> AU
>  classlib/support/src/test/java/tests/support/Support_HttpConnector.java
> AU
>  classlib/support/src/test/java/tests/support/Support_TestProvider.java
> AU        classlib/support/src/test/java/tests/support/Support_SetTest.java
> A         classlib/support/src/test/java/tests/util
> AU
>  classlib/support/src/test/java/tests/util/CallVerificationStack.java
> AU        classlib/support/src/test/java/tests/util/SerializationTester.java
> AU        classlib/support/src/test/java/tests/util/SomeTests.java
> A         classlib/support/src/test/java/org
> A         classlib/support/src/test/java/org/apache
> A         classlib/support/src/test/java/org/apache/harmony
> A         classlib/support/src/test/java/org/apache/harmony/testframework
> AU
>  classlib/support/src/test/java/org/apache/harmony/testframework/CharWrapperTester.java
> AU
>  classlib/support/src/test/java/org/apache/harmony/testframework/WrapperTester.java
> AU
>  classlib/support/src/test/java/org/apache/harmony/testframework/CharSinkTester.java
> AU
>  classlib/support/src/test/java/org/apache/harmony/testframework/SinkTester.java
> A
> classlib/support/src/test/java/org/apache/harmony/testframework/serialization
> AU
>  classlib/support/src/test/java/org/apache/harmony/testframework/serialization/SerializationTest.java
> A         classlib/support/src/test/resources
> A         classlib/support/src/test/resources/config
> AU        classlib/support/src/test/resources/config/jcltest-excludes.xml
> AU        classlib/support/src/test/resources/config/localhosttest.ini
> AU        classlib/support/src/test/resources/config/excludes.xsd
> AU        classlib/support/src/test/resources/config/testing.policy
> A         classlib/support/src/test/resources/libs
> AU        classlib/support/src/test/resources/hyts_Foo.c
> A         classlib/support/.settings
> AU        classlib/support/.settings/org.eclipse.jdt.core.prefs
> AU        classlib/support/.settings/org.eclipse.jdt.ui.prefs
> AU        classlib/support/.settings/org.eclipse.pde.core.prefs
> A         classlib/make
> AU        classlib/make/run-test.xml
> AU        classlib/make/depends.xml
> A         classlib/make/resources
> AU        classlib/make/resources/README-snapshot.txt
> AU        classlib/make/test.properties
> AU        classlib/make/make.xml
> AU        classlib/make/depends.properties
> AU        classlib/RUNNING-TESTS.txt
> AU        classlib/build.xml
> AU        README
> AU        build.xml
> A         ibm-v4
> A         ibm-v4/include
> AU        ibm-v4/include/jvmti.h
> AU        ibm-v4/include/jvmti_types.h
> AU        ibm-v4/include/jni.h
> AU        ibm-v4/include/jni_types.h
> A         ibm-v4/make
> A         ibm-v4/make/classlib.override.file.patterns
> AU        ibm-v4/make/build.properties
> AU        ibm-v4/build.xml
>  U        .
> At revision 1043361
> [harmony] $ ant bundle-src clean fetch-depends snapshot
> FATAL: command execution failed.Maybe you need to configure the job to
> choose one of your Ant installations?
> java.io.IOException: Cannot run program "ant" (in directory "<
> https://hudson.apache.org/hudson/job/Harmony-1.5-head-linux-x86_64/ws/harmony")>:
> java.io.IOException: error=2, No such file or directory
>        at java.lang.ProcessBuilder.start(ProcessBuilder.java:475)
>        at hudson.Proc$LocalProc.<init>(Proc.java:192)
>        at hudson.Proc$LocalProc.<init>(Proc.java:164)
>        at hudson.Launcher$LocalLauncher.launch(Launcher.java:638)
>        at hudson.Launcher$ProcStarter.start(Launcher.java:273)
>        at hudson.Launcher$RemoteLaunchCallable.call(Launcher.java:793)
>        at hudson.Launcher$RemoteLaunchCallable.call(Launcher.java:767)
>        at hudson.remoting.UserRequest.perform(UserRequest.java:114)
>        at hudson.remoting.UserRequest.perform(UserRequest.java:48)
>        at hudson.remoting.Request$2.run(Request.java:270)
>        at
> java.util.concurrent.Executors$RunnableAdapter.call(Executors.java:471)
>        at java.util.concurrent.FutureTask$Sync.innerRun(FutureTask.java:334)
>        at java.util.concurrent.FutureTask.run(FutureTask.java:166)
>        at
> java.util.concurrent.ThreadPoolExecutor.runWorker(ThreadPoolExecutor.java:1110)
>        at
> java.util.concurrent.ThreadPoolExecutor$Worker.run(ThreadPoolExecutor.java:603)
>        at java.lang.Thread.run(Thread.java:636)
> Caused by: java.io.IOException: java.io.IOException: error=2, No such file
> or directory
>        at java.lang.UNIXProcess.<init>(UNIXProcess.java:164)
>        at java.lang.ProcessImpl.start(ProcessImpl.java:81)
>        at java.lang.ProcessBuilder.start(ProcessBuilder.java:468)
>        ... 15 more
> [FINDBUGS] Skipping publisher since build result is FAILURE
> Archiving artifacts
> Recording test results
> Recording fingerprints
> 
> 
> 
> 

Mime
View raw message