harmony-dev mailing list archives

Site index · List index
Message view « Date » · « Thread »
Top « Date » · « Thread »
From Sian January <sianjanu...@googlemail.com>
Subject Fwd: Build failed in Hudson: Harmony-1.6-head-linux-x86_64 #14
Date Wed, 04 Mar 2009 14:05:22 GMT
Looking at the test failures for the Java 6 Hudson build in more
detail it looks like ASM isn't being found at runtime, but the jar is
being downloaded ok according to the console output and the build
files look the same as in the 1.5 stream so I'm not quite sure what
the problem is.  Any thoughts?

Also I'm just thinking maybe we should include "1.5" or "1.6" in the
names for the build artifacts if we're going to make both available?

Thanks,

Sian


---------- Forwarded message ----------
From: Apache Hudson Server <hudson@hudson.zones.apache.org>
Date: 2009/3/3
Subject: Build failed in Hudson: Harmony-1.6-head-linux-x86_64 #14
To: tellison@apache.org, alerts@harmony.apache.org


See http://hudson.zones.apache.org/hudson/job/Harmony-1.6-head-linux-x86_64/14/changes

Changes:

[hindessm] Hide z/OS clutter.

------------------------------------------
[...truncated 3919 lines...]
    [copy] Copying 1 file to
http://hudson.zones.apache.org/hudson/job/Harmony-1.6-head-linux-x86_64/ws/harmony/working_jdktools/deploy/jdk/bin
    [copy] Copying 1 file to
http://hudson.zones.apache.org/hudson/job/Harmony-1.6-head-linux-x86_64/ws/harmony/working_jdktools/deploy/jdk/bin
    [copy] Copying 1 file to
http://hudson.zones.apache.org/hudson/job/Harmony-1.6-head-linux-x86_64/ws/harmony/working_jdktools/deploy/jdk/bin
    [copy] Copying 1 file to
http://hudson.zones.apache.org/hudson/job/Harmony-1.6-head-linux-x86_64/ws/harmony/working_jdktools/deploy/jdk/bin
    [copy] Copying 1 file to
http://hudson.zones.apache.org/hudson/job/Harmony-1.6-head-linux-x86_64/ws/harmony/working_jdktools/deploy/jdk/bin
    [copy] Copying 1 file to
http://hudson.zones.apache.org/hudson/job/Harmony-1.6-head-linux-x86_64/ws/harmony/working_jdktools/deploy/jdk/jre/bin
    [copy] Copying 1 file to
http://hudson.zones.apache.org/hudson/job/Harmony-1.6-head-linux-x86_64/ws/harmony/working_jdktools/deploy/jdk/jre/bin
    [copy] Copying 1 file to
http://hudson.zones.apache.org/hudson/job/Harmony-1.6-head-linux-x86_64/ws/harmony/working_jdktools/deploy/jdk/jre/bin
    [copy] Copying 1 file to
http://hudson.zones.apache.org/hudson/job/Harmony-1.6-head-linux-x86_64/ws/harmony/working_jdktools/deploy/jdk/jre/bin

-copy-native-exe-windows:

-copy-native-progdb:

-copy-native-data:
    [copy] Copying 3 files to
http://hudson.zones.apache.org/hudson/job/Harmony-1.6-head-linux-x86_64/ws/harmony/working_jdktools/deploy/jdk/bin/data

build-native:

build:

build:

assemble-stuff:
   [mkdir] Created dir:
http://hudson.zones.apache.org/hudson/job/Harmony-1.6-head-linux-x86_64/ws/harmony/target/hdk
    [copy] Copying 60 files to
http://hudson.zones.apache.org/hudson/job/Harmony-1.6-head-linux-x86_64/ws/harmony/target/hdk
    [copy] Copied 10 empty directories to 3 empty directories under
http://hudson.zones.apache.org/hudson/job/Harmony-1.6-head-linux-x86_64/ws/harmony/target/hdk
    [copy] Copying 326 files to
http://hudson.zones.apache.org/hudson/job/Harmony-1.6-head-linux-x86_64/ws/harmony/target/hdk
    [copy] Copying 28 files to
http://hudson.zones.apache.org/hudson/job/Harmony-1.6-head-linux-x86_64/ws/harmony/target/hdk/jdk

chmod-stuff:

assemble-artifacts:

build:

assemble-hdk-doc:
    [copy] Copying 2 files to
http://hudson.zones.apache.org/hudson/job/Harmony-1.6-head-linux-x86_64/ws/harmony/target/hdk

bundle-hdk-tgz:
     [tar] Building tar:
http://hudson.zones.apache.org/hudson/job/Harmony-1.6-head-linux-x86_64/14/artifact/harmony/target/apache-harmony-hdk-r749596-linux-x86_64-64-snapshot.tar.gz

bundle-hdk-zip:

bundle-hdk:

assemble-jdk-doc:
    [copy] Copying 4 files to
http://hudson.zones.apache.org/hudson/job/Harmony-1.6-head-linux-x86_64/ws/harmony/target/hdk/jdk

bundle-jdk-tgz:
     [tar] Building tar:
http://hudson.zones.apache.org/hudson/job/Harmony-1.6-head-linux-x86_64/14/artifact/harmony/target/apache-harmony-jdk-r749596-linux-x86_64-64-snapshot.tar.gz

bundle-jdk-zip:

bundle-jdk:

assemble-jre-doc:
    [copy] Copying 4 files to
http://hudson.zones.apache.org/hudson/job/Harmony-1.6-head-linux-x86_64/ws/harmony/target/hdk/jdk/jre

bundle-jre-tgz:
     [tar] Building tar:
http://hudson.zones.apache.org/hudson/job/Harmony-1.6-head-linux-x86_64/14/artifact/harmony/target/apache-harmony-jre-r749596-linux-x86_64-64-snapshot.tar.gz

bundle-jre-zip:

bundle-jre:

snapshot:

BUILD SUCCESSFUL
Total time: 13 minutes 11 seconds
[working_classlib] $ ant -file build.xml -Dbuild.module=pack200
-Djava6=true -Dtest.jre.home=$WORKSPACE/harmony/target/hdk/jdk/jre
test
Buildfile: build.xml

-init-hdk:

test:
    [echo]
    [echo] ========================================
    [echo] Testing class libraries...
    [echo] ========================================

clean-test-output:
  [delete] Deleting directory
http://hudson.zones.apache.org/hudson/job/Harmony-1.6-head-linux-x86_64/ws/harmony/working_classlib/build/test_report

copy-test-resources:

check-support-jars:

-check:
    [echo] Checking for depends/jars/yoko-1.0/yoko.jar
    [echo] Checking for depends/jars/yoko-1.0/yoko-core.jar
    [echo] Checking for depends/jars/yoko-1.0/yoko-rmi-impl.jar
    [echo] Checking for depends/jars/yoko-1.0/yoko-rmi-spec.jar
    [echo] Checking for depends/jars/bcel-5.2/bcel-5.2.jar
    [echo] Checking for depends/jars/xalan-j_2.7.0/xalan.jar
    [echo] Checking for depends/jars/xerces_2.9.1/xerces.zip
    [echo] Checking for depends/jars/xmlsec_1.4.0/xmlsec.zip
    [echo] Checking for depends/jars/junit_4.4/junit.jar
    [echo] Checking for depends/jars/bcprov-jdk15-141/bcprov.jar
    [echo] Checking for depends/jars/mx4j_3.0.2/mx4j.zip
    [echo] Checking for depends/jars/jetty/jetty-6.0.0.jar
    [echo] Checking for depends/jars/jetty/jetty-util-6.0.0.jar
    [echo] Checking for depends/jars/jetty/servlet-api-2.5-6.0.0.jar
    [echo] Checking for depends/dejavu-fonts/dejavu-ttf-2.18-1.zip
    [echo] Checking for depends/jars/derby-10.3.1.4/derby.jar
    [echo] Checking for depends/jars/asm-3.1/asm-3.1.jar

-select-win-deps-x86_64:

-select-win-deps-x86:

-really-check-win:

-check-win:

-check-unix:
    [echo] Checking for system file /usr/include/lcms.h
    [echo] Checking for system file /usr/include/png.h
    [echo] Checking for system file /usr/include/jconfig.h

-extract-props:

-extract-mx4j:

-extract-dejavu-fonts:

-extract-xerces:

-extract:

check:

compile-support:

support-jar:

-get-test-vm-output:

test-jre-vm-info:
    [echo] hy.test.vm.name = drl

test-modules:

compile-java:
    [echo] Compiling PACK200 classes

copy-resources:

svn-info:

build-jar:

build:

copy-test-resources:
   [mkdir] Created dir:
http://hudson.zones.apache.org/hudson/job/Harmony-1.6-head-linux-x86_64/ws/harmony/working_classlib/modules/pack200/bin/test
    [copy] Copying 16 files to
http://hudson.zones.apache.org/hudson/job/Harmony-1.6-head-linux-x86_64/ws/harmony/working_classlib/modules/pack200/bin/test

compile-tests:
    [echo] Compiling PACK200 tests
   [javac] Compiling 25 source files to
http://hudson.zones.apache.org/hudson/job/Harmony-1.6-head-linux-x86_64/ws/harmony/working_classlib/modules/pack200/bin/test
   [javac] Since fork is false, ignoring memoryMaximumSize setting

prepare-exclude:

run-tests:
   [mkdir] Created dir:
http://hudson.zones.apache.org/hudson/job/Harmony-1.6-head-linux-x86_64/ws/harmony/working_classlib/build/test_report
    [echo] Running PACK200 tests
   [junit] Running org.apache.harmony.pack200.tests.ArchiveTest
   [junit] Tests run: 3, Failures: 0, Errors: 3, Time elapsed: 2.366 sec
   [junit] TEST org.apache.harmony.pack200.tests.ArchiveTest FAILED
   [junit] Running org.apache.harmony.pack200.tests.BHSDCodecTest
   [junit] Tests run: 2, Failures: 0, Errors: 0, Time elapsed: 0.013 sec
   [junit] Running org.apache.harmony.pack200.tests.CodecEncodingTest
   [junit] Tests run: 2, Failures: 0, Errors: 0, Time elapsed: 0.008 sec
   [junit] Running org.apache.harmony.pack200.tests.CodecTest
   [junit] Tests run: 9, Failures: 0, Errors: 0, Time elapsed: 0.017 sec
   [junit] Running org.apache.harmony.pack200.tests.PopulationCodecTest
   [junit] Tests run: 1, Failures: 0, Errors: 0, Time elapsed: 0.007 sec
   [junit] Running org.apache.harmony.unpack200.tests.ArchiveTest
   [junit] Tests run: 9, Failures: 0, Errors: 0, Time elapsed: 1.948 sec
   [junit] Running org.apache.harmony.unpack200.tests.AttributeLayoutMapTest
   [junit] Tests run: 1, Failures: 0, Errors: 0, Time elapsed: 0.78 sec
   [junit] Running org.apache.harmony.unpack200.tests.AttributeLayoutTest
   [junit] Tests run: 6, Failures: 0, Errors: 0, Time elapsed: 0.01 sec
   [junit] Running org.apache.harmony.unpack200.tests.BandSetTest
   [junit] Tests run: 8, Failures: 0, Errors: 0, Time elapsed: 0.009 sec
   [junit] Running org.apache.harmony.unpack200.tests.BcBandsTest
   [junit] Tests run: 25, Failures: 0, Errors: 0, Time elapsed: 0.053 sec
   [junit] Running org.apache.harmony.unpack200.tests.CPUTF8Test
   [junit] Tests run: 1, Failures: 0, Errors: 0, Time elapsed: 0.005 sec
   [junit] Running org.apache.harmony.unpack200.tests.ClassBandsTest
   [junit] Tests run: 2, Failures: 0, Errors: 0, Time elapsed: 0.009 sec
   [junit] Running org.apache.harmony.unpack200.tests.ClassVersionTest
   [junit] Tests run: 3, Failures: 0, Errors: 0, Time elapsed: 0.007 sec
   [junit] Running org.apache.harmony.unpack200.tests.CodeAttributeTest
   [junit] Tests run: 3, Failures: 0, Errors: 0, Time elapsed: 0.008 sec
   [junit] Running org.apache.harmony.unpack200.tests.ICTupleTest
   [junit] Tests run: 2, Failures: 0, Errors: 0, Time elapsed: 0.005 sec
   [junit] Running
org.apache.harmony.unpack200.tests.SegmentConstantPoolArrayCacheTest
   [junit] Tests run: 3, Failures: 0, Errors: 0, Time elapsed: 0.007 sec
   [junit] Running org.apache.harmony.unpack200.tests.SegmentConstantPoolTest
   [junit] Tests run: 3, Failures: 0, Errors: 0, Time elapsed: 0.007 sec
   [junit] Running org.apache.harmony.unpack200.tests.SegmentOptionsTest
   [junit] Tests run: 1, Failures: 0, Errors: 0, Time elapsed: 0.006 sec
   [junit] Running org.apache.harmony.unpack200.tests.SegmentTest
   [junit] Tests run: 3, Failures: 0, Errors: 0, Time elapsed: 0.013 sec
   [junit] Running org.apache.harmony.unpack200.tests.SegmentUtilsTest
   [junit] Tests run: 3, Failures: 0, Errors: 0, Time elapsed: 0.007 sec
   [junit] Running org.apache.harmony.unpack200.tests.bytecode.ByteCodeTest
   [junit] Tests run: 1, Failures: 0, Errors: 0, Time elapsed: 0.005 sec
   [junit] Running
org.apache.harmony.unpack200.tests.bytecode.ClassFileEntryTest
   [junit] Tests run: 8, Failures: 0, Errors: 0, Time elapsed: 0.078 sec
   [junit] Running org.apache.harmony.unpack200.tests.bytecode.ConstantPoolTest
   [junit] Tests run: 4, Failures: 0, Errors: 0, Time elapsed: 0.007 sec
   [junit] Tests FAILED

touch-failures-file:

touch-errors-file:

-test-module:

-check-for-empty:

-process-empty:

process-empty:

full-report:
[junitreport] Processing
http://hudson.zones.apache.org/hudson/job/Harmony-1.6-head-linux-x86_64/ws/harmony/working_classlib/build/test_report/TESTS-TestSuites.xml
 to /tmp/null317184156
[junitreport] Loading stylesheet
jar:file:/usr/share/ant/lib/ant-junit.jar!/org/apache/tools/ant/taskdefs/optional/junit/xsl/junit-frames.xsl
[junitreport] Transform time: 3381ms
[junitreport] Deleting: /tmp/null317184156
    [echo] The test report is in
http://hudson.zones.apache.org/hudson/job/Harmony-1.6-head-linux-x86_64/ws/harmony/working_classlib/build/test_report/html/index.html

short-report:

gen-report:

check-test-result:

BUILD FAILED
http://hudson.zones.apache.org/hudson/job/Harmony-1.6-head-linux-x86_64/ws/harmony/working_classlib/build.xml
:174: The following error occurred while executing this line:
http://hudson.zones.apache.org/hudson/job/Harmony-1.6-head-linux-x86_64/ws/harmony/working_classlib/make/build-test.xml
:139: There were test errors.

Total time: 14 seconds
Recording fingerprints
Recording test results




-- 
Unless stated otherwise above:
IBM United Kingdom Limited - Registered in England and Wales with number 741598.
Registered office: PO Box 41, North Harbour, Portsmouth, Hampshire PO6 3AU

Mime
View raw message