harmony-dev mailing list archives

Site index · List index
Message view « Date » · « Thread »
Top « Date » · « Thread »
From "chunrong lai" <chunrong...@gmail.com>
Subject Re: [build-test alert] FAILED Linux x86: hdk debug
Date Mon, 04 Aug 2008 16:48:14 GMT
 I can see all of the 4 platforms reporting error message as

     [java] compile-java:
     [java]      [echo] Compiling TOOLS classes
     [java]  [hy.javac] Compiling 76 source files to
C:\harmony.cc\infra\build\checkouts\hdk\working_jdktools\build\classes
     [java]  [hy.javac] Since fork is false, ignoring memoryMaximumSize
setting
     [java]  [hy.javac] ----------
     [java]  [hy.javac] 1. ERROR in
C:\harmony.cc\infra\build\checkouts\hdk\working_jdktools\modules\tools\src\main\java\org\apache\harmony\tools\policytool\view\GrantEntryEditFormDialog.java
     [java]  [hy.javac]  (at line 166)
     [java]  [hy.javac] return new PermissionEditFormDialog(
GrantEntryEditFormDialog.this, ownerEditorPanel, selectedEntity,
tempPermissionList );
     [java]  [hy.javac]            ^^^^^^^^^^^^^^^^^^^^^^^^
     [java]  [hy.javac] PermissionEditFormDialog cannot be resolved to a
type
     [java]  [hy.javac] ----------
     [java]  [hy.javac] 1 problem (1 error)
 You can see similar info by clicking the "Execution
log<http://people.apache.org/~chunrong/harmony-integrity/windows_x86/hdk/execution_log.html>"
from
the error items of http://people.apache.org/~chunrong/harmony-integrity/.

 So far my understanding is that there are some errors in the patch.


On 8/5/08, Oliver Deakin <oliver.deakin@googlemail.com> wrote:
>
> Hi,
>
> I see that the policytool patch appears to have broken the build. Can
> anyone tell me what the actual build error is please? It builds
> incrementally and from a clean workspace just fine for me (under Windows).
>
> Thanks,
> Oliver
>
> nomail@intel.com wrote:
>
>> BUILD FAILED:
>>        Ant Error Message:
>> /home/laichunrong/harmony.regularcc/infra/scripts/cc-exec-adaptor.xml:68:
>> The following error occurred while executing this line:
>> /home/laichunrong/harmony.regularcc/infra/adaptors/hdk/adaptor.xml:39: The
>> following error occurred while executing this line:
>> /home/laichunrong/harmony.regularcc/infra/scripts/framework.xml:163: Java
>> returned: 1
>>
>> Date of build:  2008-08-04 23:09:40 +0800
>> Time to build:  10 minutes 55 seconds
>> Last changed:   08/04/2008 22:57:13
>> Last log entry: Apply patch for HARMONY-5927 (Progress on policytool)
>>
>> ***********************************************************
>> Errors/Warnings:        (11)
>>            [cc] /usr/bin/ar: creating libencoder.a
>> [cc] /usr/bin/ar: creating libport.a
>> [cc] /usr/bin/ar: creating libverifier.a
>> BUILD FAILED
>> /home/laichunrong/harmony.regularcc/infra/build/checkouts/hdk/build.xml:504:
>> The following error occurred while executing this line:
>> /home/laichunrong/harmony.regularcc/infra/build/checkouts/hdk/working_jdktools/build.xml:82:
>> The following error occurred while executing this line:
>> /home/laichunrong/harmony.regularcc/infra/build/checkouts/hdk/working_jdktools/make/build-java.xml:49:
>> The following error occurred while executing this line:
>> /home/laichunrong/harmony.regularcc/infra/build/checkouts/hdk/common_resources/make/properties.xml:242:
>> The following error occurred while executing this line:
>> /home/laichunrong/harmony.regularcc/infra/build/checkouts/hdk/working_jdktools/modules/tools/build.xml:92:
>> Compile failed; see the compiler error output for details.
>> Total time: 9 minutes 32 seconds
>> The execution FAILED with the following exception:
>> The following error occurred while executing this line:
>> /home/laichunrong/harmony.regularcc/infra/adaptors/hdk/adaptor.xml:39: The
>> following error occurred while executing this line:
>> /home/laichunrong/harmony.regularcc/infra/scripts/framework.xml:163: Java
>> returned: 1
>>
>> ***********************************************************
>> Unit Tests: (0)
>>        No Tests Run: This project doesn't have any tests
>>
>> ***********************************************************
>> Modifications since last successful build:      (9)
>>            modified odeakin
>>  /harmony/enhanced/jdktools/trunk/modules/tools/src/main/java/org/apache/harmony/tools/policytool/view/ListAndEditPanel.java
>> 08/04/2008 22:57:13 Apply patch for HARMONY-5927 (Progress on policytool)
>> modified odeakin
>>  /harmony/enhanced/jdktools/trunk/modules/tools/src/main/java/org/apache/harmony/tools/policytool/model/Principal.java
>> 08/04/2008 22:57:13 Apply patch for HARMONY-5927 (Progress on policytool)
>> modified odeakin
>>  /harmony/enhanced/jdktools/trunk/modules/tools/src/main/java/org/apache/harmony/tools/policytool/view/GrantEntryEditFormDialog.java
>> 08/04/2008 22:57:13 Apply patch for HARMONY-5927 (Progress on policytool)
>> modified odeakin
>>  /harmony/enhanced/jdktools/trunk/modules/tools/src/main/java/org/apache/harmony/tools/policytool/control/Controller.java
>> 08/04/2008 22:57:13 Apply patch for HARMONY-5927 (Progress on policytool)
>> modified odeakin
>>  /harmony/enhanced/jdktools/trunk/modules/tools/src/main/java/org/apache/harmony/tools/policytool/view/PrincipalEditFormDialog.java
>> 08/04/2008 22:57:13 Apply patch for HARMONY-5927 (Progress on policytool)
>> modified odeakin
>>  /harmony/enhanced/jdktools/trunk/modules/tools/src/main/java/org/apache/harmony/tools/policytool/model/Permission.java
>> 08/04/2008 22:57:13 Apply patch for HARMONY-5927 (Progress on policytool)
>> modified odeakin
>>  /harmony/enhanced/jdktools/trunk/modules/tools/src/main/java/org/apache/harmony/tools/policytool/view/BaseFormDialog.java
>> 08/04/2008 22:57:13 Apply patch for HARMONY-5927 (Progress on policytool)
>> modified odeakin
>>  /harmony/enhanced/jdktools/trunk/modules/tools/src/main/java/org/apache/harmony/tools/policytool/view/GraphicalEditorPanel.java
>> 08/04/2008 22:57:13 Apply patch for HARMONY-5927 (Progress on policytool)
>> modified odeakin
>>  /harmony/enhanced/jdktools/trunk/modules/tools/src/main/java/org/apache/harmony/tools/policytool/view/KeystoreEntryEditFormDialog.java
>> 08/04/2008 22:57:13 Apply patch for HARMONY-5927 (Progress on policytool)
>>
>>
>>
>
> --
> Oliver Deakin
> Unless stated otherwise above:
> IBM United Kingdom Limited - Registered in England and Wales with number
> 741598. Registered office: PO Box 41, North Harbour, Portsmouth, Hampshire
> PO6 3AU
>
>

Mime
  • Unnamed multipart/alternative (inline, None, 0 bytes)
View raw message