harmony-dev mailing list archives

Site index · List index
Message view « Date » · « Thread »
Top « Date » · « Thread »
From "Eugene Ostrovsky" <eugene.s.ostrov...@gmail.com>
Subject [drlvm][regression] FAILED Linux x86: jdktools-test debug
Date Tue, 20 Nov 2007 05:56:58 GMT
It seems that we have a regression.

org.apache.harmony.jpda.tests.jdwp.Events.ClassUnloadTest
starts to fail from r596304 to r596371

Thanks,
Eugene.

On Nov 19, 2007 11:05 PM,  <nomail@intel.com> wrote:
>
> BUILD FAILED:
>         Ant Error Message:
> /export/users/cc/cc-common/scripts/cc-exec-adaptor.xml:104: The following error occurred
while executing this line: /export/users/cc/cc-common/adaptors/jdktools-test/adaptor.xml:28:
The following error occurred while executing this line: /export/users/cc/cc-common/build/checkouts/hdk/working_jdktools/build.xml:242:
The following error occurred while executing this line: /export/users/cc/cc-common/build/checkouts/hdk/working_jdktools/make/build-test.xml:98:
There were test failures.
>
> Date of build:  2007-11-20 01:45:21 +0600
> Time to build:  19 minutes 56 seconds
> Last changed:   11/19/2007 23:17:07
> Last log entry: hdk
>
> ***********************************************************
> Errors/Warnings:        (226)
>
> Result: 1
> ========================================
> Testing jdktools binaries...
> ========================================
> Compiling JPDA tests
> Since fork is false, ignoring memoryMaximumSize setting
> ----------
> 1. WARNING in /export/users/cc/cc-common/build/checkouts/hdk/working_jdktools/modules/jpda/test/common/unit/org/apache/harmony/jpda/tests/framework/DebuggeeRegister.java
> (at line 58)
> registered.add(debuggee);
> ^^^^^^^^^^^^^^^^^^^^^^^^
> Type safety: The method add(Object) belongs to the raw type LinkedList. References to
generic type LinkedList<E> should be parameterized
> ----------
> ----------
> 2. WARNING in /export/users/cc/cc-common/build/checkouts/hdk/working_jdktools/modules/jpda/test/common/unit/org/apache/harmony/jpda/tests/framework/TestOptions.java
> (at line 505)
> internalProperties.put(name, value);
> ^^^^^^^^^^^^^^^^^^^^^^^^^^^^^^^^^^^
> Type safety: The method put(Object, Object) belongs to the raw type HashMap. References
to generic type HashMap<K,V> should be parameterized
> ----------
> ----------
> 3. WARNING in /export/users/cc/cc-common/build/checkouts/hdk/working_jdktools/modules/jpda/test/common/unit/org/apache/harmony/jpda/tests/framework/jdwp/PacketDispatcher.java
> (at line 114)
> eventQueue.add(eventPacket);
> ^^^^^^^^^^^^^^^^^^^^^^^^^^^
> Type safety: The method add(Object) belongs to the raw type List. References to generic
type List<E> should be parameterized
> ----------
> 4. WARNING in /export/users/cc/cc-common/build/checkouts/hdk/working_jdktools/modules/jpda/test/common/unit/org/apache/harmony/jpda/tests/framework/jdwp/PacketDispatcher.java
> (at line 249)
> replies.put(new Integer(replyPacket.getId()),
> replyPacket);
> ^^^^^^^^^^^^^^^^^^^^^^^^^^^^^^^^^^^^^^^^^^^^^^^^^^^^^^^^^^^^^^^^^^^^^^^^^^^^^^^^^^^^^^^^^^
> Type safety: The method put(Object, Object) belongs to the raw type Hashtable. References
to generic type Hashtable<K,V> should be parameterized
> ----------
> 5. WARNING in /export/users/cc/cc-common/build/checkouts/hdk/working_jdktools/modules/jpda/test/common/unit/org/apache/harmony/jpda/tests/framework/jdwp/PacketDispatcher.java
> (at line 284)
> commands.put(Id, command);
> ^^^^^^^^^^^^^^^^^^^^^^^^^
> Type safety: The method put(Object, Object) belongs to the raw type Hashtable. References
to generic type Hashtable<K,V> should be parameterized
> ----------
> 6. WARNING in /export/users/cc/cc-common/build/checkouts/hdk/working_jdktools/modules/jpda/test/common/unit/org/apache/harmony/jpda/tests/framework/jdwp/PacketDispatcher.java
> (at line 355)
> commands.put(Id, command);
> ^^^^^^^^^^^^^^^^^^^^^^^^^
> Type safety: The method put(Object, Object) belongs to the raw type Hashtable. References
to generic type Hashtable<K,V> should be parameterized
> ----------
> ----------
> 7. WARNING in /export/users/cc/cc-common/build/checkouts/hdk/working_jdktools/modules/jpda/test/common/unit/org/apache/harmony/jpda/tests/framework/jdwp/VmMirror.java
> (at line 1834)
> frames.add(frame);
> ^^^^^^^^^^^^^^^^^
> Type safety: The method add(Object) belongs to the raw type ArrayList. References to
generic type ArrayList<E> should be parameterized
> ----------
> 8. WARNING in /export/users/cc/cc-common/build/checkouts/hdk/working_jdktools/modules/jpda/test/common/unit/org/apache/harmony/jpda/tests/framework/jdwp/VmMirror.java
> (at line 1902)
> vars.add(var);
> ^^^^^^^^^^^^^
> Type safety: The method add(Object) belongs to the raw type ArrayList. References to
generic type ArrayList<E> should be parameterized
> ----------
> 9. WARNING in /export/users/cc/cc-common/build/checkouts/hdk/working_jdktools/modules/jpda/test/common/unit/org/apache/harmony/jpda/tests/framework/jdwp/VmMirror.java
> (at line 2122)
> fields.add(superClassFields.toArray()[i]);
> ^^^^^^^^^^^^^^^^^^^^^^^^^^^^^^^^^^^^^^^^^
> Type safety: The method add(Object) belongs to the raw type ArrayList. References to
generic type ArrayList<E> should be parameterized
> ----------
> 10. WARNING in /export/users/cc/cc-common/build/checkouts/hdk/working_jdktools/modules/jpda/test/common/unit/org/apache/harmony/jpda/tests/framework/jdwp/VmMirror.java
> (at line 2132)
> fields.add(field);
> ^^^^^^^^^^^^^^^^^
> Type safety: The method add(Object) belongs to the raw type ArrayList. References to
generic type ArrayList<E> should be parameterized
> ----------
> ----------
> 11. WARNING in /export/users/cc/cc-common/build/checkouts/hdk/working_jdktools/modules/jpda/test/common/unit/org/apache/harmony/jpda/tests/jdwp/DebuggerOnDemand/OnthowDebuggerLaunchDebuggee.java
> (at line 94)
> class ExceptionForDebugger extends Exception {
> ^^^^^^^^^^^^^^^^^^^^
> The serializable class ExceptionForDebugger does not declare a static final serialVersionUID
field of type long
> ----------
> ----------
> 12. WARNING in /export/users/cc/cc-common/build/checkouts/hdk/working_jdktools/modules/jpda/test/common/unit/org/apache/harmony/jpda/tests/jdwp/Events/ClassUnloadDebuggee.java
> (at line 32)
> import java.util.LinkedList;
> ^^^^^^^^^^^^^^^^^^^^
> The import java.util.LinkedList is never used
> ----------
> 13. WARNING in /export/users/cc/cc-common/build/checkouts/hdk/working_jdktools/modules/jpda/test/common/unit/org/apache/harmony/jpda/tests/jdwp/Events/ClassUnloadDebuggee.java
> (at line 97)
> boolean isOutOfMemory = false;
> ^^^^^^^^^^^^^
> The local variable isOutOfMemory is never read
> ----------
> 14. WARNING in /export/users/cc/cc-common/build/checkouts/hdk/working_jdktools/modules/jpda/test/common/unit/org/apache/harmony/jpda/tests/jdwp/Events/ClassUnloadDebuggee.java
> (at line 171)
> public Class loadClass(String name) throws ClassNotFoundException {
> ^^^^^
> Type safety: The return type Class for loadClass(String) from the type ClassUnloadDebuggee.CustomLoader
needs unchecked conversion to conform to Class<?> from the type ClassLoader
> ----------
> 15. WARNING in /export/users/cc/cc-common/build/checkouts/hdk/working_jdktools/modules/jpda/test/common/unit/org/apache/harmony/jpda/tests/jdwp/Events/ClassUnloadDebuggee.java
> (at line 179)
> public Class findClass(String name) throws ClassNotFoundException {
> ^^^^^
> Type safety: The return type Class for findClass(String) from the type ClassUnloadDebuggee.CustomLoader
needs unchecked conversion to conform to Class<?> from the type ClassLoader
> ----------
> ----------
> 16. WARNING in /export/users/cc/cc-common/build/checkouts/hdk/working_jdktools/modules/jpda/test/common/unit/org/apache/harmony/jpda/tests/jdwp/Events/CombinedEvents002Test.java
> (at line 100)
> boolean expectColocatedEvents = (testedMethodStartCodeIndex == testedMethodEndCodeIndex);
> ^^^^^^^^^^^^^^^^^^^^^
> The local variable expectColocatedEvents is never read
> ----------
> ----------
> 17. WARNING in /export/users/cc/cc-common/build/checkouts/hdk/working_jdktools/modules/jpda/test/common/unit/org/apache/harmony/jpda/tests/jdwp/Events/CombinedEvents003Test.java
> (at line 53)
> private boolean eventMethodExitReceived = false;
> ^^^^^^^^^^^^^^^^^^^^^^^
> The field CombinedEvents003Test.eventMethodExitReceived is never read locally
> ----------
> 18. WARNING in /export/users/cc/cc-common/build/checkouts/hdk/working_jdktools/modules/jpda/test/common/unit/org/apache/harmony/jpda/tests/jdwp/Events/CombinedEvents003Test.java
> (at line 76)
> int EXPECTED_EVENTS_COUNT = EXPECTED_EVENTS_ARRAY.length;
> ^^^^^^^^^^^^^^^^^^^^^
> The local variable EXPECTED_EVENTS_COUNT is never read
> ----------
> ----------
> 19. WARNING in /export/users/cc/cc-common/build/checkouts/hdk/working_jdktools/modules/jpda/test/common/unit/org/apache/harmony/jpda/tests/jdwp/Events/CombinedEventsTest.java
> (at line 84)
> int EXPECTED_EVENTS_COUNT = EXPECTED_EVENTS_ARRAY.length;
> ^^^^^^^^^^^^^^^^^^^^^
> The local variable EXPECTED_EVENTS_COUNT is never read
> ----------
> 20. WARNING in /export/users/cc/cc-common/build/checkouts/hdk/working_jdktools/modules/jpda/test/common/unit/org/apache/harmony/jpda/tests/jdwp/Events/CombinedEventsTest.java
> (at line 212)
> int EXPECTED_EVENTS_COUNT = EXPECTED_EVENTS_ARRAY.length;
> ^^^^^^^^^^^^^^^^^^^^^
> The local variable EXPECTED_EVENTS_COUNT is never read
> ----------
> 21. WARNING in /export/users/cc/cc-common/build/checkouts/hdk/working_jdktools/modules/jpda/test/common/unit/org/apache/harmony/jpda/tests/jdwp/Events/CombinedEventsTest.java
> (at line 348)
> int EXPECTED_EVENTS_COUNT = EXPECTED_EVENTS_ARRAY.length;
> ^^^^^^^^^^^^^^^^^^^^^
> The local variable EXPECTED_EVENTS_COUNT is never read
> ----------
> 22. WARNING in /export/users/cc/cc-common/build/checkouts/hdk/working_jdktools/modules/jpda/test/common/unit/org/apache/harmony/jpda/tests/jdwp/Events/CombinedEventsTest.java
> (at line 732)
> String failureMessage = "## FAILURE during checking events! !";
> ^^^^^^^^^^^^^^
> The local variable failureMessage is never read
> ----------
> 23. WARNING in /export/users/cc/cc-common/build/checkouts/hdk/working_jdktools/modules/jpda/test/common/unit/org/apache/harmony/jpda/tests/jdwp/Events/CombinedEventsTest.java
> (at line 894)
> String failureMessage = "## FAILURE during checking events !";
> ^^^^^^^^^^^^^^
> The local variable failureMessage is never read
> ----------
> ----------
> 24. WARNING in /export/users/cc/cc-common/build/checkouts/hdk/working_jdktools/modules/jpda/test/common/unit/org/apache/harmony/jpda/tests/jdwp/Events/CombinedEventsTestCase.java
> (at line 135)
> long methodStartCodeIndex = lineTableReply.getNextValueAsLong();
> ^^^^^^^^^^^^^^^^^^^^
> The local variable methodStartCodeIndex is never read
> ----------
> 25. WARNING in /export/users/cc/cc-common/build/checkouts/hdk/working_jdktools/modules/jpda/test/common/unit/org/apache/harmony/jpda/tests/jdwp/Events/CombinedEventsTestCase.java
> (at line 187)
> long methodStartCodeIndex = reply.getNextValueAsLong();
> ^^^^^^^^^^^^^^^^^^^^
> The local variable methodStartCodeIndex is never read
> ----------
> ----------
> 26. WARNING in /export/users/cc/cc-common/build/checkouts/hdk/working_jdktools/modules/jpda/test/common/unit/org/apache/harmony/jpda/tests/jdwp/Events/ExceptionTest.java
> (at line 188)
> long frameID = reply.getNextValueAsFrameID();
> ^^^^^^^
> The local variable frameID is never read
> ----------
> ----------
> 27. WARNING in /export/users/cc/cc-common/build/checkouts/hdk/working_jdktools/modules/jpda/test/common/unit/org/apache/harmony/jpda/tests/jdwp/ThreadReference/FramesTest.java
> (at line 450)
> frames.add(new FrameStruct(frameID, loc));
> ^^^^^^^^^^^^^^^^^^^^^^^^^^^^^^^^^^^^^^^^^
> Type safety: The method add(Object) belongs to the raw type Vector. References to generic
type Vector<E> should be parameterized
> ----------
> ----------
> 28. WARNING in /export/users/cc/cc-common/build/checkouts/hdk/working_jdktools/modules/jpda/test/common/unit/org/apache/harmony/jpda/tests/jdwp/share/JDWPUnitDebuggeeProcessWrapper.java
> (at line 233)
> argv.add(val);
> ^^^^^^^^^^^^^
> Type safety: The method add(Object) belongs to the raw type Vector. References to generic
type Vector<E> should be parameterized
> ----------
> 29. WARNING in /export/users/cc/cc-common/build/checkouts/hdk/working_jdktools/modules/jpda/test/common/unit/org/apache/harmony/jpda/tests/jdwp/share/JDWPUnitDebuggeeProcessWrapper.java
> (at line 253)
> return (String[])argv.toArray(args);
> ^^^^^^^^^^^^^^^^^^
> Type safety: The method toArray(Object[]) belongs to the raw type Vector. References
to generic type Vector<E> should be parameterized
> ----------
> 29 problems (29 warnings)
> JPDA exclude list: /export/users/cc/cc-common/build/checkouts/hdk/working_classlib/deploy/build/jdktools.jpda.exclude
> Running JPDA tests
> Debugger JVM=/export/users/cc/cc-common/build/checkouts/hdk/target/hdk/jdk/jre/bin/java
> Debuggee JVM=/export/users/cc/cc-common/build/checkouts/hdk/target/hdk/jdk/jre/bin/java
> SAMSA exclude list: /export/users/cc/cc-common/build/checkouts/hdk/working_classlib/deploy/build/jdktools.samsa.exclude
> Running SAMSA tests
> test.jre.home=/export/users/cc/cc-common/build/checkouts/hdk/target/hdk/jdk/jre
> Run jdk/bin/java -version in /export/users/cc/cc-common/build/checkouts/hdk/working_jdktools/build/test_report
> java version "1.5.0"
> pre-alpha : not complete or compatible
> svn = r596371, (Nov 19 2007), Linux/ia32/gcc 4.1.0, debug build
> http://harmony.apache.org
> Run jdk/bin/javac -version in /export/users/cc/cc-common/build/checkouts/hdk/working_jdktools/build/test_report
> Run jdk/bin/javah in /export/users/cc/cc-common/build/checkouts/hdk/working_jdktools/build/test_report
> Run jdk/bin/javadoc in /export/users/cc/cc-common/build/checkouts/hdk/working_jdktools/build/test_report
> Run jdk/bin/jarsigner in /export/users/cc/cc-common/build/checkouts/hdk/working_jdktools/build/test_report
> Run jdk/bin/keytool -help in /export/users/cc/cc-common/build/checkouts/hdk/working_jdktools/build/test_report
> Compiling TOOLS tests
> Since fork is false, ignoring memoryMaximumSize setting
> ----------
> 1. WARNING in /export/users/cc/cc-common/build/checkouts/hdk/working_jdktools/modules/tools/src/test/java/org/apache/harmony/tests/tools/javah/Test/Test01.java
> (at line 24)
> private static final long xxx2 = 1;
> ^^^^
> The field Test01.xxx2 is never read locally
> ----------
> 1 problem (1 warning)
> TOOLS exclude list: /export/users/cc/cc-common/build/checkouts/hdk/working_classlib/deploy/build/jdktools.tools.exclude
> Running TOOLS tests
> test.jre.home=/export/users/cc/cc-common/build/checkouts/hdk/target/hdk/jdk/jre
> The test report is in /export/users/cc/cc-common/build/checkouts/hdk/working_jdktools/build/test_report/html/index.html
> The execution FAILED with the following exception:
> The following error occurred while executing this line:
> /export/users/cc/cc-common/adaptors/jdktools-test/adaptor.xml:28: The following error
occurred while executing this line:
> /export/users/cc/cc-common/build/checkouts/hdk/working_jdktools/build.xml:242: The following
error occurred while executing this line:
> /export/users/cc/cc-common/build/checkouts/hdk/working_jdktools/make/build-test.xml:98:
There were test failures.
>
> ***********************************************************
> Unit Tests: (161)
>
> failure: testClassUnloadEvent org.apache.harmony.jpda.tests.jdwp.Events.ClassUnloadTest
> Unit Test Error Details:        (1)
>
> Test: testClassUnloadEventClass: org.apache.harmony.jpda.tests.jdwp.Events.ClassUnloadTestjunit.framework.AssertionFailedError:
No ClassUnload event, but tested class not found: count=0
>         at org.apache.harmony.jpda.tests.jdwp.Events.ClassUnloadTest.testClassUnloadEvent(ClassUnloadTest.java:136)
>         at java.lang.reflect.VMReflection.invokeMethod(VMReflection.java)
>
> ***********************************************************
> Modifications since last successful build:      (1)
>
> add cc-hdk log20071119231707Lbuild.428 11/19/2007 23:17:07hdk
>
> begin 644 execution_log.zip
> M4$L#! H    ( *D0=#?J'!A/?!(  ")_   2    97AE8W5T:6]N7VQO9RYH
> M=&UL[5U[<]LXDO_;^A38V;I:N\JBWL]1?.6SG8TS<>RU',]>I7(IF(0D.A3!
> M!4C;VM1\]^L&2$FD)$JV88^26M6,PP?0:/2ON]%H@F!O%(Z]@]X-=R8'O4"P
> M@QXE,IQX[,W?!MP/B]+]-^N2=OF_?OW;02$*'!JRHKSSNX5"4;(P"HJWSK>0
> M<T\6[R5>C(NDKXH(*AQ'@>?:<-,A@>"WS Z)3\>,N#YQQP$7H44NXNM7/"A^
> M8'?,PY(!$^&$.&S@^F[H<E_J8R S<(4,L7Z)/2"!4B29D"7;AO^*-A^/N5^2
> MMG"#4)9B0BZ3UL/8(]1W"!U2;#NW^DWD>D[)'C'[&X^ S,CY5KKGXIOK#[\F
> M?2R-Z3>6::!0")D,NP6"O\_,'O$OI/!FPU_A"NI""R1I@=RX/A5(VK(VIU*P
> M/4;](C(BB\!]$ %#!9L'D^*M8,6!ZS$$QQZ-N9.^$A?IZEX4X7ZD[JC.C+\Y
> MKOA"C@136,))]]D2U(6PL:^"(:77:$H6"NI$2RB-U1$?!ZZ'&+R_.#XDNOAK
> M\%2R/2HEBQN[I7?4GN>FVJH0R2-A,Z+0(B%_\=;[KH_-037B2C*@GF3[Q!WZ
> M7"!'8S;F8G)&']QQ-.Z#MR#@%U![4S2*TU_J<L4BOQ]>?CS]^'<C=JCUM'0+
> M/DCUIQ37CL!SE+@8EFA @49I1 5<GLP*RM) @"]"BJ5C=A,-AXQ=LJ$K0R8L
> MY#7%-=FE(0$X&&FT]U)W=D1<B3D6=9Q=)Z:U]RM)E_N_%;]4J:M) -*D Q9.
> MNN1JQ$#6X8B#XP+*YS?H*??(#?.X/U1Z$$()0>])B-4^N/XWYGP 9BQRR0;
> M$8"HB@V9SX1K9XOU3@Z('/'(<X F"2C* SH"@#J;(+GB<G4+ 4;O>AZHH207
> MVW(C Z[K@T!\ZEW,7#WXU%T<Q?;)'?4BP'DSF!^+.#:C$=\GZY!_1^7HC :Y
> ML,=E>K_M7[\$ZK4M1/W6N0]*%]3^QL)C5P8TA!JYMEVIU#/X0T3BA_^(6,24
> M<:M33?$1N!NT\+6V_6RKKO\,0%;KG04O#:%H8KWLGIR"80^9V,7K$TW:&K+P
> MU-G=V]M/4UWSFZ/P!%_PQ-^+N)"0WGALK1-1I9[M1AH_A9JUL_X"FX6)AM:S
> M4V>?Q!<VUHP?'MCFSP!LK9$-!/X#[(K+K6W%^WI\Y@K!\P?\=BUKP8J*5*.]
> M.EP+L+'1_5 (.ED[Q$]+/7.<;__0N'7*U0QN=U1HU. @%[,?%*_.CXQ7M5+-
> MXC5PF>=HQ&0$<ZLC3$.\U1=#KJ2VN_?9_?+DF.H'Q;E2_K&!KN4 K0Y_5H>Z
> M"L_M27@I%.-<ESCWCQD&,*5S'P1ZGUS^0"/?'B4)L3RH.PNQ+UHP.7FPF<JT
> MO.4B(4K80\@@>)K=)-_3=?54:KT9CS#7*%SJN?_&H(;DM.EP -OG(7$8E!*,
> MX%,.&@+L ]>G7DSG&F" BI].CXG23L('6BU0I9X#^_:DP13L)YBYD"7E93_Y
> M'J?.)A@O&+-^;$/PU(I"U[-FV<1?ER&Z&:0Y5#'_[+,[P!-$MYD#W9Y4U#,D
> MWVEE)'\#W##J@SS.H_!\<*9R\.2-3LXOESW)E[K';3 #")=<94IIPE.Q"T8W
> M$_OV)(Z>(?9*JY*1>Q#=>. S%!V"9-31;C]4CT(P$;P'HX[@]U*7^<C#MSSR
> MG36NCFPPU D61L+7[DBW/^!B@8<],A!\K$:^6<E,CX\B&?+Q![@$B/J,@2M&
> M-P\(, =FLOZ=]H(X-L(9M#+&0T6I]]\'RQK0M#92C.U)]3Q+,;(9Q91BP)#R
> MIRM&EH=M5XQ5^K(]&:24OO#Q#2Y!T*?E<A6?*>5J3+F\PH5#CR!N/>+H@,.$
> M(KCR76R5.6<JPNV'5$ 9AYWZ#GL@;]Z0^;LG '5R+QM0+_7^FXX"RWE[]&BP
> M"MOMR1;E85M;AVVCEG4&PKT#>9$IQ$@IANK!#2^9S=P[,*G\\3H7N278Z8AU
> M.?>K.$A!J='W)AMAMST9HV=AUVHN/N,E)_^\.#FZ.CG^>G)]\O&J__7H_-/'
> M*T K>_WP\O+P?RV/^<-PM 3$)YG<\K:-F=SV)(Y6P[8.LX7G+#\)9M7M2?8\
> M'9QJ96&6^).@LV6IFR>A4ZMG%RS]+.AL:8;E4>BT%C(L\?QA0%TO$NR,24F'
> M#)#YY:]_)6\/3S]\NCPA3J3*J![A@1KKY5_(7W[9) FS#I],TX\'9DL3,(\;
> M<1;2FT\'9DMP6077EB9N%N ZHC)_BE[+/K3''&[\P" [G5)5KE"NE[A^!]?^
> M?&0/X34NZ3N$2:P_W%TZKWJ*PUO*P>/-:DOS*(_'J9W-;>;A)'X0>%:AMIW9
> MC&D2:FT6HYT-'Q18ZM'@Z?$*?-[JN[D0K?5V<0O&@-BRU,/5"#LT?2Y94C);
> M.RS5&]FDTMQZ%5S7J,C 4!79X6XLPGT4[=Z?_QS]&NYRD?LL5A=YH77I6Y:_
> MD'"#E=X?_W[Q"6HD&=D+P4$P\G=!@V#-XL-:-@E%Q? N7@+CO<X2F->"M+IE
> M28QG8[>00(Q3^G'J_O.7/05FLA &3N2J-._T]T333=K06$/+6X VO@0(@\!8
> MDETXN:?"!Z'(O4(A@.$&1%]D#[87.2S]!I=Z;RN^ W*6X9-?TU++"CSWIN3
> MZ,8G<=E$?RQ4!RMN2+WJN.Q]LLO(]Y>\39;<)F2Z4N']]=F;1S(*P0H,N>KP
> M%O\';80HK#15N856V$NT\OD6#6;65; <2UN.%5N.%I7JO8668UV[(HRH=P:%
> MP!"L>/D%#GLIBGA!$GR)E%3VR5L]\Y%=4MXG)[@&21]>N6-&F$<#R9PNKK1I
> MUNI$,OO9I.I6I6*$4,WJ- UQ5*U5#5%J-$SUK=(QQ%*SW3(%7"Y+M8V5J6K5
> M*KD\53<EU;:JY;8IB3?,4&I9]7)N[QXCJ$HMUUCJFY*"$+W9,:,'(*F:&=U$
> MF6_N5"HYE)J@YJTEI$[Z5YMX3CUSL^:>XB,3*O5T<FS"!&LU(P)K6)UJ+J7F
> MQJ*O6*UZKFIM;(,M@[ZJ7#4SR+2M=L/,* ,\54P-,^6:.4IFW$*E:=4,":IF
> MM5O&!G9#"@64RF8L#WJ7;RZ/ :]N*DAH&S0\4Q%0V9"O0SF9DGC-F,0[YDS8
> MF,#S_=,C8JEFU8R80."&_'C-JAJB!#Q5S$@<E*!CRJETFL8,V%SOVL8&A(:I
> MF4>Y;L;L@*>F,>?;,L53)W\V]"?H$U RUSM#B0,<S(T%&"U3$F^WS>F3L5#%
> MW!AES( -104H<#..K@H1G3%CJ9A2\;8Q VXWS6A!PZJT<E5\XW1&U:1"M=IF
> M1-ZPJA53>9^&(?\$<C(V<E;,^4QSDPU38JI43;%4S0\P&H_(J]2;QN(G8P(W
> ME-K$%+ I8ZF:<4\5#,?-N (D96AP4:3,C'@5@,]0CAN]9JXK?T3.KVUHOM$"
> MG@PY\I:A\1R&!$.#"PC<E+Q;^<[@,93RX\S-GT[4(18S-BTSY,G-33J!DK&0
> MU5AX:"SQT,Y/(&_NG:Q&RU3BH6ILRMDVE,C"(=A4F-DV]J"R96@,KEO&4K55
> M8W/\]LKA8,G3N*<OCGC'O;EEM0:>-[7J9B30;%J-CAG;;%FU1SQ>S:=4-Z2]
> M0,G0<@2@9"ARP#'#C+]HMJQFTXQ-0?>:IL!K&!(Y=*]>,R-S)&5HR&\"4Z8F
> ME.W\Q^N;\S1+#!9"'MFC8OR&B53;PG>3JTP1F%YCT^WANVO6X_4/S_JOLR!/
> MTK&<K<A##FSNVQ0$\Y$# Z[>6U]OGX[? ? Y\1F^34]"]A#N$X>K/1MX.,)=
> MS->MZ-/]4@52]_&*=2O O_,Q>_Y:NVS;^&V Z?H[4DRV9C"P'G;Y7OS0] .S
> MOY!#-6B1=WK0(GJ'*"9(E^S:>^2(!Q/A#D<AJ70ZH'O5<KFIEI?&U?I\$-[C
> M]DMJ\PNJ-K[@@KB@KIYK,U^";NT3"K@$ZF,1N*%EJGG5VZ2SOT L9Y5_(:D2
> MH(1%Z@4C"BSAAD_0]<!C(<-V\!@:!:JI*O+.QW<7&IUFK05,[W[D=\ _,M_:
> MV\<MTJ.'DDMKU=+0MC&C8('UJ)W=B9)5BM8H#(-N*5DKG(SQ,-SG FB_(H(G
> MMN>"S9/W*$K]90' KPRS+.A[S:IA[V8XGO[/&9R) *515H"V+'+H>43=!B_#
> M@,D[YEBY_1N]?+?>?SPMJ@^7D!%3&YAH U<+DBFN5$Z53IU\PE?HNLMBLGB%
> M+_; .L.OA7SF>N/X+Z2G=QO#K5WDP6K:TPJIJX04;S@/%0G0R!'IX=\#92I#
> M%Z(\HJ[>NR!H7#0-_66^@QZ*9^@L_^%*;8<-:.2%\:YH2"]'!,#0 C/X6\$0
> MKFE_:7XXZ2&$!RE"J'E(3'_.9,J/8(XKF(T^W/4?P9,,F.T.7/4MF:RKR?+C
> MD)YNA(O)E*F$GY3.)5S9\3="0&]2C6W$WK0M<C]R[=$BT0&X3?U"%+YG0,4D
> MGWW7!T/(-G*J+L8?_9A3-_7J C1"HY"/P6.J?4'RZ8/_NN'@5K)PX99'(AXK
> MT=IA!I//:\JPYFFIH$%MR8>[G43 $?D73) T?G.5-A*OQ%!%"?)F@IL!@MUG
> M\+]D$M050JA<S^9P^Q5\&S1TC WI/0Q='-%0D,#]A(4Y_,&0,D2$7X%#T==-
> MC9@76$O<Z\Z,F^^Q3_R#O#^\5*$D 1AI&KBY\JA;[F"RI-YJ+8KK[,"/Q-4!
> M9:3G8&VR4+OXC4TDV!LCO>3HJ_*#.^IE1!VJ:-U+[J?KJTOJO9<9 3P% NKJ
> M^LH!JO!\ZU("# X0F/*67%M@?5IWKMH.278B@NO3JF077(?C#@:@!WK/KB5-
> M[F784X(#1+1/_HIVAO35![SBCN4*%VXJG)=7M_IO521N'4,HK7SH I;*M^RH
> M+O$[%V80U''4Y\"H%P\&V08],)!T#>@NNT^&#C@+N)0+P6#19@+B&J4XCBL#
> MCTX(7@(W@YM@2;(+%@2N$D;#1"^1]83'C.!"24GOJG_X]=/EAP,DF=(EF($!
> M\G0<H*,=<>&&DX7JV+8F@4=?E:',:X2ZD&  Q>:931,#.3Q,2&_$P81!>A"Y
> MR8/OW1[:\L$?2DQP6T5S8,50B,2%5/^PU#YAUM#2!2U=T (7TJU4:_4E36E;
> MP+]3P.<-(=7>[KNKJPL,T?OG1[_U]Q:H(8!"^W@]/B"UF<]'FK:8!"$?"AK
> M>*GHPHPB 5\LIZCJ]A+NDJN*9,;"Y'(F'L6#VIAO3'TZQ,%PN2.8-93F;>8!
> M5C,)1F:*2W3_6LG1K&F(B8"5C:4YG5;(8Q65U#RO\W:ZNKUY=N>KY/$[=LQS
> M.X[W[G#<X7SV(-M@6KKI2LM97@@$0'EP$"=%')Q?/AA(G?P6MQVI*"!U*V'K
> M>[$7?T!#.XH_YJ_H,1^O]?3A5_6EK8,_+,LBQ?<]#,*20CE<^/S>3S[3(=-L
> M["CM$.Q?.SM_U[-%EE(+N!,E*?>Y.B@A6W@[.T=XE!XC!+M+_#QN,QW);&6U
> MF68(=?7!S+Q##NZ6AR.M+1![9VHZ#),9,))<LC&_8P0&.9@BJ&%\J4/9*6JH
> MH<:).DAU#5M3 RZZ7ADZ/,JV!_-GH NU^PQF'HI1+*L#"E<D\VOH::8BJAI4
> MNQI!T*K4+M%<KF-$ K*A"2*9NGH+:*A]JO>"IBFF=^T13,7WD! E1_U+O>M$
> MA@0P:'O<!TE-OSL*I9%M);'%TBKT<1!-Z@_3$5.F, 15?F@K^"[P$*6H99=A
> M5*&R$ OM%"7S!KK^5-\@-H6+<9R5(J)<Q31K"6QEB2618YKYG'!Q9Q8;7R>1
> M\7R+2KRK3>D=@I=CS=K)?,^8=#H%!6%$=R=30VM:NMU,@GF#SW5>G9]_Z,]_
> MKS-^C7Q6HO&?#VBNVPI!GTEAZ_T0L*UE&R'H'NO"*D>F/JVH_I0K^5]D6[%C
> M:FI/?K6WS,/#0Y6\(95U^QU,?TNWD]%[H\:,*9)/W_DTV8Z [%:2S0C6[46@
> ME?(UGGWHOZ_U["-K;"_Y[&.#)^@S$>!W V3\,!T"D#XZ0[T7=9\"Z'E/T#=>
> MEU2URAU3;T35&F;62I6M<K7]O(=X.K I@K<JLG$03O!2G!"<7LB>8S*NJ /!
> M;D'SK\^@%X+Z4F\5#IQ"7YOM\CBM+6B@R /1== T7R)$+>&7SDLN;NAEX6&A
> M(&'*'4[Y+L  -#O14E"B$3H16"@@HS@P12JPTZL[]/BL,I(<DYUJH[]D/ZVN
> MJC)W ^5.N&U'0H#)W8]<;TH1;H<8*Z&#[!9R>D\="G,,(:=&K[A,+N/'Q[O5
> MMM[4Q7#+F\M=<U&O_GELJ&^RS^(%Q5!'BP7BHGO\HW0N,1"KT"O1@UX)_#C\
> MO>'.!/Y!-3GX?U!+ 0(4 PH    ( *D0=#?J'!A/?!(  ")_   2
> M      "D@0    !E>&5C=71I;VY?;&]G+FAT;6Q02P4&      $  0!
> &K!(
> end
>

Mime
View raw message