harmony-dev mailing list archives

Site index · List index
Message view « Date » · « Thread »
Top « Date » · « Thread »
From "Alexei Fedotov" <alexei.fedo...@gmail.com>
Subject Re: [build-test alert] FAILED Linux x86: stress
Date Fri, 19 Oct 2007 13:24:27 GMT
Hello,
I have looked through failures and they all are due to OOME and
timeouts. I will fix the tests when the time permits.

I have no information about the last failure, my assumption is that
the issue is intermittent and is caused by agent / debugger
synchronization.

I wonder why the following issue is not being committed
https://issues.apache.org/jira/browse/HARMONY-4881
Committing it would help me avoiding looking through the same buggy
tests again and again.

Thanks.


On 10/18/07, nomail@intel.com <nomail@intel.com> wrote:
> svn.revision=584579
> BUILD FAILED:
>        Ant Error Message:
> /export/users.2/cc/cc-suites/scripts/cc-exec-adaptor.xml:104: The following error occurred
while executing this line: /export/users.2/cc/cc-suites/adaptors/stress/adaptor.xml:100: The
following error occurred while executing this line: /export/users.2/cc/cc-suites/adaptors/stress/adaptor.xml:116:
The following error occurred while executing this line: /export/users.2/cc/cc-suites/scripts/framework.xml:1069:
Java returned: 1
>
> Date of build:  2007-10-18 20:31:28 +0700
> Time to build:  34 minutes 31 seconds
>
> ***********************************************************
> Errors/Warnings:        (4)
>
> BUILD FAILED
> /export/users.2/cc/cc-suites/tests/stress/qa/build.xml:169: Java returned: 255
> Total time: 34 minutes 29 seconds
> The execution FAILED with the following exception:
> The following error occurred while executing this line:
> /export/users.2/cc/cc-suites/adaptors/stress/adaptor.xml:100: The following error occurred
while executing this line:
> /export/users.2/cc/cc-suites/adaptors/stress/adaptor.xml:116: The following error occurred
while executing this line:
> /export/users.2/cc/cc-suites/scripts/framework.xml:1069: Java returned: 1
>
> ***********************************************************
> Unit Tests: (191)
>
> error: test stress.org.apache.harmony.test.stress.classloader.OneThread.SupIntf.testManySupIntf1
> error: test stress.org.apache.harmony.test.stress.classloader.SynchThreads.SupIntf.testManySupIntf1
> error: test stress.org.apache.harmony.test.stress.classloader.SynchThreads.SupIntf.testManySupIntf2
> error: test stress.org.apache.harmony.test.stress.exceptions.catcher.StackUnwindingInsideInitTests.StackUnwindingInsideInitTest10
> error: test stress.org.apache.harmony.test.stress.exceptions.catcher.StackUnwindingInsideInitTests.StackUnwindingInsideInitTest6
> error: test stress.org.apache.harmony.test.stress.threads.StressThreads12Test.StressThreads12Test
> failure: test stress.org.apache.harmony.test.stress.jpda.jdwp.scenario.MEMORY007.MemoryTest007
> Unit Test Error Details:        (7)
>
> Test: testClass: stress.org.apache.harmony.test.stress.classloader.OneThread.SupIntf.testManySupIntf1java
version "1.5.0"
> pre-alpha : not complete or compatible
> svn = r584579, (Oct 15 2007), Linux/ia32/gcc 3.3.3, release build
> http://harmony.apache.org
>
> Apache Harmony Launcher : (c) Copyright 1991, 2006 The Apache Software Foundation or
its licensors, as applicable.
> [debug] started null(org.apache.harmony.test.share.stress.ReliabilityRunner)
> [debug] timeToWork = 30, timeToAbort = 30
> [debug] started null(org.apache.harmony.test.share.stress.generator.Thread)
> [debug] Thread.setContext  { org.apache.harmony.test.stress.classloader.OneThread.SupIntf.testManySupIntf1
{} }
> [debug] Starting 1 threads
> [debug] ThreadToRun.run()
> [debug] completed null(org.apache.harmony.test.share.stress.generator.Thread)
> [debug] Generator.execute()
> [debug] class = org.apache.harmony.test.stress.classloader.OneThread.SupIntf.testManySupIntf1
> [debug] org.apache.harmony.test.stress.classloader.OneThread.SupIntf.testManySupIntf1
{ }
> [debug] started test(org.apache.harmony.test.stress.classloader.OneThrea...
> Test: testClass: stress.org.apache.harmony.test.stress.classloader.SynchThreads.SupIntf.testManySupIntf1java
version "1.5.0"
> pre-alpha : not complete or compatible
> svn = r584579, (Oct 15 2007), Linux/ia32/gcc 3.3.3, release build
> http://harmony.apache.org
>
> Apache Harmony Launcher : (c) Copyright 1991, 2006 The Apache Software Foundation or
its licensors, as applicable.
> [debug] started null(org.apache.harmony.test.share.stress.ReliabilityRunner)
> [debug] timeToWork = 30, timeToAbort = 30
> [debug] started null(org.apache.harmony.test.share.stress.generator.Thread)
> [debug] Thread.setContext  { org.apache.harmony.test.stress.classloader.SynchThreads.SupIntf.testManySupIntf1
{} }
> [debug] Starting 1 threads
> [debug] ThreadToRun.run()
> [debug] completed null(org.apache.harmony.test.share.stress.generator.Thread)
> [debug] Generator.execute()
> [debug] class = org.apache.harmony.test.stress.classloader.SynchThreads.SupIntf.testManySupIntf1
> [debug] org.apache.harmony.test.stress.classloader.SynchThreads.SupIntf.testManySupIntf1
{ }
> [debug] started test(org.apache.harmony.test.stress.classloader...
> Test: testClass: stress.org.apache.harmony.test.stress.classloader.SynchThreads.SupIntf.testManySupIntf2java
version "1.5.0"
> pre-alpha : not complete or compatible
> svn = r584579, (Oct 15 2007), Linux/ia32/gcc 3.3.3, release build
> http://harmony.apache.org
>
> Apache Harmony Launcher : (c) Copyright 1991, 2006 The Apache Software Foundation or
its licensors, as applicable.
> [debug] started null(org.apache.harmony.test.share.stress.ReliabilityRunner)
> [debug] timeToWork = 30, timeToAbort = 30
> [debug] started null(org.apache.harmony.test.share.stress.generator.Thread)
> [debug] Thread.setContext  { org.apache.harmony.test.stress.classloader.SynchThreads.SupIntf.testManySupIntf1
{} }
> [debug] Starting 1 threads
> [debug] ThreadToRun.run()
> [debug] completed null(org.apache.harmony.test.share.stress.generator.Thread)
> [debug] Generator.execute()
> [debug] class = org.apache.harmony.test.stress.classloader.SynchThreads.SupIntf.testManySupIntf1
> [debug] org.apache.harmony.test.stress.classloader.SynchThreads.SupIntf.testManySupIntf1
{ }
> [debug] started test(org.apache.harmony.test.stress.classloader...
> Test: testClass: stress.org.apache.harmony.test.stress.exceptions.catcher.StackUnwindingInsideInitTests.StackUnwindingInsideInitTest10java
version "1.5.0"
> pre-alpha : not complete or compatible
> svn = r584579, (Oct 15 2007), Linux/ia32/gcc 3.3.3, release build
> http://harmony.apache.org
>
> Apache Harmony Launcher : (c) Copyright 1991, 2006 The Apache Software Foundation or
its licensors, as applicable.
> [debug] started null(org.apache.harmony.test.share.stress.ReliabilityRunner)
> [debug] timeToWork = 30, timeToAbort = 30
> [debug] started null(org.apache.harmony.test.share.stress.generator.Thread)
> [debug] Thread.setContext  { generator.Thread { generator.Loop { org.apache.harmony.test.stress.gc.padder.BigObjectPadder{}
}} generator.Thread { org.apache.harmony.test.stress.exceptions.thrower.VerifyErrorThrower{}
generator.Loop { org.apache.harmony.test.stress.exceptions.catcher.StackUnwindingInsideInit{}
} } }
> [debug] Starting 1 threads
> [debug] ThreadToRun.run()
> [debug] completed null(org.apache.harmony.test.share.stress.generator.Thread)
> [debug] Generator.execute()
> [debug] class = generator.Thread
> [debug] org.apache...
> Test: testClass: stress.org.apache.harmony.test.stress.exceptions.catcher.StackUnwindingInsideInitTests.StackUnwindingInsideInitTest6java
version "1.5.0"
> pre-alpha : not complete or compatible
> svn = r584579, (Oct 15 2007), Linux/ia32/gcc 3.3.3, release build
> http://harmony.apache.org
>
> Apache Harmony Launcher : (c) Copyright 1991, 2006 The Apache Software Foundation or
its licensors, as applicable.
> [debug] started null(org.apache.harmony.test.share.stress.ReliabilityRunner)
> [debug] timeToWork = 30, timeToAbort = 30
> [debug] started null(org.apache.harmony.test.share.stress.generator.Thread)
> [debug] Thread.setContext  { generator.Thread { generator.Loop { org.apache.harmony.test.stress.gc.padder.BigObjectPadder{}
}} generator.Thread { org.apache.harmony.test.stress.exceptions.thrower.StackOverflowErrorThrower{}
generator.Loop { org.apache.harmony.test.stress.exceptions.catcher.StackUnwindingInsideInit{}
} } }
> [debug] Starting 1 threads
> [debug] ThreadToRun.run()
> [debug] completed null(org.apache.harmony.test.share.stress.generator.Thread)
> [debug] Generator.execute()
> [debug] class = generator.Thread
> [debug] org...
> Test: testClass: stress.org.apache.harmony.test.stress.threads.StressThreads12Test.StressThreads12TestTestHarness:ExecUnit
     runProc(): Timeout!!!. The test hung (not finished in 180 second).
>
> java version "1.5.0"
> pre-alpha : not complete or compatible
> svn = r584579, (Oct 15 2007), Linux/ia32/gcc 3.3.3, release build
> http://harmony.apache.org
>
> Apache Harmony Launcher : (c) Copyright 1991, 2006 The Apache Software Foundation or
its licensors, as applicable.
> Test: testClass: stress.org.apache.harmony.test.stress.jpda.jdwp.scenario.MEMORY007.MemoryTest007java
version "1.5.0"
> pre-alpha : not complete or compatible
> svn = r584579, (Oct 15 2007), Linux/ia32/gcc 3.3.3, release build
> http://harmony.apache.org
> 21:01:46| Test: class org.apache.harmony.test.stress.jpda.jdwp.scenario.MEMORY007.MemoryTest007
>                test case(s) to run 1
> 21:01:46| Launching as a server listening on: nstdrlxl130:44031
> 21:01:46| Launching: /export/users.2/cc/cc-suites/build/checkouts/snapshot/hdk/jdk/jre/bin/java
-cp "/export/users.2/cc/cc-suites/build/classes/stress/classes:/export/users.2/cc/cc-suites/build/results/stress/temp:/export/users.2/cc/cc-suites/build/classes/stress/classes:/export/users.2/cc/cc-suites/build/classes/stress/lib:/export/users.2/cc/cc-suites/build/libs/th.jar:/export/users.2/cc/cc-suites/build/libs/junit-3.8.2.jar"
-agentlib:jdwp=transport=dt_socket,address=nstdrlxl130:44031,server=n -Dvm.assert_dialog=false
-Djpda.settings.verbose=true org.apache.harmony.test.stress.jpda.jdwp.scenario.MEMORY007.MemoryDebuggee007
> 21:01:46| Start redire...
>
> ***********************************************************
> Modifications since last successful build:      (0)
>
>
> begin 644 execution_log.zip
> M4$L#! H    ( ,"H4C<=#Z&._PH  &")   2    97AE8W5T:6]N7VQO9RYH
> M=&ULU9W]4]LX&L=_AK]"LW,W2V?:.$Y((#ZV,Q3"EAYOD]#E;FXZC+"51.!(
> MKB0#V9O]WT^28[!#')*^G)[00FQ)EC[ZZM$C64KBO9$:Q^_W;G@T>;^7"/)^
> M#R.I)C'Y[=<!9^J=I'^2 .W6__Z/7]]OIDF$%7DG[UFPN2E2_1<A])^(Q$21
> M+^C0O%(V1 TTH#&1:"#X&'GD,>%">:DD0M8:7ACJ_^]D2A61WDU*X\@31*:Q
> MDIY4^DB:/'6NM_@>?T$?3 *36X!LVMKC."XE*)V$(Q+>U4+.!G08E&*R8Q*.
> M^!=T8.-3@17E+$#Y3\P>KREN-JZ'85AY[1^G&0?ZVW_OQ].2_@I01&[28>5%
> MET0J$J%/.@)IU10=$WV]LJ&U:<!?U;SF9PD5;>5Y:G1D.)$CKKQ1=.?=FE]!
> MO!O*/)/WO&(>2?@%[2=89X$^8C'F;().<,KTN4 !V@K?:-&2B:##D4)^I^._
> M18UZO8TN=?KI97T^4 ]8$'3$4Q99:1$7B"J)8AH2)KF0;Q&6"">)#L W,:E5
> MHI@0=*]K:G+YQ:^U:O5?4&5J;;7O<)R,L$9E7*&0CQ-CD:9\<ZQA=&F5EVMK
> M1K\AT=K=;NUTWJ*M\U#7L64JN//F+3JA+'WTC%UXVBY0LZ;_O45"FSJ6)+.%
> MRIQ'2B6!YXTR16O8*E7CHMI2M/A,=P$4%DW4]B9M,*,LLA8.AM]C+<;N\K[F
> M?<6>SL[\7A-V_Z)W%3/N/H9Q&I&<YBNND2RD%E.I?C11GK<IK;K#Z\Y3LU?/
> M*ST[-C9JDJ"I?$]V126JUXP9UUM^&VV=X@GRVYEAOZG.3><T;:3@%%.V87O=
> M/HL^6]>8N9:M-P&ZX%(:LT.4A5P(HHWJ'L>IED];94S9'5(<92[ &NEL-7]>
> MH8(,B" L)+DO6KY<?8$IYD 076S92 -T_L_E,Y(*"]6?L(,19HS$)M.^"4)R
> MHIV.X$R/.MJ;VTBDV\K8#NKHGZ6*.*3BB+*(B(V!?C&9:Q\P,G67!(MP9'67
> MQ@!6,DLI0AOFK2S8I2WO0<NN"6+=+"0R>J$MQ16.M4?UE[.X0RIU38Q7-CF?
> M\!!;Z7:#IA\T=U O92@V@35[E:FP<42ITJ.G+F.I(OJ*"](C<E]^^KR!HRC'
> M1P_:=^M"T50/[<6\S*'E_BW39AI]RZB'A< 3Z>W;%Y.'C]#6Q7Z_WSU<KKH_
> MDZ4!B*4%B*4-B*4#B,6ONX09IF/"E.&9'MF<G %I]QW>>7WSUW&_GB%I@B'9
> M!D/BT+O,D#CT+3,D#CW+;-]Q.!#-HL#I/;[3[B,H&TH-8U]-+CN@:'9!T3AU
> M_B]HG/:F%S1..]0+&J<#P0L:AX.!O4?2M\'2L[=0/7WDL%^1QY DYA9:>F%V
> M<Y?YP<_L0=^]:KE.,9N<W]SJVT:+*1='.^H!/[@6COS_#ZZ%HW'CU5H<,TDC
> M<LRHFE>)<JR]\>GV>N>]]:U#>_VK -64YI%#=J95O(ZF,=_,Z\@><$+M+I(7
> M8S;T]!CJ]:][^8*RR>^Z[L\)@@-K]JGF ,\+!@W=J AV#$UY'B0(CHB0WH%.
> M;Y?1>C9@]OQ*4$5$WUYC"UZ-OWI%?#?0(]?LBKA=@A]CAH<DLGLA*0M0<Q>(
> M5!<T(=%4IL+Q=TKT\[FS6?T4O'@"@WP8>@.!A]Z1_F,63^U^E9TJSPD"AMB<
> M$P0(L4_-5GL/LXB/[2CZ2C1@]/8KT8#1.Z]$ T+__>"(,AS3/\D<ZYZ)!(3]
> M+&:C,@(D;K,R A!N9K"5_@.FYYAC#(4(D+AS71Q,YU;IUJ YM.D<?)[Q%F*<
> M 2?Z:C,I&^,XSA:F/N)X<&%#H9$!HKJD^3H>,+F>P2! C<DX:T#S+N'GHS,R
> M=#O$+.9RM+;\*I>C_9EJ+I#&Y79X70 %SMPAVSHXLYIRN;6L4S+F8I+-V_6Q
> M>ZMZ!FKG0([FBFID5IOL6I,^[:<R(2PR^7B,GY^?=O5+_[S[,MK5,FZ9]Y@I
> M(D2:J"+Q U6C9^92$E?KN$M0%W4N,X-0^@I3=<85'4RJI2ZG@:'U?.ZBV#/4
> M(-2^S,[\AH6>$^9DX[7,^(E3NV[JA2-,V7R+R-/ L(7YQ$5;>.)=U0HJ]TNV
> MMX.FO]Q^R4X;@#1QMMNPN#5!C%45R'.;T]$MP,S@&A.25'O/IV@8G>4%;6DB
> M\,3JR%V.J0R] SW'W!=#AUM@%L.^B>#\GHA!S!]<LTQ8V"-A:C^*YYBE/+"Z
> M 0EC+&7,LQU4\QFXZ2CJG6 Q) <F]@R/B;VF''3=<V3:WX/LR'-\!_+5^JE\
> M!4UE\^Y(BS?]<&7A')JZ"U"AJ7K F528J0O.8WO%P<7)V-4"RXJ4T+0\HB2.
> MI :SR9_.H(E9@0E-S7YZ,]N'GH/@P2;'3 T*I/;<T?K;JIB.UGE7Q?2=K >L
> M2MF 17DE.!L6.])9]^!$IX/FE:HXH?7T%YQ7ZR'GU3JI"<UO5F!"\YNG1(UX
> M9!8+,J?T= K-.B\%(44Y"^=KA JM,V7M;>[>\LE=*63-< $8PAE7:[B<\@W4
> M $QC=6H(BRK?0+VJUI6;+JU&T%CR0RJ^OPU%H05K(_":<_ZZ SS.!3=,ZT$*
> MT %5W9"L >G5>H$"--/*F30\U 435'BPK\SYW .?TL?UFNVM!@S SZX$#&&.
> MMQHP+(5A;YHM!PI+4; ;9J\RPM(1[F;9ZY"PE(2[]_0Z)( 5U-<A8=DDW#NH
> M B3@7:<E*(%K">:NZ77(M5 2EJ>$N]=4G*X!WFE:!A.67<+>#EL.%):B\+?"
> MEH<%8 +GC&2P:[+&L KO#]R0V0FV.TMNR+0:[K59^ X[2(T(]OU@SXA@U^!?
> M103E7@"ONS]#@EYQG]42V%K[;1)A[S9Z2#P9$H8%Y=[EQUYW_[#NU[T,W.1:
> M=_;$E)=\I]W3\]Z_ZW6_\('VNJN/A"W0SR_I!X<OUZ]1TL_5=^U7Z]<HZ0>'
> M+]>O6=+/U=,!JOFV2WRNGL%1S=<J\;EZGD$U7[O$Y^H)!]5\.R4^\Q721_O'
> M)^[YNG]TSRZ->^[>$Z:@>><I7:-(!\>W3.DZ13I7CS>:8WG'_^H>VH&7/I((
> M6LM.Z1I%.C@M.QW5ZJ59 2#U<K[2J M(O_,/G[H'EV94R[XQ#]JHENO7+.D'
> M9U:0Z]<JZ0=GU,WUVR[I!Z=]<_W:)?W@S IR_5HE_>"T;Z[?3DD_5\]BJ]:O
> M7=(/3OOF^NV6]'/U]+AJ_79*^L%IWUR_3DD_.'.K7+_=DG[PVK=3XH.CWU%O
> M_[1KIE=' H_)M\VN*G82.D$K:.PNN9'0J<,0HE$4 LXT;DK7+-*M.DFJ>!B[
> MU7_!<^N536H?TK[1JE<_0!VAQ*P=1QO^;O6G=! :8!J;1 N2$"&XV-BH_H8U
> MA.0=31*=3=.OMAN$4G;'^ /;J$YSR!FIH3XA2(VL%$B0A N%*+,A$17:Z7$Q
> MJ<QAPR./Y@HOE43(6L,+0_W_G4RI%LZ[26D<>;I5TUC):?LN;"PY?5H]Y1J
> MCDFP4:\'S6WS$2G,(K3;;H\79& :*;L,-;?1F+)40Z#&#I(DY"PJ7UDZ^?#Y
> M^.0092LAI8B%U;.VD9OM5YQ5M_8XC@._W0G0)YV#%E2EV@"C #5:K6J *O;.
> M$_OFI6Z09W4R5F2^E\TVU8#',7^@;(B>GB<6V$L*$<:P$ _#5 CM?!Y&VA3S
> M''6T&E&)8LI(L+FPUCC"B;:)IXI/S[-ZZ^9"__]2_?9/*E6&@B:ZC0?&[SQP
> M<3>MY9SF]3?W//Q^STL$T7]O>#31+R,UCM__#U!+ 0(4 PH    ( ,"H4C<=
> M#Z&._PH  &")   2              "D@0    !E>&5C=71I;VY?;&]G+FAT
> 8;6Q02P4&      $  0!     +PL
> end
>


-- 
With best regards,
Alexei,
ESSD, Intel

Mime
View raw message