harmony-dev mailing list archives

Site index · List index
Message view « Date » · « Thread »
Top « Date » · « Thread »
From "Sean Qiu" <sean.xx....@gmail.com>
Subject Re: [buildtest] dependency of JettyScenario test is outdated
Date Thu, 19 Jul 2007 13:24:03 GMT
2007/7/19, Alexey Varlamov <alexey.v.varlamov@gmail.com>:
>
> Hi Sean,
> The axis2_app runs OK on CC, see fresh notification in alerts list.
> How do you launch it? Did you run install & setup targets before?


Yes, then i will try it again.
And thanks for your verification.

2007/7/19, Sean Qiu <sean.xx.qiu@gmail.com>:
> > Hi, Alexey
> > When i am running the axis2_app test in our BTI 2.0, it will fail caused
> by
> > java.util.zip.ZipException.
> > Am i missing something?
> >
> >
> > setup:
> >     [exec] Checked out revision 557551.
> >   [delete] Deleting:
> > /home/xiaoxia/harmony/buildtest2/build/temp/null38995387
> >     [echo] ===========================================
> >     [echo] Setup of 'axis2_app' Test Suite..
> >
> > setup-suite:
> >
> > setup:
> >     [java] Buildfile: build.xml
> >     [java]
> >     [java] -init:
> >     [java]      [copy] Copying 1 file to
> > /home/xiaoxia/harmony/buildtest2/build/results/axis2_app/build
> >     [java]
> >     [java] generate.service:
> >     [java]
> >     [java] BUILD FAILED
> >     [java]
> /home/xiaoxia/harmony/buildtest2/tests/axis2_app/build.xml:138:
> > java.util.zip.ZipException: No such file or directory
> >     [java]
> >     [java] Total time: 0 seconds
> >     [echo]
> >     [echo] --------
> >     [echo] WARNING: Target setup of adaptor for Test Suite 'axis2_app'
> > FAILED
> >     [echo] -------- with the following exception:
> >     [echo] The following error occurred while executing this line:
> >     [echo]
> > /home/xiaoxia/harmony/buildtest2/adaptors/axis2_app/adaptor.xml:159: The
> > following error occurred while executing this line:
> >     [echo] /home/xiaoxia/harmony/buildtest2/scripts/framework.xml:1069:
> > Java returned: 1
> >   [delete] Deleting:
> > /home/xiaoxia/harmony/buildtest2/build/temp/null940916999
> >
> > check-status:
> >     [echo]
> >     [echo] ------
> >     [echo] ERROR: Setup of Test Suite 'axis2_app' FAILED.
> >     [echo] ------
> >
> >
> >
> > 2007/7/19, Sean Qiu <sean.xx.qiu@gmail.com>:
> > >
> > > Thanks, Alexey.
> > >
> > > 2007/7/19, Alexey Varlamov <alexey.v.varlamov@gmail.com>:
> > > >
> > > > Sure we need to update it, thanks for the heads up.
> > > >
> > > > 2007/7/19, Sean Qiu < sean.xx.qiu@gmail.com>:
> > > > > I find the JettyScenario test will fail for the invalidate url to
> > > > > jetty-6.1.2rc1.zip in ${root}/adaptor/JettyScenario/parameters.xml
> > > > > The url has been changed from
> > > > > http://dist.codehaus.org/jetty/jetty-6.1.2rc1.zip into
> > > > > http://dist.codehaus.org/jetty/jetty-6.1.x/jetty-6.1.2rc1.zip
> > > > > Shall we update the url to the new one?
> > > > > If so, i will supply the patch later.
> > > > > --
> > > > > Sean Qiu
> > > > >
> > > >
> > >
> > >
> > >
> > > --
> > > Sean Qiu
> >
> >
> >
> >
> > --
> > Sean Qiu
> >
>



-- 
Sean Qiu

Mime
  • Unnamed multipart/alternative (inline, None, 0 bytes)
View raw message