harmony-dev mailing list archives

Site index · List index
Message view « Date » · « Thread »
Top « Date » · « Thread »
From "Spark Shen" <smallsmallor...@gmail.com>
Subject Re: [classlib][beans] PersistenceDelegateTest failures
Date Fri, 20 Jul 2007 09:44:20 GMT
I will look into the issue.

>
>         at org.apache.xerces.util.ErrorHandlerWrapper.fatalError(Unknown
> Source)
>         at org.apache.xerces.impl.XMLErrorReporter.reportError(Unknown
> Source)
>         at org.apache.xerces.impl.XMLErrorReporter.reportError(Unknown
> Source)
>         at org.apache.xerces.impl.XMLScanner.reportFatalError(Unknown
> Source)
>         at org.apache.xerces.impl.XMLScanner.scanXMLDeclOrTextDecl(Unknown
> Source)
>         at
> org.apache.xerces.impl.XMLDocumentFragmentScannerImpl.scanXMLDeclOrTextDecl
> (Unknown
> Source)
>         at
> org.apache.xerces.impl.XMLDocumentScannerImpl$XMLDeclDispatcher.dispatch
> (Unknown
> Source)
>         at
> org.apache.xerces.impl.XMLDocumentFragmentScannerImpl.scanDocument(Unknown
> Source)
>         at org.apache.xerces.parsers.XML11Configuration.parse(Unknown
> Source)
>         at org.apache.xerces.parsers.XML11Configuration.parse(Unknown
> Source)
>         at org.apache.xerces.parsers.XMLParser.parse(Unknown Source)
>         at org.apache.xerces.parsers.AbstractSAXParser.parse(Unknown
> Source)
>         at org.apache.xerces.jaxp.SAXParserImpl$JAXPSAXParser.parse(Unknown
> Source)
>         at org.apache.xerces.jaxp.SAXParserImpl.parse(Unknown Source)
>         at javax.xml.parsers.SAXParser.parse(Unknown Source)
>         at java.beans.XMLDecoder.&lt;init&gt;(XMLDecoder.java:461)
>         at java.beans.XMLDecoder.&lt;init&gt;(XMLDecoder.java:428)
>         at
> org.apache.harmony.beans.tests.java.beans.PersistenceDelegateTest.test_writeObject_Null_LXMLEncoder
> (PersistenceDelegateTest.java:221)
>         at java.lang.reflect.VMReflection.invokeMethod(VMReflection.java)
>         at java.lang.reflect.Method.invoke(Method.java:317)
>         at junit.framework.TestCase.runTest(TestCase.java:154)
>         at junit.framework.TestCase.runBare(TestCase.java:127)
>         at junit.framework.TestResult$1.protect(TestResult.java:106)
>         at junit.framework.TestResult.runProtected(TestResult.java:124)
>         at junit.framework.TestResult.run(TestResult.java:109)
>         at junit.framework.TestCase.run(TestCase.java:118)
>         at junit.framework.TestSuite.runTest(TestSuite.java:208)
>         at junit.framework.TestSuite.run(TestSuite.java:203)
>         at
> org.apache.tools.ant.taskdefs.optional.junit.JUnitTestRunner.run(
> JUnitTestRunner.java:297)
>         at
> org.apache.tools.ant.taskdefs.optional.junit.JUnitTestRunner.launch(
> JUnitTestRunner.java:672)
>         at
> org.apache.tools.ant.taskdefs.optional.junit.JUnitTestRunner.main(
> JUnitTestRunner.java:546)
> Continue...
> org.xml.sax.SAXParseException: The version is required in the XML
> declaration.
>         at org.apache.xerces.parsers.AbstractSAXParser.parse(Unknown
> Source)
>         at org.apache.xerces.jaxp.SAXParserImpl$JAXPSAXParser.parse(Unknown
> Source)
>         at org.apache.xerces.jaxp.SAXParserImpl.parse(Unknown Source)
>         at javax.xml.parsers.SAXParser.parse(Unknown Source)
>         at java.beans.XMLDecoder.&lt;init&gt;(XMLDecoder.java:461)
>         at java.beans.XMLDecoder.&lt;init&gt;(XMLDecoder.java:428)
>         at
> org.apache.harmony.beans.tests.java.beans.PersistenceDelegateTest.test_writeObject_Null_LXMLEncoder
> (PersistenceDelegateTest.java:221)
>         at java.lang.reflect.VMReflection.invokeMethod(VMReflection.java)
>         at java.lang.reflect.Method.invoke(Method.java:317)
>         at junit.framework.TestCase.runTest(TestCase.java:154)
>         at junit.framework.TestCase.runBare(TestCase.java:127)
>         at junit.framework.TestResult$1.protect(TestResult.java:106)
>         at junit.framework.TestResult.runProtected(TestResult.java:124)
>         at junit.framework.TestResult.run(TestResult.java:109)
>         at junit.framework.TestCase.run(TestCase.java:118)
>         at junit.framework.TestSuite.runTest(TestSuite.java:208)
>         at junit.framework.TestSuite.run(TestSuite.java:203)
>         at
> org.apache.tools.ant.taskdefs.optional.junit.JUnitTestRunner.run(
> JUnitTestRunner.java:297)
>         at
> org.apache.tools.ant.taskdefs.optional.junit.JUnitTestRunner.launch(
> JUnitTestRunner.java:672)
>         at
> org.apache.tools.ant.taskdefs.optional.junit.JUnitTestRunner.main(
> JUnitTestRunner.java:546)
> Continue...
> org.xml.sax.SAXParseException: The version is required in the XML
> declaration.
>         at
> org.apache.xerces.util.ErrorHandlerWrapper.createSAXParseException(Unknown
> Source)
>         at org.apache.xerces.util.ErrorHandlerWrapper.fatalError(Unknown
> Source)
>         at org.apache.xerces.impl.XMLErrorReporter.reportError(Unknown
> Source)
>         at org.apache.xerces.impl.XMLErrorReporter.reportError(Unknown
> Source)
>         at org.apache.xerces.impl.XMLScanner.reportFatalError(Unknown
> Source)
>         at org.apache.xerces.impl.XMLScanner.scanXMLDeclOrTextDecl(Unknown
> Source)
>         at
> org.apache.xerces.impl.XMLDocumentFragmentScannerImpl.scanXMLDeclOrTextDecl
> (Unknown
> Source)
>         at
> org.apache.xerces.impl.XMLDocumentScannerImpl$XMLDeclDispatcher.dispatch
> (Unknown
> Source)
>         at
> org.apache.xerces.impl.XMLDocumentFragmentScannerImpl.scanDocument(Unknown
> Source)
>         at org.apache.xerces.parsers.XML11Configuration.parse(Unknown
> Source)
>         at org.apache.xerces.parsers.XML11Configuration.parse(Unknown
> Source)
>         at org.apache.xerces.parsers.XMLParser.parse(Unknown Source)
>         at org.apache.xerces.parsers.AbstractSAXParser.parse(Unknown
> Source)
>         at org.apache.xerces.jaxp.SAXParserImpl$JAXPSAXParser.parse(Unknown
> Source)
>         at org.apache.xerces.jaxp.SAXParserImpl.parse(Unknown Source)
>         at javax.xml.parsers.SAXParser.parse(Unknown Source)
>         at java.beans.XMLDecoder.&lt;init&gt;(XMLDecoder.java:461)
>         at java.beans.XMLDecoder.&lt;init&gt;(XMLDecoder.java:428)
>         at
> org.apache.harmony.beans.tests.java.beans.PersistenceDelegateTest.test_writeObject_java_lang_reflect_Field
> (PersistenceDelegateTest.java:249)
>         at java.lang.reflect.VMReflection.invokeMethod(VMReflection.java)
>         at java.lang.reflect.Method.invoke(Method.java:317)
>         at junit.framework.TestCase.runTest(TestCase.java:154)
>         at junit.framework.TestCase.runBare(TestCase.java:127)
>         at junit.framework.TestResult$1.protect(TestResult.java:106)
>         at junit.framework.TestResult.runProtected(TestResult.java:124)
>         at junit.framework.TestResult.run(TestResult.java:109)
>         at junit.framework.TestCase.run(TestCase.java:118)
>         at junit.framework.TestSuite.runTest(TestSuite.java:208)
>         at junit.framework.TestSuite.run(TestSuite.java:203)
>         at
> org.apache.tools.ant.taskdefs.optional.junit.JUnitTestRunner.run(
> JUnitTestRunner.java:297)
>         at
> org.apache.tools.ant.taskdefs.optional.junit.JUnitTestRunner.launch(
> JUnitTestRunner.java:672)
>         at
> org.apache.tools.ant.taskdefs.optional.junit.JUnitTestRunner.main(
> JUnitTestRunner.java:546)
> Continue...
> org.xml.sax.SAXParseException: The version is required in the XML
> declaration.
>         at org.apache.xerces.parsers.AbstractSAXParser.parse(Unknown
> Source)
>         at org.apache.xerces.jaxp.SAXParserImpl$JAXPSAXParser.parse(Unknown
> Source)
>         at org.apache.xerces.jaxp.SAXParserImpl.parse(Unknown Source)
>         at javax.xml.parsers.SAXParser.parse(Unknown Source)
>         at java.beans.XMLDecoder.&lt;init&gt;(XMLDecoder.java:461)
>         at java.beans.XMLDecoder.&lt;init&gt;(XMLDecoder.java:428)
>         at
> org.apache.harmony.beans.tests.java.beans.PersistenceDelegateTest.test_writeObject_java_lang_reflect_Field
> (PersistenceDelegateTest.java:249)
>         at java.lang.reflect.VMReflection.invokeMethod(VMReflection.java)
>         at java.lang.reflect.Method.invoke(Method.java:317)
>         at junit.framework.TestCase.runTest(TestCase.java:154)
>         at junit.framework.TestCase.runBare(TestCase.java:127)
>         at junit.framework.TestResult$1.protect(TestResult.java:106)
>         at junit.framework.TestResult.runProtected(TestResult.java:124)
>         at junit.framework.TestResult.run(TestResult.java:109)
>         at junit.framework.TestCase.run(TestCase.java:118)
>         at junit.framework.TestSuite.runTest(TestSuite.java:208)
>         at junit.framework.TestSuite.run(TestSuite.java:203)
>         at
> org.apache.tools.ant.taskdefs.optional.junit.JUnitTestRunner.run(
> JUnitTestRunner.java:297)
>         at
> org.apache.tools.ant.taskdefs.optional.junit.JUnitTestRunner.launch(
> JUnitTestRunner.java:672)
>         at
> org.apache.tools.ant.taskdefs.optional.junit.JUnitTestRunner.main(
> JUnitTestRunner.java:546)
> Continue...
> org.xml.sax.SAXParseException: The version is required in the XML
> declaration.
>         at
> org.apache.xerces.util.ErrorHandlerWrapper.createSAXParseException(Unknown
> Source)
>         at org.apache.xerces.util.ErrorHandlerWrapper.fatalError(Unknown
> Source)
>         at org.apache.xerces.impl.XMLErrorReporter.reportError(Unknown
> Source)
>         at org.apache.xerces.impl.XMLErrorReporter.reportError(Unknown
> Source)
>         at org.apache.xerces.impl.XMLScanner.reportFatalError(Unknown
> Source)
>         at org.apache.xerces.impl.XMLScanner.scanXMLDeclOrTextDecl(Unknown
> Source)
>         at
> org.apache.xerces.impl.XMLDocumentFragmentScannerImpl.scanXMLDeclOrTextDecl
> (Unknown
> Source)
>         at
> org.apache.xerces.impl.XMLDocumentScannerImpl$XMLDeclDispatcher.dispatch
> (Unknown
> Source)
>         at
> org.apache.xerces.impl.XMLDocumentFragmentScannerImpl.scanDocument(Unknown
> Source)
>         at org.apache.xerces.parsers.XML11Configuration.parse(Unknown
> Source)
>         at org.apache.xerces.parsers.XML11Configuration.parse(Unknown
> Source)
>         at org.apache.xerces.parsers.XMLParser.parse(Unknown Source)
>         at org.apache.xerces.parsers.AbstractSAXParser.parse(Unknown
> Source)
>         at org.apache.xerces.jaxp.SAXParserImpl$JAXPSAXParser.parse(Unknown
> Source)
>         at org.apache.xerces.jaxp.SAXParserImpl.parse(Unknown Source)
>         at javax.xml.parsers.SAXParser.parse(Unknown Source)
>         at java.beans.XMLDecoder.&lt;init&gt;(XMLDecoder.java:461)
>         at java.beans.XMLDecoder.&lt;init&gt;(XMLDecoder.java:428)
>         at
> org.apache.harmony.beans.tests.java.beans.PersistenceDelegateTest.test_writeObject_java_lang_reflect_Method
> (PersistenceDelegateTest.java:267)
>         at java.lang.reflect.VMReflection.invokeMethod(VMReflection.java)
>         at java.lang.reflect.Method.invoke(Method.java:317)
>         at junit.framework.TestCase.runTest(TestCase.java:154)
>         at junit.framework.TestCase.runBare(TestCase.java:127)
>         at junit.framework.TestResult$1.protect(TestResult.java:106)
>         at junit.framework.TestResult.runProtected(TestResult.java:124)
>         at junit.framework.TestResult.run(TestResult.java:109)
>         at junit.framework.TestCase.run(TestCase.java:118)
>         at junit.framework.TestSuite.runTest(TestSuite.java:208)
>         at junit.framework.TestSuite.run(TestSuite.java:203)
>         at
> org.apache.tools.ant.taskdefs.optional.junit.JUnitTestRunner.run(
> JUnitTestRunner.java:297)
>         at
> org.apache.tools.ant.taskdefs.optional.junit.JUnitTestRunner.launch(
> JUnitTestRunner.java:672)
>         at
> org.apache.tools.ant.taskdefs.optional.junit.JUnitTestRunner.main(
> JUnitTestRunner.java:546)
> Continue...
> org.xml.sax.SAXParseException: The version is required in the XML
> declaration.
>         at org.apache.xerces.parsers.AbstractSAXParser.parse(Unknown
> Source)
>         at org.apache.xerces.jaxp.SAXParserImpl$JAXPSAXParser.parse(Unknown
> Source)
>         at org.apache.xerces.jaxp.SAXParserImpl.parse(Unknown Source)
>         at javax.xml.parsers.SAXParser.parse(Unknown Source)
>         at java.beans.XMLDecoder.&lt;init&gt;(XMLDecoder.java:461)
>         at java.beans.XMLDecoder.&lt;init&gt;(XMLDecoder.java:428)
>         at
> org.apache.harmony.beans.tests.java.beans.PersistenceDelegateTest.test_writeObject_java_lang_reflect_Method
> (PersistenceDelegateTest.java:267)
>         at java.lang.reflect.VMReflection.invokeMethod(VMReflection.java)
>         at java.lang.reflect.Method.invoke(Method.java:317)
>         at junit.framework.TestCase.runTest(TestCase.java:154)
>         at junit.framework.TestCase.runBare(TestCase.java:127)
>         at junit.framework.TestResult$1.protect(TestResult.java:106)
>         at junit.framework.TestResult.runProtected(TestResult.java:124)
>         at junit.framework.TestResult.run(TestResult.java:109)
>         at junit.framework.TestCase.run(TestCase.java:118)
>         at junit.framework.TestSuite.runTest(TestSuite.java:208)
>         at junit.framework.TestSuite.run(TestSuite.java:203)
>         at
> org.apache.tools.ant.taskdefs.optional.junit.JUnitTestRunner.run(
> JUnitTestRunner.java:297)
>         at
> org.apache.tools.ant.taskdefs.optional.junit.JUnitTestRunner.launch(
> JUnitTestRunner.java:672)
>         at
> org.apache.tools.ant.taskdefs.optional.junit.JUnitTestRunner.main(
> JUnitTestRunner.java:546)
> Continue...
> org.xml.sax.SAXParseException: The version is required in the XML
> declaration.
>         at
> org.apache.xerces.util.ErrorHandlerWrapper.createSAXParseException(Unknown
> Source)
>         at org.apache.xerces.util.ErrorHandlerWrapper.fatalError(Unknown
> Source)
>         at org.apache.xerces.impl.XMLErrorReporter.reportError(Unknown
> Source)
>         at org.apache.xerces.impl.XMLErrorReporter.reportError(Unknown
> Source)
>         at org.apache.xerces.impl.XMLScanner.reportFatalError(Unknown
> Source)
>         at org.apache.xerces.impl.XMLScanner.scanXMLDeclOrTextDecl(Unknown
> Source)
>         at
> org.apache.xerces.impl.XMLDocumentFragmentScannerImpl.scanXMLDeclOrTextDecl
> (Unknown
> Source)
>         at
> org.apache.xerces.impl.XMLDocumentScannerImpl$XMLDeclDispatcher.dispatch
> (Unknown
> Source)
>         at
> org.apache.xerces.impl.XMLDocumentFragmentScannerImpl.scanDocument(Unknown
> Source)
>         at org.apache.xerces.parsers.XML11Configuration.parse(Unknown
> Source)
>         at org.apache.xerces.parsers.XML11Configuration.parse(Unknown
> Source)
>         at org.apache.xerces.parsers.XMLParser.parse(Unknown Source)
>         at org.apache.xerces.parsers.AbstractSAXParser.parse(Unknown
> Source)
>         at org.apache.xerces.jaxp.SAXParserImpl$JAXPSAXParser.parse(Unknown
> Source)
>         at org.apache.xerces.jaxp.SAXParserImpl.parse(Unknown Source)
>         at javax.xml.parsers.SAXParser.parse(Unknown Source)
>         at java.beans.XMLDecoder.&lt;init&gt;(XMLDecoder.java:461)
>         at java.beans.XMLDecoder.&lt;init&gt;(XMLDecoder.java:428)
>         at
> org.apache.harmony.beans.tests.java.beans.PersistenceDelegateTest.test_writeObject_java_util_Collection
> (PersistenceDelegateTest.java:288)
>         at java.lang.reflect.VMReflection.invokeMethod(VMReflection.java)
>         at java.lang.reflect.Method.invoke(Method.java:317)
>         at junit.framework.TestCase.runTest(TestCase.java:154)
>         at junit.framework.TestCase.runBare(TestCase.java:127)
>         at junit.framework.TestResult$1.protect(TestResult.java:106)
>         at junit.framework.TestResult.runProtected(TestResult.java:124)
>         at junit.framework.TestResult.run(TestResult.java:109)
>         at junit.framework.TestCase.run(TestCase.java:118)
>         at junit.framework.TestSuite.runTest(TestSuite.java:208)
>         at junit.framework.TestSuite.run(TestSuite.java:203)
>         at
> org.apache.tools.ant.taskdefs.optional.junit.JUnitTestRunner.run(
> JUnitTestRunner.java:297)
>         at
> org.apache.tools.ant.taskdefs.optional.junit.JUnitTestRunner.launch(
> JUnitTestRunner.java:672)
>         at
> org.apache.tools.ant.taskdefs.optional.junit.JUnitTestRunner.main(
> JUnitTestRunner.java:546)
> Continue...
> org.xml.sax.SAXParseException: The version is required in the XML
> declaration.
>         at org.apache.xerces.parsers.AbstractSAXParser.parse(Unknown
> Source)
>         at org.apache.xerces.jaxp.SAXParserImpl$JAXPSAXParser.parse(Unknown
> Source)
>         at org.apache.xerces.jaxp.SAXParserImpl.parse(Unknown Source)
>         at javax.xml.parsers.SAXParser.parse(Unknown Source)
>         at java.beans.XMLDecoder.&lt;init&gt;(XMLDecoder.java:461)
>         at java.beans.XMLDecoder.&lt;init&gt;(XMLDecoder.java:428)
>         at
> org.apache.harmony.beans.tests.java.beans.PersistenceDelegateTest.test_writeObject_java_util_Collection
> (PersistenceDelegateTest.java:288)
>         at java.lang.reflect.VMReflection.invokeMethod(VMReflection.java)
>         at java.lang.reflect.Method.invoke(Method.java:317)
>         at junit.framework.TestCase.runTest(TestCase.java:154)
>         at junit.framework.TestCase.runBare(TestCase.java:127)
>         at junit.framework.TestResult$1.protect(TestResult.java:106)
>         at junit.framework.TestResult.runProtected(TestResult.java:124)
>         at junit.framework.TestResult.run(TestResult.java:109)
>         at junit.framework.TestCase.run(TestCase.java:118)
>         at junit.framework.TestSuite.runTest(TestSuite.java:208)
>         at junit.framework.TestSuite.run(TestSuite.java:203)
>         at
> org.apache.tools.ant.taskdefs.optional.junit.JUnitTestRunner.run(
> JUnitTestRunner.java:297)
>         at
> org.apache.tools.ant.taskdefs.optional.junit.JUnitTestRunner.launch(
> JUnitTestRunner.java:672)
>         at
> org.apache.tools.ant.taskdefs.optional.junit.JUnitTestRunner.main(
> JUnitTestRunner.java:546)
> Continue...
> Exception during encoding:java.awt.IllegalComponentStateException: no
> parent
> Continue...
> Exception during encoding:java.awt.IllegalComponentStateException: no
> parent
> Continue...
> org.xml.sax.SAXParseException: The version is required in the XML
> declaration.
>         at
> org.apache.xerces.util.ErrorHandlerWrapper.createSAXParseException(Unknown
> Source)
>         at org.apache.xerces.util.ErrorHandlerWrapper.fatalError(Unknown
> Source)
>         at org.apache.xerces.impl.XMLErrorReporter.reportError(Unknown
> Source)
>         at org.apache.xerces.impl.XMLErrorReporter.reportError(Unknown
> Source)
>         at org.apache.xerces.impl.XMLScanner.reportFatalError(Unknown
> Source)
>         at org.apache.xerces.impl.XMLScanner.scanXMLDeclOrTextDecl(Unknown
> Source)
>         at
> org.apache.xerces.impl.XMLDocumentFragmentScannerImpl.scanXMLDeclOrTextDecl
> (Unknown
> Source)
>         at
> org.apache.xerces.impl.XMLDocumentScannerImpl$XMLDeclDispatcher.dispatch
> (Unknown
> Source)
>         at
> org.apache.xerces.impl.XMLDocumentFragmentScannerImpl.scanDocument(Unknown
> Source)
>         at org.apache.xerces.parsers.XML11Configuration.parse(Unknown
> Source)
>         at org.apache.xerces.parsers.XML11Configuration.parse(Unknown
> Source)
>         at org.apache.xerces.parsers.XMLParser.parse(Unknown Source)
>         at org.apache.xerces.parsers.AbstractSAXParser.parse(Unknown
> Source)
>         at org.apache.xerces.jaxp.SAXParserImpl$JAXPSAXParser.parse(Unknown
> Source)
>         at org.apache.xerces.jaxp.SAXParserImpl.parse(Unknown Source)
>         at javax.xml.parsers.SAXParser.parse(Unknown Source)
>         at java.beans.XMLDecoder.&lt;init&gt;(XMLDecoder.java:461)
>         at java.beans.XMLDecoder.&lt;init&gt;(XMLDecoder.java:428)
>         at
> org.apache.harmony.beans.tests.java.beans.PersistenceDelegateTest.test_writeObject_java_awt_Choice
> (PersistenceDelegateTest.java:368)
>         at java.lang.reflect.VMReflection.invokeMethod(VMReflection.java)
>         at java.lang.reflect.Method.invoke(Method.java:317)
>         at junit.framework.TestCase.runTest(TestCase.java:154)
>         at junit.framework.TestCase.runBare(TestCase.java:127)
>         at junit.framework.TestResult$1.protect(TestResult.java:106)
>         at junit.framework.TestResult.runProtected(TestResult.java:124)
>         at junit.framework.TestResult.run(TestResult.java:109)
>         at junit.framework.TestCase.run(TestCase.java:118)
>         at junit.framework.TestSuite.runTest(TestSuite.java:208)
>         at junit.framework.TestSuite.run(TestSuite.java:203)
>         at
> org.apache.tools.ant.taskdefs.optional.junit.JUnitTestRunner.run(
> JUnitTestRunner.java:297)
>         at
> org.apache.tools.ant.taskdefs.optional.junit.JUnitTestRunner.launch(
> JUnitTestRunner.java:672)
>         at
> org.apache.tools.ant.taskdefs.optional.junit.JUnitTestRunner.main(
> JUnitTestRunner.java:546)
> Continue...
> org.xml.sax.SAXParseException: The version is required in the XML
> declaration.
>         at org.apache.xerces.parsers.AbstractSAXParser.parse(Unknown
> Source)
>         at org.apache.xerces.jaxp.SAXParserImpl$JAXPSAXParser.parse(Unknown
> Source)
>         at org.apache.xerces.jaxp.SAXParserImpl.parse(Unknown Source)
>         at javax.xml.parsers.SAXParser.parse(Unknown Source)
>         at java.beans.XMLDecoder.&lt;init&gt;(XMLDecoder.java:461)
>         at java.beans.XMLDecoder.&lt;init&gt;(XMLDecoder.java:428)
>         at
> org.apache.harmony.beans.tests.java.beans.PersistenceDelegateTest.test_writeObject_java_awt_Choice
> (PersistenceDelegateTest.java:368)
>         at java.lang.reflect.VMReflection.invokeMethod(VMReflection.java)
>         at java.lang.reflect.Method.invoke(Method.java:317)
>         at junit.framework.TestCase.runTest(TestCase.java:154)
>         at junit.framework.TestCase.runBare(TestCase.java:127)
>         at junit.framework.TestResult$1.protect(TestResult.java:106)
>         at junit.framework.TestResult.runProtected(TestResult.java:124)
>         at junit.framework.TestResult.run(TestResult.java:109)
>         at junit.framework.TestCase.run(TestCase.java:118)
>         at junit.framework.TestSuite.runTest(TestSuite.java:208)
>         at junit.framework.TestSuite.run(TestSuite.java:203)
>         at
> org.apache.tools.ant.taskdefs.optional.junit.JUnitTestRunner.run(
> JUnitTestRunner.java:297)
>         at
> org.apache.tools.ant.taskdefs.optional.junit.JUnitTestRunner.launch(
> JUnitTestRunner.java:672)
>         at
> org.apache.tools.ant.taskdefs.optional.junit.JUnitTestRunner.main(
> JUnitTestRunner.java:546)
> Continue...
> org.xml.sax.SAXParseException: The version is required in the XML
> declaration.
>         at
> org.apache.xerces.util.ErrorHandlerWrapper.createSAXParseException(Unknown
> Source)
>         at org.apache.xerces.util.ErrorHandlerWrapper.fatalError(Unknown
> Source)
>         at org.apache.xerces.impl.XMLErrorReporter.reportError(Unknown
> Source)
>         at org.apache.xerces.impl.XMLErrorReporter.reportError(Unknown
> Source)
>         at org.apache.xerces.impl.XMLScanner.reportFatalError(Unknown
> Source)
>         at org.apache.xerces.impl.XMLScanner.scanXMLDeclOrTextDecl(Unknown
> Source)
>         at
> org.apache.xerces.impl.XMLDocumentFragmentScannerImpl.scanXMLDeclOrTextDecl
> (Unknown
> Source)
>         at
> org.apache.xerces.impl.XMLDocumentScannerImpl$XMLDeclDispatcher.dispatch
> (Unknown
> Source)
>         at
> org.apache.xerces.impl.XMLDocumentFragmentScannerImpl.scanDocument(Unknown
> Source)
>         at org.apache.xerces.parsers.XML11Configuration.parse(Unknown
> Source)
>         at org.apache.xerces.parsers.XML11Configuration.parse(Unknown
> Source)
>         at org.apache.xerces.parsers.XMLParser.parse(Unknown Source)
>         at org.apache.xerces.parsers.AbstractSAXParser.parse(Unknown
> Source)
>         at org.apache.xerces.jaxp.SAXParserImpl$JAXPSAXParser.parse(Unknown
> Source)
>         at org.apache.xerces.jaxp.SAXParserImpl.parse(Unknown Source)
>         at javax.xml.parsers.SAXParser.parse(Unknown Source)
>         at java.beans.XMLDecoder.&lt;init&gt;(XMLDecoder.java:461)
>         at java.beans.XMLDecoder.&lt;init&gt;(XMLDecoder.java:428)
>         at
> org.apache.harmony.beans.tests.java.beans.PersistenceDelegateTest.test_writeObject_java_awt_SystemColor
> (PersistenceDelegateTest.java:437)
>         at java.lang.reflect.VMReflection.invokeMethod(VMReflection.java)
>         at java.lang.reflect.Method.invoke(Method.java:317)
>         at junit.framework.TestCase.runTest(TestCase.java:154)
>         at junit.framework.TestCase.runBare(TestCase.java:127)
>         at junit.framework.TestResult$1.protect(TestResult.java:106)
>         at junit.framework.TestResult.runProtected(TestResult.java:124)
>         at junit.framework.TestResult.run(TestResult.java:109)
>         at junit.framework.TestCase.run(TestCase.java:118)
>         at junit.framework.TestSuite.runTest(TestSuite.java:208)
>         at junit.framework.TestSuite.run(TestSuite.java:203)
>         at
> org.apache.tools.ant.taskdefs.optional.junit.JUnitTestRunner.run(
> JUnitTestRunner.java:297)
>         at
> org.apache.tools.ant.taskdefs.optional.junit.JUnitTestRunner.launch(
> JUnitTestRunner.java:672)
>         at
> org.apache.tools.ant.taskdefs.optional.junit.JUnitTestRunner.main(
> JUnitTestRunner.java:546)
> Continue...
> org.xml.sax.SAXParseException: The version is required in the XML
> declaration.
>         at org.apache.xerces.parsers.AbstractSAXParser.parse(Unknown
> Source)
>         at org.apache.xerces.jaxp.SAXParserImpl$JAXPSAXParser.parse(Unknown
> Source)
>         at org.apache.xerces.jaxp.SAXParserImpl.parse(Unknown Source)
>         at javax.xml.parsers.SAXParser.parse(Unknown Source)
>         at java.beans.XMLDecoder.&lt;init&gt;(XMLDecoder.java:461)
>         at java.beans.XMLDecoder.&lt;init&gt;(XMLDecoder.java:428)
>         at
> org.apache.harmony.beans.tests.java.beans.PersistenceDelegateTest.test_writeObject_java_awt_SystemColor
> (PersistenceDelegateTest.java:437)
>         at java.lang.reflect.VMReflection.invokeMethod(VMReflection.java)
>         at java.lang.reflect.Method.invoke(Method.java:317)
>         at junit.framework.TestCase.runTest(TestCase.java:154)
>         at junit.framework.TestCase.runBare(TestCase.java:127)
>         at junit.framework.TestResult$1.protect(TestResult.java:106)
>         at junit.framework.TestResult.runProtected(TestResult.java:124)
>         at junit.framework.TestResult.run(TestResult.java:109)
>         at junit.framework.TestCase.run(TestCase.java:118)
>         at junit.framework.TestSuite.runTest(TestSuite.java:208)
>         at junit.framework.TestSuite.run(TestSuite.java:203)
>         at
> org.apache.tools.ant.taskdefs.optional.junit.JUnitTestRunner.run(
> JUnitTestRunner.java:297)
>         at
> org.apache.tools.ant.taskdefs.optional.junit.JUnitTestRunner.launch(
> JUnitTestRunner.java:672)
>         at
> org.apache.tools.ant.taskdefs.optional.junit.JUnitTestRunner.main(
> JUnitTestRunner.java:546)
> Continue...
> org.xml.sax.SAXParseException: The version is required in the XML
> declaration.
>         at
> org.apache.xerces.util.ErrorHandlerWrapper.createSAXParseException(Unknown
> Source)
>         at org.apache.xerces.util.ErrorHandlerWrapper.fatalError(Unknown
> Source)
>         at org.apache.xerces.impl.XMLErrorReporter.reportError(Unknown
> Source)
>         at org.apache.xerces.impl.XMLErrorReporter.reportError(Unknown
> Source)
>         at org.apache.xerces.impl.XMLScanner.reportFatalError(Unknown
> Source)
>         at org.apache.xerces.impl.XMLScanner.scanXMLDeclOrTextDecl(Unknown
> Source)
>         at
> org.apache.xerces.impl.XMLDocumentFragmentScannerImpl.scanXMLDeclOrTextDecl
> (Unknown
> Source)
>         at
> org.apache.xerces.impl.XMLDocumentScannerImpl$XMLDeclDispatcher.dispatch
> (Unknown
> Source)
>         at
> org.apache.xerces.impl.XMLDocumentFragmentScannerImpl.scanDocument(Unknown
> Source)
>         at org.apache.xerces.parsers.XML11Configuration.parse(Unknown
> Source)
>         at org.apache.xerces.parsers.XML11Configuration.parse(Unknown
> Source)
>         at org.apache.xerces.parsers.XMLParser.parse(Unknown Source)
>         at org.apache.xerces.parsers.AbstractSAXParser.parse(Unknown
> Source)
>         at org.apache.xerces.jaxp.SAXParserImpl$JAXPSAXParser.parse(Unknown
> Source)
>         at org.apache.xerces.jaxp.SAXParserImpl.parse(Unknown Source)
>         at javax.xml.parsers.SAXParser.parse(Unknown Source)
>         at java.beans.XMLDecoder.&lt;init&gt;(XMLDecoder.java:461)
>         at java.beans.XMLDecoder.&lt;init&gt;(XMLDecoder.java:428)
>         at
> org.apache.harmony.beans.tests.java.beans.PersistenceDelegateTest.test_writeObject_java_awt_font_TextAttribute
> (PersistenceDelegateTest.java:451)
>         at java.lang.reflect.VMReflection.invokeMethod(VMReflection.java)
>         at java.lang.reflect.Method.invoke(Method.java:317)
>         at junit.framework.TestCase.runTest(TestCase.java:154)
>         at junit.framework.TestCase.runBare(TestCase.java:127)
>         at junit.framework.TestResult$1.protect(TestResult.java:106)
>         at junit.framework.TestResult.runProtected(TestResult.java:124)
>         at junit.framework.TestResult.run(TestResult.java:109)
>         at junit.framework.TestCase.run(TestCase.java:118)
>         at junit.framework.TestSuite.runTest(TestSuite.java:208)
>         at junit.framework.TestSuite.run(TestSuite.java:203)
>         at
> org.apache.tools.ant.taskdefs.optional.junit.JUnitTestRunner.run(
> JUnitTestRunner.java:297)
>         at
> org.apache.tools.ant.taskdefs.optional.junit.JUnitTestRunner.launch(
> JUnitTestRunner.java:672)
>         at
> org.apache.tools.ant.taskdefs.optional.junit.JUnitTestRunner.main(
> JUnitTestRunner.java:546)
> Continue...
> org.xml.sax.SAXParseException: The version is required in the XML
> declaration.
>         at org.apache.xerces.parsers.AbstractSAXParser.parse(Unknown
> Source)
>         at org.apache.xerces.jaxp.SAXParserImpl$JAXPSAXParser.parse(Unknown
> Source)
>         at org.apache.xerces.jaxp.SAXParserImpl.parse(Unknown Source)
>         at javax.xml.parsers.SAXParser.parse(Unknown Source)
>         at java.beans.XMLDecoder.&lt;init&gt;(XMLDecoder.java:461)
>         at java.beans.XMLDecoder.&lt;init&gt;(XMLDecoder.java:428)
>         at
> org.apache.harmony.beans.tests.java.beans.PersistenceDelegateTest.test_writeObject_java_awt_font_TextAttribute
> (PersistenceDelegateTest.java:451)
>         at java.lang.reflect.VMReflection.invokeMethod(VMReflection.java)
>         at java.lang.reflect.Method.invoke(Method.java:317)
>         at junit.framework.TestCase.runTest(TestCase.java:154)
>         at junit.framework.TestCase.runBare(TestCase.java:127)
>         at junit.framework.TestResult$1.protect(TestResult.java:106)
>         at junit.framework.TestResult.runProtected(TestResult.java:124)
>         at junit.framework.TestResult.run(TestResult.java:109)
>         at junit.framework.TestCase.run(TestCase.java:118)
>         at junit.framework.TestSuite.runTest(TestSuite.java:208)
>         at junit.framework.TestSuite.run(TestSuite.java:203)
>         at
> org.apache.tools.ant.taskdefs.optional.junit.JUnitTestRunner.run(
> JUnitTestRunner.java:297)
>         at
> org.apache.tools.ant.taskdefs.optional.junit.JUnitTestRunner.launch(
> JUnitTestRunner.java:672)
>         at
> org.apache.tools.ant.taskdefs.optional.junit.JUnitTestRunner.main(
> JUnitTestRunner.java:546)
> Continue...
> org.xml.sax.SAXParseException: The version is required in the XML
> declaration.
>         at
> org.apache.xerces.util.ErrorHandlerWrapper.createSAXParseException(Unknown
> Source)
>         at org.apache.xerces.util.ErrorHandlerWrapper.fatalError(Unknown
> Source)
>         at org.apache.xerces.impl.XMLErrorReporter.reportError(Unknown
> Source)
>         at org.apache.xerces.impl.XMLErrorReporter.reportError(Unknown
> Source)
>         at org.apache.xerces.impl.XMLScanner.reportFatalError(Unknown
> Source)
>         at org.apache.xerces.impl.XMLScanner.scanXMLDeclOrTextDecl(Unknown
> Source)
>         at
> org.apache.xerces.impl.XMLDocumentFragmentScannerImpl.scanXMLDeclOrTextDecl
> (Unknown
> Source)
>         at
> org.apache.xerces.impl.XMLDocumentScannerImpl$XMLDeclDispatcher.dispatch
> (Unknown
> Source)
>         at
> org.apache.xerces.impl.XMLDocumentFragmentScannerImpl.scanDocument(Unknown
> Source)
>         at org.apache.xerces.parsers.XML11Configuration.parse(Unknown
> Source)
>         at org.apache.xerces.parsers.XML11Configuration.parse(Unknown
> Source)
>         at org.apache.xerces.parsers.XMLParser.parse(Unknown Source)
>         at org.apache.xerces.parsers.AbstractSAXParser.parse(Unknown
> Source)
>         at org.apache.xerces.jaxp.SAXParserImpl$JAXPSAXParser.parse(Unknown
> Source)
>         at org.apache.xerces.jaxp.SAXParserImpl.parse(Unknown Source)
>         at javax.xml.parsers.SAXParser.parse(Unknown Source)
>         at java.beans.XMLDecoder.&lt;init&gt;(XMLDecoder.java:461)
>         at java.beans.XMLDecoder.&lt;init&gt;(XMLDecoder.java:428)
>         at
> org.apache.harmony.beans.tests.java.beans.PersistenceDelegateTest.test_writeObject_java_awt_MenuShortcut
> (PersistenceDelegateTest.java:466)
>         at java.lang.reflect.VMReflection.invokeMethod(VMReflection.java)
>         at java.lang.reflect.Method.invoke(Method.java:317)
>         at junit.framework.TestCase.runTest(TestCase.java:154)
>         at junit.framework.TestCase.runBare(TestCase.java:127)
>         at junit.framework.TestResult$1.protect(TestResult.java:106)
>         at junit.framework.TestResult.runProtected(TestResult.java:124)
>         at junit.framework.TestResult.run(TestResult.java:109)
>         at junit.framework.TestCase.run(TestCase.java:118)
>         at junit.framework.TestSuite.runTest(TestSuite.java:208)
>         at junit.framework.TestSuite.run(TestSuite.java:203)
>         at
> org.apache.tools.ant.taskdefs.optional.junit.JUnitTestRunner.run(
> JUnitTestRunner.java:297)
>         at
> org.apache.tools.ant.taskdefs.optional.junit.JUnitTestRunner.launch(
> JUnitTestRunner.java:672)
>         at
> org.apache.tools.ant.taskdefs.optional.junit.JUnitTestRunner.main(
> JUnitTestRunner.java:546)
> Continue...
> org.xml.sax.SAXParseException: The version is required in the XML
> declaration.
>         at org.apache.xerces.parsers.AbstractSAXParser.parse(Unknown
> Source)
>         at org.apache.xerces.jaxp.SAXParserImpl$JAXPSAXParser.parse(Unknown
> Source)
>         at org.apache.xerces.jaxp.SAXParserImpl.parse(Unknown Source)
>         at javax.xml.parsers.SAXParser.parse(Unknown Source)
>         at java.beans.XMLDecoder.&lt;init&gt;(XMLDecoder.java:461)
>         at java.beans.XMLDecoder.&lt;init&gt;(XMLDecoder.java:428)
>         at
> org.apache.harmony.beans.tests.java.beans.PersistenceDelegateTest.test_writeObject_java_awt_MenuShortcut
> (PersistenceDelegateTest.java:466)
>         at java.lang.reflect.VMReflection.invokeMethod(VMReflection.java)
>         at java.lang.reflect.Method.invoke(Method.java:317)
>         at junit.framework.TestCase.runTest(TestCase.java:154)
>         at junit.framework.TestCase.runBare(TestCase.java:127)
>         at junit.framework.TestResult$1.protect(TestResult.java:106)
>         at junit.framework.TestResult.runProtected(TestResult.java:124)
>         at junit.framework.TestResult.run(TestResult.java:109)
>         at junit.framework.TestCase.run(TestCase.java:118)
>         at junit.framework.TestSuite.runTest(TestSuite.java:208)
>         at junit.framework.TestSuite.run(TestSuite.java:203)
>         at
> org.apache.tools.ant.taskdefs.optional.junit.JUnitTestRunner.run(
> JUnitTestRunner.java:297)
>         at
> org.apache.tools.ant.taskdefs.optional.junit.JUnitTestRunner.launch(
> JUnitTestRunner.java:672)
>         at
> org.apache.tools.ant.taskdefs.optional.junit.JUnitTestRunner.main(
> JUnitTestRunner.java:546)
> Continue...
> Exception during encoding:java.lang.Exception: failed to write
> expression: Locale=PersistenceDelegateTest$MockComponent.getLocale();
> Continue...
> Exception during encoding:java.awt.IllegalComponentStateException: no
> parent
> Continue...
> Exception during encoding:java.lang.Exception: failed to write
> expression: Locale=PersistenceDelegateTest$MockComponent.getLocale();
> Continue...
> Exception during encoding:java.awt.IllegalComponentStateException: no
> parent
> Continue...
> org.xml.sax.SAXParseException: The version is required in the XML
> declaration.
>         at
> org.apache.xerces.util.ErrorHandlerWrapper.createSAXParseException(Unknown
> Source)
>         at org.apache.xerces.util.ErrorHandlerWrapper.fatalError(Unknown
> Source)
>         at org.apache.xerces.impl.XMLErrorReporter.reportError(Unknown
> Source)
>         at org.apache.xerces.impl.XMLErrorReporter.reportError(Unknown
> Source)
>         at org.apache.xerces.impl.XMLScanner.reportFatalError(Unknown
> Source)
>         at org.apache.xerces.impl.XMLScanner.scanXMLDeclOrTextDecl(Unknown
> Source)
>         at
> org.apache.xerces.impl.XMLDocumentFragmentScannerImpl.scanXMLDeclOrTextDecl
> (Unknown
> Source)
>         at
> org.apache.xerces.impl.XMLDocumentScannerImpl$XMLDeclDispatcher.dispatch
> (Unknown
> Source)
>         at
> org.apache.xerces.impl.XMLDocumentFragmentScannerImpl.scanDocument(Unknown
> Source)
>         at org.apache.xerces.parsers.XML11Configuration.parse(Unknown
> Source)
>         at org.apache.xerces.parsers.XML11Configuration.parse(Unknown
> Source)
>         at org.apache.xerces.parsers.XMLParser.parse(Unknown Source)
>         at org.apache.xerces.parsers.AbstractSAXParser.parse(Unknown
> Source)
>         at org.apache.xerces.jaxp.SAXParserImpl$JAXPSAXParser.parse(Unknown
> Source)
>         at org.apache.xerces.jaxp.SAXParserImpl.parse(Unknown Source)
>         at javax.xml.parsers.SAXParser.parse(Unknown Source)
>         at java.beans.XMLDecoder.&lt;init&gt;(XMLDecoder.java:461)
>         at java.beans.XMLDecoder.&lt;init&gt;(XMLDecoder.java:428)
>         at
> org.apache.harmony.beans.tests.java.beans.PersistenceDelegateTest.test_writeObject_java_awt_Component
> (PersistenceDelegateTest.java:504)
>         at java.lang.reflect.VMReflection.invokeMethod(VMReflection.java)
>         at java.lang.reflect.Method.invoke(Method.java:317)
>         at junit.framework.TestCase.runTest(TestCase.java:154)
>         at junit.framework.TestCase.runBare(TestCase.java:127)
>         at junit.framework.TestResult$1.protect(TestResult.java:106)
>         at junit.framework.TestResult.runProtected(TestResult.java:124)
>         at junit.framework.TestResult.run(TestResult.java:109)
>         at junit.framework.TestCase.run(TestCase.java:118)
>         at junit.framework.TestSuite.runTest(TestSuite.java:208)
>         at junit.framework.TestSuite.run(TestSuite.java:203)
>         at
> org.apache.tools.ant.taskdefs.optional.junit.JUnitTestRunner.run(
> JUnitTestRunner.java:297)
>         at
> org.apache.tools.ant.taskdefs.optional.junit.JUnitTestRunner.launch(
> JUnitTestRunner.java:672)
>         at
> org.apache.tools.ant.taskdefs.optional.junit.JUnitTestRunner.main(
> JUnitTestRunner.java:546)
> Continue...
> org.xml.sax.SAXParseException: The version is required in the XML
> declaration.
>         at org.apache.xerces.parsers.AbstractSAXParser.parse(Unknown
> Source)
>         at org.apache.xerces.jaxp.SAXParserImpl$JAXPSAXParser.parse(Unknown
> Source)
>         at org.apache.xerces.jaxp.SAXParserImpl.parse(Unknown Source)
>         at javax.xml.parsers.SAXParser.parse(Unknown Source)
>         at java.beans.XMLDecoder.&lt;init&gt;(XMLDecoder.java:461)
>         at java.beans.XMLDecoder.&lt;init&gt;(XMLDecoder.java:428)
>         at
> org.apache.harmony.beans.tests.java.beans.PersistenceDelegateTest.test_writeObject_java_awt_Component
> (PersistenceDelegateTest.java:504)
>         at java.lang.reflect.VMReflection.invokeMethod(VMReflection.java)
>         at java.lang.reflect.Method.invoke(Method.java:317)
>         at junit.framework.TestCase.runTest(TestCase.java:154)
>         at junit.framework.TestCase.runBare(TestCase.java:127)
>         at junit.framework.TestResult$1.protect(TestResult.java:106)
>         at junit.framework.TestResult.runProtected(TestResult.java:124)
>         at junit.framework.TestResult.run(TestResult.java:109)
>         at junit.framework.TestCase.run(TestCase.java:118)
>         at junit.framework.TestSuite.runTest(TestSuite.java:208)
>         at junit.framework.TestSuite.run(TestSuite.java:203)
>         at
> org.apache.tools.ant.taskdefs.optional.junit.JUnitTestRunner.run(
> JUnitTestRunner.java:297)
>         at
> org.apache.tools.ant.taskdefs.optional.junit.JUnitTestRunner.launch(
> JUnitTestRunner.java:672)
>         at
> org.apache.tools.ant.taskdefs.optional.junit.JUnitTestRunner.main(
> JUnitTestRunner.java:546)
> Continue...
> Exception during encoding:java.lang.Exception: failed to write
> expression: Locale=Container.getLocale();
> Continue...
> Exception during encoding:java.awt.IllegalComponentStateException: no
> parent
> Continue...
> Exception during encoding:java.lang.Exception: failed to write
> expression: Locale=Label.getLocale();
> Continue...
> Exception during encoding:java.awt.IllegalComponentStateException: no
> parent
> Continue...
> Exception during encoding:java.lang.Exception: failed to write
> expression: Locale=Label.getLocale();
> Continue...
> Exception during encoding:java.awt.IllegalComponentStateException: no
> parent
> Continue...
> Exception during encoding:java.lang.Exception: failed to write
> expression: Locale=Container.getLocale();
> Continue...
> Exception during encoding:java.awt.IllegalComponentStateException: no
> parent
> Continue...
> org.xml.sax.SAXParseException: The version is required in the XML
> declaration.
>         at
> org.apache.xerces.util.ErrorHandlerWrapper.createSAXParseException(Unknown
> Source)
>         at org.apache.xerces.util.ErrorHandlerWrapper.fatalError(Unknown
> Source)
>         at org.apache.xerces.impl.XMLErrorReporter.reportError(Unknown
> Source)
>         at org.apache.xerces.impl.XMLErrorReporter.reportError(Unknown
> Source)
>         at org.apache.xerces.impl.XMLScanner.reportFatalError(Unknown
> Source)
>         at org.apache.xerces.impl.XMLScanner.scanXMLDeclOrTextDecl(Unknown
> Source)
>         at
> org.apache.xerces.impl.XMLDocumentFragmentScannerImpl.scanXMLDeclOrTextDecl
> (Unknown
> Source)
>         at
> org.apache.xerces.impl.XMLDocumentScannerImpl$XMLDeclDispatcher.dispatch
> (Unknown
> Source)
>         at
> org.apache.xerces.impl.XMLDocumentFragmentScannerImpl.scanDocument(Unknown
> Source)
>         at org.apache.xerces.parsers.XML11Configuration.parse(Unknown
> Source)
>         at org.apache.xerces.parsers.XML11Configuration.parse(Unknown
> Source)
>         at org.apache.xerces.parsers.XMLParser.parse(Unknown Source)
>         at org.apache.xerces.parsers.AbstractSAXParser.parse(Unknown
> Source)
>         at org.apache.xerces.jaxp.SAXParserImpl$JAXPSAXParser.parse(Unknown
> Source)
>         at org.apache.xerces.jaxp.SAXParserImpl.parse(Unknown Source)
>         at javax.xml.parsers.SAXParser.parse(Unknown Source)
>         at java.beans.XMLDecoder.&lt;init&gt;(XMLDecoder.java:461)
>         at java.beans.XMLDecoder.&lt;init&gt;(XMLDecoder.java:428)
>         at
> org.apache.harmony.beans.tests.java.beans.PersistenceDelegateTest.test_writeObject_java_awt_Container
> (PersistenceDelegateTest.java:549)
>         at java.lang.reflect.VMReflection.invokeMethod(VMReflection.java)
>         at java.lang.reflect.Method.invoke(Method.java:317)
>         at junit.framework.TestCase.runTest(TestCase.java:154)
>         at junit.framework.TestCase.runBare(TestCase.java:127)
>         at junit.framework.TestResult$1.protect(TestResult.java:106)
>         at junit.framework.TestResult.runProtected(TestResult.java:124)
>         at junit.framework.TestResult.run(TestResult.java:109)
>         at junit.framework.TestCase.run(TestCase.java:118)
>         at junit.framework.TestSuite.runTest(TestSuite.java:208)
>         at junit.framework.TestSuite.run(TestSuite.java:203)
>         at
> org.apache.tools.ant.taskdefs.optional.junit.JUnitTestRunner.run(
> JUnitTestRunner.java:297)
>         at
> org.apache.tools.ant.taskdefs.optional.junit.JUnitTestRunner.launch(
> JUnitTestRunner.java:672)
>         at
> org.apache.tools.ant.taskdefs.optional.junit.JUnitTestRunner.main(
> JUnitTestRunner.java:546)
> Continue...
> org.xml.sax.SAXParseException: The version is required in the XML
> declaration.
>         at org.apache.xerces.parsers.AbstractSAXParser.parse(Unknown
> Source)
>         at org.apache.xerces.jaxp.SAXParserImpl$JAXPSAXParser.parse(Unknown
> Source)
>         at org.apache.xerces.jaxp.SAXParserImpl.parse(Unknown Source)
>         at javax.xml.parsers.SAXParser.parse(Unknown Source)
>         at java.beans.XMLDecoder.&lt;init&gt;(XMLDecoder.java:461)
>         at java.beans.XMLDecoder.&lt;init&gt;(XMLDecoder.java:428)
>         at
> org.apache.harmony.beans.tests.java.beans.PersistenceDelegateTest.test_writeObject_java_awt_Container
> (PersistenceDelegateTest.java:549)
>         at java.lang.reflect.VMReflection.invokeMethod(VMReflection.java)
>         at java.lang.reflect.Method.invoke(Method.java:317)
>         at junit.framework.TestCase.runTest(TestCase.java:154)
>         at junit.framework.TestCase.runBare(TestCase.java:127)
>         at junit.framework.TestResult$1.protect(TestResult.java:106)
>         at junit.framework.TestResult.runProtected(TestResult.java:124)
>         at junit.framework.TestResult.run(TestResult.java:109)
>         at junit.framework.TestCase.run(TestCase.java:118)
>         at junit.framework.TestSuite.runTest(TestSuite.java:208)
>         at junit.framework.TestSuite.run(TestSuite.java:203)
>         at
> org.apache.tools.ant.taskdefs.optional.junit.JUnitTestRunner.run(
> JUnitTestRunner.java:297)
>         at
> org.apache.tools.ant.taskdefs.optional.junit.JUnitTestRunner.launch(
> JUnitTestRunner.java:672)
>         at
> org.apache.tools.ant.taskdefs.optional.junit.JUnitTestRunner.main(
> JUnitTestRunner.java:546)
> Continue...
> org.xml.sax.SAXParseException: The version is required in the XML
> declaration.
>         at
> org.apache.xerces.util.ErrorHandlerWrapper.createSAXParseException(Unknown
> Source)
>         at org.apache.xerces.util.ErrorHandlerWrapper.fatalError(Unknown
> Source)
>         at org.apache.xerces.impl.XMLErrorReporter.reportError(Unknown
> Source)
>         at org.apache.xerces.impl.XMLErrorReporter.reportError(Unknown
> Source)
>         at org.apache.xerces.impl.XMLScanner.reportFatalError(Unknown
> Source)
>         at org.apache.xerces.impl.XMLScanner.scanXMLDeclOrTextDecl(Unknown
> Source)
>         at
> org.apache.xerces.impl.XMLDocumentFragmentScannerImpl.scanXMLDeclOrTextDecl
> (Unknown
> Source)
>         at
> org.apache.xerces.impl.XMLDocumentScannerImpl$XMLDeclDispatcher.dispatch
> (Unknown
> Source)
>         at
> org.apache.xerces.impl.XMLDocumentFragmentScannerImpl.scanDocument(Unknown
> Source)
>         at org.apache.xerces.parsers.XML11Configuration.parse(Unknown
> Source)
>         at org.apache.xerces.parsers.XML11Configuration.parse(Unknown
> Source)
>         at org.apache.xerces.parsers.XMLParser.parse(Unknown Source)
>         at org.apache.xerces.parsers.AbstractSAXParser.parse(Unknown
> Source)
>         at org.apache.xerces.jaxp.SAXParserImpl$JAXPSAXParser.parse(Unknown
> Source)
>         at org.apache.xerces.jaxp.SAXParserImpl.parse(Unknown Source)
>         at javax.xml.parsers.SAXParser.parse(Unknown Source)
>         at java.beans.XMLDecoder.&lt;init&gt;(XMLDecoder.java:461)
>         at java.beans.XMLDecoder.&lt;init&gt;(XMLDecoder.java:428)
>         at
> org.apache.harmony.beans.tests.java.beans.PersistenceDelegateTest.test_writeObject_java_awt_Menu
> (PersistenceDelegateTest.java:606)
>         at java.lang.reflect.VMReflection.invokeMethod(VMReflection.java)
>         at java.lang.reflect.Method.invoke(Method.java:317)
>         at junit.framework.TestCase.runTest(TestCase.java:154)
>         at junit.framework.TestCase.runBare(TestCase.java:127)
>         at junit.framework.TestResult$1.protect(TestResult.java:106)
>         at junit.framework.TestResult.runProtected(TestResult.java:124)
>         at junit.framework.TestResult.run(TestResult.java:109)
>         at junit.framework.TestCase.run(TestCase.java:118)
>         at junit.framework.TestSuite.runTest(TestSuite.java:208)
>         at junit.framework.TestSuite.run(TestSuite.java:203)
>         at
> org.apache.tools.ant.taskdefs.optional.junit.JUnitTestRunner.run(
> JUnitTestRunner.java:297)
>         at
> org.apache.tools.ant.taskdefs.optional.junit.JUnitTestRunner.launch(
> JUnitTestRunner.java:672)
>         at
> org.apache.tools.ant.taskdefs.optional.junit.JUnitTestRunner.main(
> JUnitTestRunner.java:546)
> Continue...
> org.xml.sax.SAXParseException: The version is required in the XML
> declaration.
>         at org.apache.xerces.parsers.AbstractSAXParser.parse(Unknown
> Source)
>         at org.apache.xerces.jaxp.SAXParserImpl$JAXPSAXParser.parse(Unknown
> Source)
>         at org.apache.xerces.jaxp.SAXParserImpl.parse(Unknown Source)
>         at javax.xml.parsers.SAXParser.parse(Unknown Source)
>         at java.beans.XMLDecoder.&lt;init&gt;(XMLDecoder.java:461)
>         at java.beans.XMLDecoder.&lt;init&gt;(XMLDecoder.java:428)
>         at
> org.apache.harmony.beans.tests.java.beans.PersistenceDelegateTest.test_writeObject_java_awt_Menu
> (PersistenceDelegateTest.java:606)
>         at java.lang.reflect.VMReflection.invokeMethod(VMReflection.java)
>         at java.lang.reflect.Method.invoke(Method.java:317)
>         at junit.framework.TestCase.runTest(TestCase.java:154)
>         at junit.framework.TestCase.runBare(TestCase.java:127)
>         at junit.framework.TestResult$1.protect(TestResult.java:106)
>         at junit.framework.TestResult.runProtected(TestResult.java:124)
>         at junit.framework.TestResult.run(TestResult.java:109)
>         at junit.framework.TestCase.run(TestCase.java:118)
>         at junit.framework.TestSuite.runTest(TestSuite.java:208)
>         at junit.framework.TestSuite.run(TestSuite.java:203)
>         at
> org.apache.tools.ant.taskdefs.optional.junit.JUnitTestRunner.run(
> JUnitTestRunner.java:297)
>         at
> org.apache.tools.ant.taskdefs.optional.junit.JUnitTestRunner.launch(
> JUnitTestRunner.java:672)
>         at
> org.apache.tools.ant.taskdefs.optional.junit.JUnitTestRunner.main(
> JUnitTestRunner.java:546)
> Continue...
> org.xml.sax.SAXParseException: The version is required in the XML
> declaration.
>         at
> org.apache.xerces.util.ErrorHandlerWrapper.createSAXParseException(Unknown
> Source)
>         at org.apache.xerces.util.ErrorHandlerWrapper.fatalError(Unknown
> Source)
>         at org.apache.xerces.impl.XMLErrorReporter.reportError(Unknown
> Source)
>         at org.apache.xerces.impl.XMLErrorReporter.reportError(Unknown
> Source)
>         at org.apache.xerces.impl.XMLScanner.reportFatalError(Unknown
> Source)
>         at org.apache.xerces.impl.XMLScanner.scanXMLDeclOrTextDecl(Unknown
> Source)
>         at
> org.apache.xerces.impl.XMLDocumentFragmentScannerImpl.scanXMLDeclOrTextDecl
> (Unknown
> Source)
>         at
> org.apache.xerces.impl.XMLDocumentScannerImpl$XMLDeclDispatcher.dispatch
> (Unknown
> Source)
>         at
> org.apache.xerces.impl.XMLDocumentFragmentScannerImpl.scanDocument(Unknown
> Source)
>         at org.apache.xerces.parsers.XML11Configuration.parse(Unknown
> Source)
>         at org.apache.xerces.parsers.XML11Configuration.parse(Unknown
> Source)
>         at org.apache.xerces.parsers.XMLParser.parse(Unknown Source)
>         at org.apache.xerces.parsers.AbstractSAXParser.parse(Unknown
> Source)
>         at org.apache.xerces.jaxp.SAXParserImpl$JAXPSAXParser.parse(Unknown
> Source)
>         at org.apache.xerces.jaxp.SAXParserImpl.parse(Unknown Source)
>         at javax.xml.parsers.SAXParser.parse(Unknown Source)
>         at java.beans.XMLDecoder.&lt;init&gt;(XMLDecoder.java:461)
>         at java.beans.XMLDecoder.&lt;init&gt;(XMLDecoder.java:428)
>         at
> org.apache.harmony.beans.tests.java.beans.PersistenceDelegateTest.test_writeObject_java_awt_MenuBar
> (PersistenceDelegateTest.java:635)
>         at java.lang.reflect.VMReflection.invokeMethod(VMReflection.java)
>         at java.lang.reflect.Method.invoke(Method.java:317)
>         at junit.framework.TestCase.runTest(TestCase.java:154)
>         at junit.framework.TestCase.runBare(TestCase.java:127)
>         at junit.framework.TestResult$1.protect(TestResult.java:106)
>         at junit.framework.TestResult.runProtected(TestResult.java:124)
>         at junit.framework.TestResult.run(TestResult.java:109)
>         at junit.framework.TestCase.run(TestCase.java:118)
>         at junit.framework.TestSuite.runTest(TestSuite.java:208)
>         at junit.framework.TestSuite.run(TestSuite.java:203)
>         at
> org.apache.tools.ant.taskdefs.optional.junit.JUnitTestRunner.run(
> JUnitTestRunner.java:297)
>         at
> org.apache.tools.ant.taskdefs.optional.junit.JUnitTestRunner.launch(
> JUnitTestRunner.java:672)
>         at
> org.apache.tools.ant.taskdefs.optional.junit.JUnitTestRunner.main(
> JUnitTestRunner.java:546)
> Continue...
> org.xml.sax.SAXParseException: The version is required in the XML
> declaration.
>         at org.apache.xerces.parsers.AbstractSAXParser.parse(Unknown
> Source)
>         at org.apache.xerces.jaxp.SAXParserImpl$JAXPSAXParser.parse(Unknown
> Source)
>         at org.apache.xerces.jaxp.SAXParserImpl.parse(Unknown Source)
>         at javax.xml.parsers.SAXParser.parse(Unknown Source)
>         at java.beans.XMLDecoder.&lt;init&gt;(XMLDecoder.java:461)
>         at java.beans.XMLDecoder.&lt;init&gt;(XMLDecoder.java:428)
>         at
> org.apache.harmony.beans.tests.java.beans.PersistenceDelegateTest.test_writeObject_java_awt_MenuBar
> (PersistenceDelegateTest.java:635)
>         at java.lang.reflect.VMReflection.invokeMethod(VMReflection.java)
>         at java.lang.reflect.Method.invoke(Method.java:317)
>         at junit.framework.TestCase.runTest(TestCase.java:154)
>         at junit.framework.TestCase.runBare(TestCase.java:127)
>         at junit.framework.TestResult$1.protect(TestResult.java:106)
>         at junit.framework.TestResult.runProtected(TestResult.java:124)
>         at junit.framework.TestResult.run(TestResult.java:109)
>         at junit.framework.TestCase.run(TestCase.java:118)
>         at junit.framework.TestSuite.runTest(TestSuite.java:208)
>         at junit.framework.TestSuite.run(TestSuite.java:203)
>         at
> org.apache.tools.ant.taskdefs.optional.junit.JUnitTestRunner.run(
> JUnitTestRunner.java:297)
>         at
> org.apache.tools.ant.taskdefs.optional.junit.JUnitTestRunner.launch(
> JUnitTestRunner.java:672)
>         at
> org.apache.tools.ant.taskdefs.optional.junit.JUnitTestRunner.main(
> JUnitTestRunner.java:546)
> Continue...
> Exception during encoding:java.awt.IllegalComponentStateException: no
> parent
> Continue...
> Exception during encoding:java.awt.IllegalComponentStateException: no
> parent
> Continue...
> org.xml.sax.SAXParseException: The version is required in the XML
> declaration.
>         at
> org.apache.xerces.util.ErrorHandlerWrapper.createSAXParseException(Unknown
> Source)
>         at org.apache.xerces.util.ErrorHandlerWrapper.fatalError(Unknown
> Source)
>         at org.apache.xerces.impl.XMLErrorReporter.reportError(Unknown
> Source)
>         at org.apache.xerces.impl.XMLErrorReporter.reportError(Unknown
> Source)
>         at org.apache.xerces.impl.XMLScanner.reportFatalError(Unknown
> Source)
>         at org.apache.xerces.impl.XMLScanner.scanXMLDeclOrTextDecl(Unknown
> Source)
>         at
> org.apache.xerces.impl.XMLDocumentFragmentScannerImpl.scanXMLDeclOrTextDecl
> (Unknown
> Source)
>         at
> org.apache.xerces.impl.XMLDocumentScannerImpl$XMLDeclDispatcher.dispatch
> (Unknown
> Source)
>         at
> org.apache.xerces.impl.XMLDocumentFragmentScannerImpl.scanDocument(Unknown
> Source)
>         at org.apache.xerces.parsers.XML11Configuration.parse(Unknown
> Source)
>         at org.apache.xerces.parsers.XML11Configuration.parse(Unknown
> Source)
>         at org.apache.xerces.parsers.XMLParser.parse(Unknown Source)
>         at org.apache.xerces.parsers.AbstractSAXParser.parse(Unknown
> Source)
>         at org.apache.xerces.jaxp.SAXParserImpl$JAXPSAXParser.parse(Unknown
> Source)
>         at org.apache.xerces.jaxp.SAXParserImpl.parse(Unknown Source)
>         at javax.xml.parsers.SAXParser.parse(Unknown Source)
>         at java.beans.XMLDecoder.&lt;init&gt;(XMLDecoder.java:461)
>         at java.beans.XMLDecoder.&lt;init&gt;(XMLDecoder.java:428)
>         at
> org.apache.harmony.beans.tests.java.beans.PersistenceDelegateTest.test_writeObject_java_awt_List
> (PersistenceDelegateTest.java:656)
>         at java.lang.reflect.VMReflection.invokeMethod(VMReflection.java)
>         at java.lang.reflect.Method.invoke(Method.java:317)
>         at junit.framework.TestCase.runTest(TestCase.java:154)
>         at junit.framework.TestCase.runBare(TestCase.java:127)
>         at junit.framework.TestResult$1.protect(TestResult.java:106)
>         at junit.framework.TestResult.runProtected(TestResult.java:124)
>         at junit.framework.TestResult.run(TestResult.java:109)
>         at junit.framework.TestCase.run(TestCase.java:118)
>         at junit.framework.TestSuite.runTest(TestSuite.java:208)
>         at junit.framework.TestSuite.run(TestSuite.java:203)
>         at
> org.apache.tools.ant.taskdefs.optional.junit.JUnitTestRunner.run(
> JUnitTestRunner.java:297)
>         at
> org.apache.tools.ant.taskdefs.optional.junit.JUnitTestRunner.launch(
> JUnitTestRunner.java:672)
>         at
> org.apache.tools.ant.taskdefs.optional.junit.JUnitTestRunner.main(
> JUnitTestRunner.java:546)
> Continue...
> org.xml.sax.SAXParseException: The version is required in the XML
> declaration.
>         at org.apache.xerces.parsers.AbstractSAXParser.parse(Unknown
> Source)
>         at org.apache.xerces.jaxp.SAXParserImpl$JAXPSAXParser.parse(Unknown
> Source)
>         at org.apache.xerces.jaxp.SAXParserImpl.parse(Unknown Source)
>         at javax.xml.parsers.SAXParser.parse(Unknown Source)
>         at java.beans.XMLDecoder.&lt;init&gt;(XMLDecoder.java:461)
>         at java.beans.XMLDecoder.&lt;init&gt;(XMLDecoder.java:428)
>         at
> org.apache.harmony.beans.tests.java.beans.PersistenceDelegateTest.test_writeObject_java_awt_List
> (PersistenceDelegateTest.java:656)
>         at java.lang.reflect.VMReflection.invokeMethod(VMReflection.java)
>         at java.lang.reflect.Method.invoke(Method.java:317)
>         at junit.framework.TestCase.runTest(TestCase.java:154)
>         at junit.framework.TestCase.runBare(TestCase.java:127)
>         at junit.framework.TestResult$1.protect(TestResult.java:106)
>         at junit.framework.TestResult.runProtected(TestResult.java:124)
>         at junit.framework.TestResult.run(TestResult.java:109)
>         at junit.framework.TestCase.run(TestCase.java:118)
>         at junit.framework.TestSuite.runTest(TestSuite.java:208)
>         at junit.framework.TestSuite.run(TestSuite.java:203)
>         at
> org.apache.tools.ant.taskdefs.optional.junit.JUnitTestRunner.run(
> JUnitTestRunner.java:297)
>         at
> org.apache.tools.ant.taskdefs.optional.junit.JUnitTestRunner.launch(
> JUnitTestRunner.java:672)
>         at
> org.apache.tools.ant.taskdefs.optional.junit.JUnitTestRunner.main(
> JUnitTestRunner.java:546)
> Continue...
> org.xml.sax.SAXParseException: The version is required in the XML
> declaration.
>         at
> org.apache.xerces.util.ErrorHandlerWrapper.createSAXParseException(Unknown
> Source)
>         at org.apache.xerces.util.ErrorHandlerWrapper.fatalError(Unknown
> Source)
>         at org.apache.xerces.impl.XMLErrorReporter.reportError(Unknown
> Source)
>         at org.apache.xerces.impl.XMLErrorReporter.reportError(Unknown
> Source)
>         at org.apache.xerces.impl.XMLScanner.reportFatalError(Unknown
> Source)
>         at org.apache.xerces.impl.XMLScanner.scanXMLDeclOrTextDecl(Unknown
> Source)
>         at
> org.apache.xerces.impl.XMLDocumentFragmentScannerImpl.scanXMLDeclOrTextDecl
> (Unknown
> Source)
>         at
> org.apache.xerces.impl.XMLDocumentScannerImpl$XMLDeclDispatcher.dispatch
> (Unknown
> Source)
>         at
> org.apache.xerces.impl.XMLDocumentFragmentScannerImpl.scanDocument(Unknown
> Source)
>         at org.apache.xerces.parsers.XML11Configuration.parse(Unknown
> Source)
>         at org.apache.xerces.parsers.XML11Configuration.parse(Unknown
> Source)
>         at org.apache.xerces.parsers.XMLParser.parse(Unknown Source)
>         at org.apache.xerces.parsers.AbstractSAXParser.parse(Unknown
> Source)
>         at org.apache.xerces.jaxp.SAXParserImpl$JAXPSAXParser.parse(Unknown
> Source)
>         at org.apache.xerces.jaxp.SAXParserImpl.parse(Unknown Source)
>         at javax.xml.parsers.SAXParser.parse(Unknown Source)
>         at java.beans.XMLDecoder.&lt;init&gt;(XMLDecoder.java:461)
>         at java.beans.XMLDecoder.&lt;init&gt;(XMLDecoder.java:428)
>         at
> org.apache.harmony.beans.tests.java.beans.PersistenceDelegateTest.test_writeObject_java_awt_BorderLayout
> (PersistenceDelegateTest.java:675)
>         at java.lang.reflect.VMReflection.invokeMethod(VMReflection.java)
>         at java.lang.reflect.Method.invoke(Method.java:317)
>         at junit.framework.TestCase.runTest(TestCase.java:154)
>         at junit.framework.TestCase.runBare(TestCase.java:127)
>         at junit.framework.TestResult$1.protect(TestResult.java:106)
>         at junit.framework.TestResult.runProtected(TestResult.java:124)
>         at junit.framework.TestResult.run(TestResult.java:109)
>         at junit.framework.TestCase.run(TestCase.java:118)
>         at junit.framework.TestSuite.runTest(TestSuite.java:208)
>         at junit.framework.TestSuite.run(TestSuite.java:203)
>         at
> org.apache.tools.ant.taskdefs.optional.junit.JUnitTestRunner.run(
> JUnitTestRunner.java:297)
>         at
> org.apache.tools.ant.taskdefs.optional.junit.JUnitTestRunner.launch(
> JUnitTestRunner.java:672)
>         at
> org.apache.tools.ant.taskdefs.optional.junit.JUnitTestRunner.main(
> JUnitTestRunner.java:546)
> Continue...
> org.xml.sax.SAXParseException: The version is required in the XML
> declaration.
>         at org.apache.xerces.parsers.AbstractSAXParser.parse(Unknown
> Source)
>         at org.apache.xerces.jaxp.SAXParserImpl$JAXPSAXParser.parse(Unknown
> Source)
>         at org.apache.xerces.jaxp.SAXParserImpl.parse(Unknown Source)
>         at javax.xml.parsers.SAXParser.parse(Unknown Source)
>         at java.beans.XMLDecoder.&lt;init&gt;(XMLDecoder.java:461)
>         at java.beans.XMLDecoder.&lt;init&gt;(XMLDecoder.java:428)
>         at
> org.apache.harmony.beans.tests.java.beans.PersistenceDelegateTest.test_writeObject_java_awt_BorderLayout
> (PersistenceDelegateTest.java:675)
>         at java.lang.reflect.VMReflection.invokeMethod(VMReflection.java)
>         at java.lang.reflect.Method.invoke(Method.java:317)
>         at junit.framework.TestCase.runTest(TestCase.java:154)
>         at junit.framework.TestCase.runBare(TestCase.java:127)
>         at junit.framework.TestResult$1.protect(TestResult.java:106)
>         at junit.framework.TestResult.runProtected(TestResult.java:124)
>         at junit.framework.TestResult.run(TestResult.java:109)
>         at junit.framework.TestCase.run(TestCase.java:118)
>         at junit.framework.TestSuite.runTest(TestSuite.java:208)
>         at junit.framework.TestSuite.run(TestSuite.java:203)
>         at
> org.apache.tools.ant.taskdefs.optional.junit.JUnitTestRunner.run(
> JUnitTestRunner.java:297)
>         at
> org.apache.tools.ant.taskdefs.optional.junit.JUnitTestRunner.launch(
> JUnitTestRunner.java:672)
>         at
> org.apache.tools.ant.taskdefs.optional.junit.JUnitTestRunner.main(
> JUnitTestRunner.java:546)
> Continue...
> org.xml.sax.SAXParseException: The version is required in the XML
> declaration.
>         at
> org.apache.xerces.util.ErrorHandlerWrapper.createSAXParseException(Unknown
> Source)
>         at org.apache.xerces.util.ErrorHandlerWrapper.fatalError(Unknown
> Source)
>         at org.apache.xerces.impl.XMLErrorReporter.reportError(Unknown
> Source)
>         at org.apache.xerces.impl.XMLErrorReporter.reportError(Unknown
> Source)
>         at org.apache.xerces.impl.XMLScanner.reportFatalError(Unknown
> Source)
>         at org.apache.xerces.impl.XMLScanner.scanXMLDeclOrTextDecl(Unknown
> Source)
>         at
> org.apache.xerces.impl.XMLDocumentFragmentScannerImpl.scanXMLDeclOrTextDecl
> (Unknown
> Source)
>         at
> org.apache.xerces.impl.XMLDocumentScannerImpl$XMLDeclDispatcher.dispatch
> (Unknown
> Source)
>         at
> org.apache.xerces.impl.XMLDocumentFragmentScannerImpl.scanDocument(Unknown
> Source)
>         at org.apache.xerces.parsers.XML11Configuration.parse(Unknown
> Source)
>         at org.apache.xerces.parsers.XML11Configuration.parse(Unknown
> Source)
>         at org.apache.xerces.parsers.XMLParser.parse(Unknown Source)
>         at org.apache.xerces.parsers.AbstractSAXParser.parse(Unknown
> Source)
>         at org.apache.xerces.jaxp.SAXParserImpl$JAXPSAXParser.parse(Unknown
> Source)
>         at org.apache.xerces.jaxp.SAXParserImpl.parse(Unknown Source)
>         at javax.xml.parsers.SAXParser.parse(Unknown Source)
>         at java.beans.XMLDecoder.&lt;init&gt;(XMLDecoder.java:461)
>         at java.beans.XMLDecoder.&lt;init&gt;(XMLDecoder.java:428)
>         at
> org.apache.harmony.beans.tests.java.beans.PersistenceDelegateTest.test_writeObject_java_awt_CardLayout
> (PersistenceDelegateTest.java:694)
>         at java.lang.reflect.VMReflection.invokeMethod(VMReflection.java)
>         at java.lang.reflect.Method.invoke(Method.java:317)
>         at junit.framework.TestCase.runTest(TestCase.java:154)
>         at junit.framework.TestCase.runBare(TestCase.java:127)
>         at junit.framework.TestResult$1.protect(TestResult.java:106)
>         at junit.framework.TestResult.runProtected(TestResult.java:124)
>         at junit.framework.TestResult.run(TestResult.java:109)
>         at junit.framework.TestCase.run(TestCase.java:118)
>         at junit.framework.TestSuite.runTest(TestSuite.java:208)
>         at junit.framework.TestSuite.run(TestSuite.java:203)
>         at
> org.apache.tools.ant.taskdefs.optional.junit.JUnitTestRunner.run(
> JUnitTestRunner.java:297)
>         at
> org.apache.tools.ant.taskdefs.optional.junit.JUnitTestRunner.launch(
> JUnitTestRunner.java:672)
>         at
> org.apache.tools.ant.taskdefs.optional.junit.JUnitTestRunner.main(
> JUnitTestRunner.java:546)
> Continue...
> org.xml.sax.SAXParseException: The version is required in the XML
> declaration.
>         at org.apache.xerces.parsers.AbstractSAXParser.parse(Unknown
> Source)
>         at org.apache.xerces.jaxp.SAXParserImpl$JAXPSAXParser.parse(Unknown
> Source)
>         at org.apache.xerces.jaxp.SAXParserImpl.parse(Unknown Source)
>         at javax.xml.parsers.SAXParser.parse(Unknown Source)
>         at java.beans.XMLDecoder.&lt;init&gt;(XMLDecoder.java:461)
>         at java.beans.XMLDecoder.&lt;init&gt;(XMLDecoder.java:428)
>         at
> org.apache.harmony.beans.tests.java.beans.PersistenceDelegateTest.test_writeObject_java_awt_CardLayout
> (PersistenceDelegateTest.java:694)
>         at java.lang.reflect.VMReflection.invokeMethod(VMReflection.java)
>         at java.lang.reflect.Method.invoke(Method.java:317)
>         at junit.framework.TestCase.runTest(TestCase.java:154)
>         at junit.framework.TestCase.runBare(TestCase.java:127)
>         at junit.framework.TestResult$1.protect(TestResult.java:106)
>         at junit.framework.TestResult.runProtected(TestResult.java:124)
>         at junit.framework.TestResult.run(TestResult.java:109)
>         at junit.framework.TestCase.run(TestCase.java:118)
>         at junit.framework.TestSuite.runTest(TestSuite.java:208)
>         at junit.framework.TestSuite.run(TestSuite.java:203)
>         at
> org.apache.tools.ant.taskdefs.optional.junit.JUnitTestRunner.run(
> JUnitTestRunner.java:297)
>         at
> org.apache.tools.ant.taskdefs.optional.junit.JUnitTestRunner.launch(
> JUnitTestRunner.java:672)
>         at
> org.apache.tools.ant.taskdefs.optional.junit.JUnitTestRunner.main(
> JUnitTestRunner.java:546)
> Continue...
> org.xml.sax.SAXParseException: The version is required in the XML
> declaration.
>         at
> org.apache.xerces.util.ErrorHandlerWrapper.createSAXParseException(Unknown
> Source)
>         at org.apache.xerces.util.ErrorHandlerWrapper.fatalError(Unknown
> Source)
>         at org.apache.xerces.impl.XMLErrorReporter.reportError(Unknown
> Source)
>         at org.apache.xerces.impl.XMLErrorReporter.reportError(Unknown
> Source)
>         at org.apache.xerces.impl.XMLScanner.reportFatalError(Unknown
> Source)
>         at org.apache.xerces.impl.XMLScanner.scanXMLDeclOrTextDecl(Unknown
> Source)
>         at
> org.apache.xerces.impl.XMLDocumentFragmentScannerImpl.scanXMLDeclOrTextDecl
> (Unknown
> Source)
>         at
> org.apache.xerces.impl.XMLDocumentScannerImpl$XMLDeclDispatcher.dispatch
> (Unknown
> Source)
>         at
> org.apache.xerces.impl.XMLDocumentFragmentScannerImpl.scanDocument(Unknown
> Source)
>         at org.apache.xerces.parsers.XML11Configuration.parse(Unknown
> Source)
>         at org.apache.xerces.parsers.XML11Configuration.parse(Unknown
> Source)
>         at org.apache.xerces.parsers.XMLParser.parse(Unknown Source)
>         at org.apache.xerces.parsers.AbstractSAXParser.parse(Unknown
> Source)
>         at org.apache.xerces.jaxp.SAXParserImpl$JAXPSAXParser.parse(Unknown
> Source)
>         at org.apache.xerces.jaxp.SAXParserImpl.parse(Unknown Source)
>         at javax.xml.parsers.SAXParser.parse(Unknown Source)
>         at java.beans.XMLDecoder.&lt;init&gt;(XMLDecoder.java:461)
>         at java.beans.XMLDecoder.&lt;init&gt;(XMLDecoder.java:428)
>         at
> org.apache.harmony.beans.tests.java.beans.PersistenceDelegateTest.test_writeObject_java_awt_GridBagLayout
> (PersistenceDelegateTest.java:713)
>         at java.lang.reflect.VMReflection.invokeMethod(VMReflection.java)
>         at java.lang.reflect.Method.invoke(Method.java:317)
>         at junit.framework.TestCase.runTest(TestCase.java:154)
>         at junit.framework.TestCase.runBare(TestCase.java:127)
>         at junit.framework.TestResult$1.protect(TestResult.java:106)
>         at junit.framework.TestResult.runProtected(TestResult.java:124)
>         at junit.framework.TestResult.run(TestResult.java:109)
>         at junit.framework.TestCase.run(TestCase.java:118)
>         at junit.framework.TestSuite.runTest(TestSuite.java:208)
>         at junit.framework.TestSuite.run(TestSuite.java:203)
>         at
> org.apache.tools.ant.taskdefs.optional.junit.JUnitTestRunner.run(
> JUnitTestRunner.java:297)
>         at
> org.apache.tools.ant.taskdefs.optional.junit.JUnitTestRunner.launch(
> JUnitTestRunner.java:672)
>         at
> org.apache.tools.ant.taskdefs.optional.junit.JUnitTestRunner.main(
> JUnitTestRunner.java:546)
> Continue...
> org.xml.sax.SAXParseException: The version is required in the XML
> declaration.
>         at org.apache.xerces.parsers.AbstractSAXParser.parse(Unknown
> Source)
>         at org.apache.xerces.jaxp.SAXParserImpl$JAXPSAXParser.parse(Unknown
> Source)
>         at org.apache.xerces.jaxp.SAXParserImpl.parse(Unknown Source)
>         at javax.xml.parsers.SAXParser.parse(Unknown Source)
>         at java.beans.XMLDecoder.&lt;init&gt;(XMLDecoder.java:461)
>         at java.beans.XMLDecoder.&lt;init&gt;(XMLDecoder.java:428)
>         at
> org.apache.harmony.beans.tests.java.beans.PersistenceDelegateTest.test_writeObject_java_awt_GridBagLayout
> (PersistenceDelegateTest.java:713)
>         at java.lang.reflect.VMReflection.invokeMethod(VMReflection.java)
>         at java.lang.reflect.Method.invoke(Method.java:317)
>         at junit.framework.TestCase.runTest(TestCase.java:154)
>         at junit.framework.TestCase.runBare(TestCase.java:127)
>         at junit.framework.TestResult$1.protect(TestResult.java:106)
>         at junit.framework.TestResult.runProtected(TestResult.java:124)
>         at junit.framework.TestResult.run(TestResult.java:109)
>         at junit.framework.TestCase.run(TestCase.java:118)
>         at junit.framework.TestSuite.runTest(TestSuite.java:208)
>         at junit.framework.TestSuite.run(TestSuite.java:203)
>         at
> org.apache.tools.ant.taskdefs.optional.junit.JUnitTestRunner.run(
> JUnitTestRunner.java:297)
>         at
> org.apache.tools.ant.taskdefs.optional.junit.JUnitTestRunner.launch(
> JUnitTestRunner.java:672)
>         at
> org.apache.tools.ant.taskdefs.optional.junit.JUnitTestRunner.main(
> JUnitTestRunner.java:546)
> Continue...
> org.xml.sax.SAXParseException: The version is required in the XML
> declaration.
>         at
> org.apache.xerces.util.ErrorHandlerWrapper.createSAXParseException(Unknown
> Source)
>         at org.apache.xerces.util.ErrorHandlerWrapper.fatalError(Unknown
> Source)
>         at org.apache.xerces.impl.XMLErrorReporter.reportError(Unknown
> Source)
>         at org.apache.xerces.impl.XMLErrorReporter.reportError(Unknown
> Source)
>         at org.apache.xerces.impl.XMLScanner.reportFatalError(Unknown
> Source)
>         at org.apache.xerces.impl.XMLScanner.scanXMLDeclOrTextDecl(Unknown
> Source)
>         at
> org.apache.xerces.impl.XMLDocumentFragmentScannerImpl.scanXMLDeclOrTextDecl
> (Unknown
> Source)
>         at
> org.apache.xerces.impl.XMLDocumentScannerImpl$XMLDeclDispatcher.dispatch
> (Unknown
> Source)
>         at
> org.apache.xerces.impl.XMLDocumentFragmentScannerImpl.scanDocument(Unknown
> Source)
>         at org.apache.xerces.parsers.XML11Configuration.parse(Unknown
> Source)
>         at org.apache.xerces.parsers.XML11Configuration.parse(Unknown
> Source)
>         at org.apache.xerces.parsers.XMLParser.parse(Unknown Source)
>         at org.apache.xerces.parsers.AbstractSAXParser.parse(Unknown
> Source)
>         at org.apache.xerces.jaxp.SAXParserImpl$JAXPSAXParser.parse(Unknown
> Source)
>         at org.apache.xerces.jaxp.SAXParserImpl.parse(Unknown Source)
>         at javax.xml.parsers.SAXParser.parse(Unknown Source)
>         at java.beans.XMLDecoder.&lt;init&gt;(XMLDecoder.java:461)
>         at java.beans.XMLDecoder.&lt;init&gt;(XMLDecoder.java:428)
>         at
> org.apache.harmony.beans.tests.java.beans.PersistenceDelegateTest.test_writeObject_java_awt_Cursor
> (PersistenceDelegateTest.java:731)
>         at java.lang.reflect.VMReflection.invokeMethod(VMReflection.java)
>         at java.lang.reflect.Method.invoke(Method.java:317)
>         at junit.framework.TestCase.runTest(TestCase.java:154)
>         at junit.framework.TestCase.runBare(TestCase.java:127)
>         at junit.framework.TestResult$1.protect(TestResult.java:106)
>         at junit.framework.TestResult.runProtected(TestResult.java:124)
>         at junit.framework.TestResult.run(TestResult.java:109)
>         at junit.framework.TestCase.run(TestCase.java:118)
>         at junit.framework.TestSuite.runTest(TestSuite.java:208)
>         at junit.framework.TestSuite.run(TestSuite.java:203)
>         at
> org.apache.tools.ant.taskdefs.optional.junit.JUnitTestRunner.run(
> JUnitTestRunner.java:297)
>         at
> org.apache.tools.ant.taskdefs.optional.junit.JUnitTestRunner.launch(
> JUnitTestRunner.java:672)
>         at
> org.apache.tools.ant.taskdefs.optional.junit.JUnitTestRunner.main(
> JUnitTestRunner.java:546)
> Continue...
> org.xml.sax.SAXParseException: The version is required in the XML
> declaration.
>         at org.apache.xerces.parsers.AbstractSAXParser.parse(Unknown
> Source)
>         at org.apache.xerces.jaxp.SAXParserImpl$JAXPSAXParser.parse(Unknown
> Source)
>         at org.apache.xerces.jaxp.SAXParserImpl.parse(Unknown Source)
>         at javax.xml.parsers.SAXParser.parse(Unknown Source)
>         at java.beans.XMLDecoder.&lt;init&gt;(XMLDecoder.java:461)
>         at java.beans.XMLDecoder.&lt;init&gt;(XMLDecoder.java:428)
>         at
> org.apache.harmony.beans.tests.java.beans.PersistenceDelegateTest.test_writeObject_java_awt_Cursor
> (PersistenceDelegateTest.java:731)
>         at java.lang.reflect.VMReflection.invokeMethod(VMReflection.java)
>         at java.lang.reflect.Method.invoke(Method.java:317)
>         at junit.framework.TestCase.runTest(TestCase.java:154)
>         at junit.framework.TestCase.runBare(TestCase.java:127)
>         at junit.framework.TestResult$1.protect(TestResult.java:106)
>         at junit.framework.TestResult.runProtected(TestResult.java:124)
>         at junit.framework.TestResult.run(TestResult.java:109)
>         at junit.framework.TestCase.run(TestCase.java:118)
>         at junit.framework.TestSuite.runTest(TestSuite.java:208)
>         at junit.framework.TestSuite.run(TestSuite.java:203)
>         at
> org.apache.tools.ant.taskdefs.optional.junit.JUnitTestRunner.run(
> JUnitTestRunner.java:297)
>         at
> org.apache.tools.ant.taskdefs.optional.junit.JUnitTestRunner.launch(
> JUnitTestRunner.java:672)
>         at
> org.apache.tools.ant.taskdefs.optional.junit.JUnitTestRunner.main(
> JUnitTestRunner.java:546)
> Continue...
> org.xml.sax.SAXParseException: The version is required in the XML
> declaration.
>         at
> org.apache.xerces.util.ErrorHandlerWrapper.createSAXParseException(Unknown
> Source)
>         at org.apache.xerces.util.ErrorHandlerWrapper.fatalError(Unknown
> Source)
>         at org.apache.xerces.impl.XMLErrorReporter.reportError(Unknown
> Source)
>         at org.apache.xerces.impl.XMLErrorReporter.reportError(Unknown
> Source)
>         at org.apache.xerces.impl.XMLScanner.reportFatalError(Unknown
> Source)
>         at org.apache.xerces.impl.XMLScanner.scanXMLDeclOrTextDecl(Unknown
> Source)
>         at
> org.apache.xerces.impl.XMLDocumentFragmentScannerImpl.scanXMLDeclOrTextDecl
> (Unknown
> Source)
>         at
> org.apache.xerces.impl.XMLDocumentScannerImpl$XMLDeclDispatcher.dispatch
> (Unknown
> Source)
>         at
> org.apache.xerces.impl.XMLDocumentFragmentScannerImpl.scanDocument(Unknown
> Source)
>         at org.apache.xerces.parsers.XML11Configuration.parse(Unknown
> Source)
>         at org.apache.xerces.parsers.XML11Configuration.parse(Unknown
> Source)
>         at org.apache.xerces.parsers.XMLParser.parse(Unknown Source)
>         at org.apache.xerces.parsers.AbstractSAXParser.parse(Unknown
> Source)
>         at org.apache.xerces.jaxp.SAXParserImpl$JAXPSAXParser.parse(Unknown
> Source)
>         at org.apache.xerces.jaxp.SAXParserImpl.parse(Unknown Source)
>         at javax.xml.parsers.SAXParser.parse(Unknown Source)
>         at java.beans.XMLDecoder.&lt;init&gt;(XMLDecoder.java:461)
>         at java.beans.XMLDecoder.&lt;init&gt;(XMLDecoder.java:428)
>         at
> org.apache.harmony.beans.tests.java.beans.PersistenceDelegateTest.test_writeObject_java_awt_Insets
> (PersistenceDelegateTest.java:748)
>         at java.lang.reflect.VMReflection.invokeMethod(VMReflection.java)
>         at java.lang.reflect.Method.invoke(Method.java:317)
>         at junit.framework.TestCase.runTest(TestCase.java:154)
>         at junit.framework.TestCase.runBare(TestCase.java:127)
>         at junit.framework.TestResult$1.protect(TestResult.java:106)
>         at junit.framework.TestResult.runProtected(TestResult.java:124)
>         at junit.framework.TestResult.run(TestResult.java:109)
>         at junit.framework.TestCase.run(TestCase.java:118)
>         at junit.framework.TestSuite.runTest(TestSuite.java:208)
>         at junit.framework.TestSuite.run(TestSuite.java:203)
>         at
> org.apache.tools.ant.taskdefs.optional.junit.JUnitTestRunner.run(
> JUnitTestRunner.java:297)
>         at
> org.apache.tools.ant.taskdefs.optional.junit.JUnitTestRunner.launch(
> JUnitTestRunner.java:672)
>         at
> org.apache.tools.ant.taskdefs.optional.junit.JUnitTestRunner.main(
> JUnitTestRunner.java:546)
> Continue...
> org.xml.sax.SAXParseException: The version is required in the XML
> declaration.
>         at org.apache.xerces.parsers.AbstractSAXParser.parse(Unknown
> Source)
>         at org.apache.xerces.jaxp.SAXParserImpl$JAXPSAXParser.parse(Unknown
> Source)
>         at org.apache.xerces.jaxp.SAXParserImpl.parse(Unknown Source)
>         at javax.xml.parsers.SAXParser.parse(Unknown Source)
>         at java.beans.XMLDecoder.&lt;init&gt;(XMLDecoder.java:461)
>         at java.beans.XMLDecoder.&lt;init&gt;(XMLDecoder.java:428)
>         at
> org.apache.harmony.beans.tests.java.beans.PersistenceDelegateTest.test_writeObject_java_awt_Insets
> (PersistenceDelegateTest.java:748)
>         at java.lang.reflect.VMReflection.invokeMethod(VMReflection.java)
>         at java.lang.reflect.Method.invoke(Method.java:317)
>         at junit.framework.TestCase.runTest(TestCase.java:154)
>         at junit.framework.TestCase.runBare(TestCase.java:127)
>         at junit.framework.TestResult$1.protect(TestResult.java:106)
>         at junit.framework.TestResult.runProtected(TestResult.java:124)
>         at junit.framework.TestResult.run(TestResult.java:109)
>         at junit.framework.TestCase.run(TestCase.java:118)
>         at junit.framework.TestSuite.runTest(TestSuite.java:208)
>         at junit.framework.TestSuite.run(TestSuite.java:203)
>         at
> org.apache.tools.ant.taskdefs.optional.junit.JUnitTestRunner.run(
> JUnitTestRunner.java:297)
>         at
> org.apache.tools.ant.taskdefs.optional.junit.JUnitTestRunner.launch(
> JUnitTestRunner.java:672)
>         at
> org.apache.tools.ant.taskdefs.optional.junit.JUnitTestRunner.main(
> JUnitTestRunner.java:546)
> Continue...
> org.xml.sax.SAXParseException: The version is required in the XML
> declaration.
>         at
> org.apache.xerces.util.ErrorHandlerWrapper.createSAXParseException(Unknown
> Source)
>         at org.apache.xerces.util.ErrorHandlerWrapper.fatalError(Unknown
> Source)
>         at org.apache.xerces.impl.XMLErrorReporter.reportError(Unknown
> Source)
>         at org.apache.xerces.impl.XMLErrorReporter.reportError(Unknown
> Source)
>         at org.apache.xerces.impl.XMLScanner.reportFatalError(Unknown
> Source)
>         at org.apache.xerces.impl.XMLScanner.scanXMLDeclOrTextDecl(Unknown
> Source)
>         at
> org.apache.xerces.impl.XMLDocumentFragmentScannerImpl.scanXMLDeclOrTextDecl
> (Unknown
> Source)
>         at
> org.apache.xerces.impl.XMLDocumentScannerImpl$XMLDeclDispatcher.dispatch
> (Unknown
> Source)
>         at
> org.apache.xerces.impl.XMLDocumentFragmentScannerImpl.scanDocument(Unknown
> Source)
>         at org.apache.xerces.parsers.XML11Configuration.parse(Unknown
> Source)
>         at org.apache.xerces.parsers.XML11Configuration.parse(Unknown
> Source)
>         at org.apache.xerces.parsers.XMLParser.parse(Unknown Source)
>         at org.apache.xerces.parsers.AbstractSAXParser.parse(Unknown
> Source)
>         at org.apache.xerces.jaxp.SAXParserImpl$JAXPSAXParser.parse(Unknown
> Source)
>         at org.apache.xerces.jaxp.SAXParserImpl.parse(Unknown Source)
>         at javax.xml.parsers.SAXParser.parse(Unknown Source)
>         at java.beans.XMLDecoder.&lt;init&gt;(XMLDecoder.java:461)
>         at java.beans.XMLDecoder.&lt;init&gt;(XMLDecoder.java:428)
>         at
> org.apache.harmony.beans.tests.java.beans.PersistenceDelegateTest.test_writeObject_java_awt_point
> (PersistenceDelegateTest.java:765)
>         at java.lang.reflect.VMReflection.invokeMethod(VMReflection.java)
>         at java.lang.reflect.Method.invoke(Method.java:317)
>         at junit.framework.TestCase.runTest(TestCase.java:154)
>         at junit.framework.TestCase.runBare(TestCase.java:127)
>         at junit.framework.TestResult$1.protect(TestResult.java:106)
>         at junit.framework.TestResult.runProtected(TestResult.java:124)
>         at junit.framework.TestResult.run(TestResult.java:109)
>         at junit.framework.TestCase.run(TestCase.java:118)
>         at junit.framework.TestSuite.runTest(TestSuite.java:208)
>         at junit.framework.TestSuite.run(TestSuite.java:203)
>         at
> org.apache.tools.ant.taskdefs.optional.junit.JUnitTestRunner.run(
> JUnitTestRunner.java:297)
>         at
> org.apache.tools.ant.taskdefs.optional.junit.JUnitTestRunner.launch(
> JUnitTestRunner.java:672)
>         at
> org.apache.tools.ant.taskdefs.optional.junit.JUnitTestRunner.main(
> JUnitTestRunner.java:546)
> Continue...
> org.xml.sax.SAXParseException: The version is required in the XML
> declaration.
>         at org.apache.xerces.parsers.AbstractSAXParser.parse(Unknown
> Source)
>         at org.apache.xerces.jaxp.SAXParserImpl$JAXPSAXParser.parse(Unknown
> Source)
>         at org.apache.xerces.jaxp.SAXParserImpl.parse(Unknown Source)
>         at javax.xml.parsers.SAXParser.parse(Unknown Source)
>         at java.beans.XMLDecoder.&lt;init&gt;(XMLDecoder.java:461)
>         at java.beans.XMLDecoder.&lt;init&gt;(XMLDecoder.java:428)
>         at
> org.apache.harmony.beans.tests.java.beans.PersistenceDelegateTest.test_writeObject_java_awt_point
> (PersistenceDelegateTest.java:765)
>         at java.lang.reflect.VMReflection.invokeMethod(VMReflection.java)
>         at java.lang.reflect.Method.invoke(Method.java:317)
>         at junit.framework.TestCase.runTest(TestCase.java:154)
>         at junit.framework.TestCase.runBare(TestCase.java:127)
>         at junit.framework.TestResult$1.protect(TestResult.java:106)
>         at junit.framework.TestResult.runProtected(TestResult.java:124)
>         at junit.framework.TestResult.run(TestResult.java:109)
>         at junit.framework.TestCase.run(TestCase.java:118)
>         at junit.framework.TestSuite.runTest(TestSuite.java:208)
>         at junit.framework.TestSuite.run(TestSuite.java:203)
>         at
> org.apache.tools.ant.taskdefs.optional.junit.JUnitTestRunner.run(
> JUnitTestRunner.java:297)
>         at
> org.apache.tools.ant.taskdefs.optional.junit.JUnitTestRunner.launch(
> JUnitTestRunner.java:672)
>         at
> org.apache.tools.ant.taskdefs.optional.junit.JUnitTestRunner.main(
> JUnitTestRunner.java:546)
> Continue...
> Exception during encoding:java.awt.IllegalComponentStateException: no
> parent
> Continue...
> Exception during encoding:java.awt.IllegalComponentStateException: no
> parent
> Continue...
> org.xml.sax.SAXParseException: The version is required in the XML
> declaration.
>         at
> org.apache.xerces.util.ErrorHandlerWrapper.createSAXParseException(Unknown
> Source)
>         at org.apache.xerces.util.ErrorHandlerWrapper.fatalError(Unknown
> Source)
>         at org.apache.xerces.impl.XMLErrorReporter.reportError(Unknown
> Source)
>         at org.apache.xerces.impl.XMLErrorReporter.reportError(Unknown
> Source)
>         at org.apache.xerces.impl.XMLScanner.reportFatalError(Unknown
> Source)
>         at org.apache.xerces.impl.XMLScanner.scanXMLDeclOrTextDecl(Unknown
> Source)
>         at
> org.apache.xerces.impl.XMLDocumentFragmentScannerImpl.scanXMLDeclOrTextDecl
> (Unknown
> Source)
>         at
> org.apache.xerces.impl.XMLDocumentScannerImpl$XMLDeclDispatcher.dispatch
> (Unknown
> Source)
>         at
> org.apache.xerces.impl.XMLDocumentFragmentScannerImpl.scanDocument(Unknown
> Source)
>         at org.apache.xerces.parsers.XML11Configuration.parse(Unknown
> Source)
>         at org.apache.xerces.parsers.XML11Configuration.parse(Unknown
> Source)
>         at org.apache.xerces.parsers.XMLParser.parse(Unknown Source)
>         at org.apache.xerces.parsers.AbstractSAXParser.parse(Unknown
> Source)
>         at org.apache.xerces.jaxp.SAXParserImpl$JAXPSAXParser.parse(Unknown
> Source)
>         at org.apache.xerces.jaxp.SAXParserImpl.parse(Unknown Source)
>         at javax.xml.parsers.SAXParser.parse(Unknown Source)
>         at java.beans.XMLDecoder.&lt;init&gt;(XMLDecoder.java:461)
>         at java.beans.XMLDecoder.&lt;init&gt;(XMLDecoder.java:428)
>         at
> org.apache.harmony.beans.tests.java.beans.PersistenceDelegateTest.test_writeObject_java_awt_ScrollPane
> (PersistenceDelegateTest.java:781)
>         at java.lang.reflect.VMReflection.invokeMethod(VMReflection.java)
>         at java.lang.reflect.Method.invoke(Method.java:317)
>         at junit.framework.TestCase.runTest(TestCase.java:154)
>         at junit.framework.TestCase.runBare(TestCase.java:127)
>         at junit.framework.TestResult$1.protect(TestResult.java:106)
>         at junit.framework.TestResult.runProtected(TestResult.java:124)
>         at junit.framework.TestResult.run(TestResult.java:109)
>         at junit.framework.TestCase.run(TestCase.java:118)
>         at junit.framework.TestSuite.runTest(TestSuite.java:208)
>         at junit.framework.TestSuite.run(TestSuite.java:203)
>         at
> org.apache.tools.ant.taskdefs.optional.junit.JUnitTestRunner.run(
> JUnitTestRunner.java:297)
>         at
> org.apache.tools.ant.taskdefs.optional.junit.JUnitTestRunner.launch(
> JUnitTestRunner.java:672)
>         at
> org.apache.tools.ant.taskdefs.optional.junit.JUnitTestRunner.main(
> JUnitTestRunner.java:546)
> Continue...
> org.xml.sax.SAXParseException: The version is required in the XML
> declaration.
>         at org.apache.xerces.parsers.AbstractSAXParser.parse(Unknown
> Source)
>         at org.apache.xerces.jaxp.SAXParserImpl$JAXPSAXParser.parse(Unknown
> Source)
>         at org.apache.xerces.jaxp.SAXParserImpl.parse(Unknown Source)
>         at javax.xml.parsers.SAXParser.parse(Unknown Source)
>         at java.beans.XMLDecoder.&lt;init&gt;(XMLDecoder.java:461)
>         at java.beans.XMLDecoder.&lt;init&gt;(XMLDecoder.java:428)
>         at
> org.apache.harmony.beans.tests.java.beans.PersistenceDelegateTest.test_writeObject_java_awt_ScrollPane
> (PersistenceDelegateTest.java:781)
>         at java.lang.reflect.VMReflection.invokeMethod(VMReflection.java)
>         at java.lang.reflect.Method.invoke(Method.java:317)
>         at junit.framework.TestCase.runTest(TestCase.java:154)
>         at junit.framework.TestCase.runBare(TestCase.java:127)
>         at junit.framework.TestResult$1.protect(TestResult.java:106)
>         at junit.framework.TestResult.runProtected(TestResult.java:124)
>         at junit.framework.TestResult.run(TestResult.java:109)
>         at junit.framework.TestCase.run(TestCase.java:118)
>         at junit.framework.TestSuite.runTest(TestSuite.java:208)
>         at junit.framework.TestSuite.run(TestSuite.java:203)
>         at
> org.apache.tools.ant.taskdefs.optional.junit.JUnitTestRunner.run(
> JUnitTestRunner.java:297)
>         at
> org.apache.tools.ant.taskdefs.optional.junit.JUnitTestRunner.launch(
> JUnitTestRunner.java:672)
>         at
> org.apache.tools.ant.taskdefs.optional.junit.JUnitTestRunner.main(
> JUnitTestRunner.java:546)
> Continue...
> org.xml.sax.SAXParseException: The version is required in the XML
> declaration.
>         at
> org.apache.xerces.util.ErrorHandlerWrapper.createSAXParseException(Unknown
> Source)
>         at org.apache.xerces.util.ErrorHandlerWrapper.fatalError(Unknown
> Source)
>         at org.apache.xerces.impl.XMLErrorReporter.reportError(Unknown
> Source)
>         at org.apache.xerces.impl.XMLErrorReporter.reportError(Unknown
> Source)
>         at org.apache.xerces.impl.XMLScanner.reportFatalError(Unknown
> Source)
>         at org.apache.xerces.impl.XMLScanner.scanXMLDeclOrTextDecl(Unknown
> Source)
>         at
> org.apache.xerces.impl.XMLDocumentFragmentScannerImpl.scanXMLDeclOrTextDecl
> (Unknown
> Source)
>         at
> org.apache.xerces.impl.XMLDocumentScannerImpl$XMLDeclDispatcher.dispatch
> (Unknown
> Source)
>         at
> org.apache.xerces.impl.XMLDocumentFragmentScannerImpl.scanDocument(Unknown
> Source)
>         at org.apache.xerces.parsers.XML11Configuration.parse(Unknown
> Source)
>         at org.apache.xerces.parsers.XML11Configuration.parse(Unknown
> Source)
>         at org.apache.xerces.parsers.XMLParser.parse(Unknown Source)
>         at org.apache.xerces.parsers.AbstractSAXParser.parse(Unknown
> Source)
>         at org.apache.xerces.jaxp.SAXParserImpl$JAXPSAXParser.parse(Unknown
> Source)
>         at org.apache.xerces.jaxp.SAXParserImpl.parse(Unknown Source)
>         at javax.xml.parsers.SAXParser.parse(Unknown Source)
>         at java.beans.XMLDecoder.&lt;init&gt;(XMLDecoder.java:461)
>         at java.beans.XMLDecoder.&lt;init&gt;(XMLDecoder.java:428)
>         at
> org.apache.harmony.beans.tests.java.beans.PersistenceDelegateTest.test_writeObject_java_util_Map
> (PersistenceDelegateTest.java:800)
>         at java.lang.reflect.VMReflection.invokeMethod(VMReflection.java)
>         at java.lang.reflect.Method.invoke(Method.java:317)
>         at junit.framework.TestCase.runTest(TestCase.java:154)
>         at junit.framework.TestCase.runBare(TestCase.java:127)
>         at junit.framework.TestResult$1.protect(TestResult.java:106)
>         at junit.framework.TestResult.runProtected(TestResult.java:124)
>         at junit.framework.TestResult.run(TestResult.java:109)
>         at junit.framework.TestCase.run(TestCase.java:118)
>         at junit.framework.TestSuite.runTest(TestSuite.java:208)
>         at junit.framework.TestSuite.run(TestSuite.java:203)
>         at
> org.apache.tools.ant.taskdefs.optional.junit.JUnitTestRunner.run(
> JUnitTestRunner.java:297)
>         at
> org.apache.tools.ant.taskdefs.optional.junit.JUnitTestRunner.launch(
> JUnitTestRunner.java:672)
>         at
> org.apache.tools.ant.taskdefs.optional.junit.JUnitTestRunner.main(
> JUnitTestRunner.java:546)
> Continue...
> org.xml.sax.SAXParseException: The version is required in the XML
> declaration.
>         at org.apache.xerces.parsers.AbstractSAXParser.parse(Unknown
> Source)
>         at org.apache.xerces.jaxp.SAXParserImpl$JAXPSAXParser.parse(Unknown
> Source)
>         at org.apache.xerces.jaxp.SAXParserImpl.parse(Unknown Source)
>         at javax.xml.parsers.SAXParser.parse(Unknown Source)
>         at java.beans.XMLDecoder.&lt;init&gt;(XMLDecoder.java:461)
>         at java.beans.XMLDecoder.&lt;init&gt;(XMLDecoder.java:428)
>         at
> org.apache.harmony.beans.tests.java.beans.PersistenceDelegateTest.test_writeObject_java_util_Map
> (PersistenceDelegateTest.java:800)
>         at java.lang.reflect.VMReflection.invokeMethod(VMReflection.java)
>         at java.lang.reflect.Method.invoke(Method.java:317)
>         at junit.framework.TestCase.runTest(TestCase.java:154)
>         at junit.framework.TestCase.runBare(TestCase.java:127)
>         at junit.framework.TestResult$1.protect(TestResult.java:106)
>         at junit.framework.TestResult.runProtected(TestResult.java:124)
>         at junit.framework.TestResult.run(TestResult.java:109)
>         at junit.framework.TestCase.run(TestCase.java:118)
>         at junit.framework.TestSuite.runTest(TestSuite.java:208)
>         at junit.framework.TestSuite.run(TestSuite.java:203)
>         at
> org.apache.tools.ant.taskdefs.optional.junit.JUnitTestRunner.run(
> JUnitTestRunner.java:297)
>         at
> org.apache.tools.ant.taskdefs.optional.junit.JUnitTestRunner.launch(
> JUnitTestRunner.java:672)
>         at
> org.apache.tools.ant.taskdefs.optional.junit.JUnitTestRunner.main(
> JUnitTestRunner.java:546)
> Continue...
> org.xml.sax.SAXParseException: The version is required in the XML
> declaration.
>         at
> org.apache.xerces.util.ErrorHandlerWrapper.createSAXParseException(Unknown
> Source)
>         at org.apache.xerces.util.ErrorHandlerWrapper.fatalError(Unknown
> Source)
>         at org.apache.xerces.impl.XMLErrorReporter.reportError(Unknown
> Source)
>         at org.apache.xerces.impl.XMLErrorReporter.reportError(Unknown
> Source)
>         at org.apache.xerces.impl.XMLScanner.reportFatalError(Unknown
> Source)
>         at org.apache.xerces.impl.XMLScanner.scanXMLDeclOrTextDecl(Unknown
> Source)
>         at
> org.apache.xerces.impl.XMLDocumentFragmentScannerImpl.scanXMLDeclOrTextDecl
> (Unknown
> Source)
>         at
> org.apache.xerces.impl.XMLDocumentScannerImpl$XMLDeclDispatcher.dispatch
> (Unknown
> Source)
>         at
> org.apache.xerces.impl.XMLDocumentFragmentScannerImpl.scanDocument(Unknown
> Source)
>         at org.apache.xerces.parsers.XML11Configuration.parse(Unknown
> Source)
>         at org.apache.xerces.parsers.XML11Configuration.parse(Unknown
> Source)
>         at org.apache.xerces.parsers.XMLParser.parse(Unknown Source)
>         at org.apache.xerces.parsers.AbstractSAXParser.parse(Unknown
> Source)
>         at org.apache.xerces.jaxp.SAXParserImpl$JAXPSAXParser.parse(Unknown
> Source)
>         at org.apache.xerces.jaxp.SAXParserImpl.parse(Unknown Source)
>         at javax.xml.parsers.SAXParser.parse(Unknown Source)
>         at java.beans.XMLDecoder.&lt;init&gt;(XMLDecoder.java:461)
>         at java.beans.XMLDecoder.&lt;init&gt;(XMLDecoder.java:428)
>         at
> org.apache.harmony.beans.tests.java.beans.PersistenceDelegateTest.test_writeObject_java_util_List
> (PersistenceDelegateTest.java:818)
>         at java.lang.reflect.VMReflection.invokeMethod(VMReflection.java)
>         at java.lang.reflect.Method.invoke(Method.java:317)
>         at junit.framework.TestCase.runTest(TestCase.java:154)
>         at junit.framework.TestCase.runBare(TestCase.java:127)
>         at junit.framework.TestResult$1.protect(TestResult.java:106)
>         at junit.framework.TestResult.runProtected(TestResult.java:124)
>         at junit.framework.TestResult.run(TestResult.java:109)
>         at junit.framework.TestCase.run(TestCase.java:118)
>         at junit.framework.TestSuite.runTest(TestSuite.java:208)
>         at junit.framework.TestSuite.run(TestSuite.java:203)
>         at
> org.apache.tools.ant.taskdefs.optional.junit.JUnitTestRunner.run(
> JUnitTestRunner.java:297)
>         at
> org.apache.tools.ant.taskdefs.optional.junit.JUnitTestRunner.launch(
> JUnitTestRunner.java:672)
>         at
> org.apache.tools.ant.taskdefs.optional.junit.JUnitTestRunner.main(
> JUnitTestRunner.java:546)
> Continue...
> org.xml.sax.SAXParseException: The version is required in the XML
> declaration.
>         at org.apache.xerces.parsers.AbstractSAXParser.parse(Unknown
> Source)
>         at org.apache.xerces.jaxp.SAXParserImpl$JAXPSAXParser.parse(Unknown
> Source)
>         at org.apache.xerces.jaxp.SAXParserImpl.parse(Unknown Source)
>         at javax.xml.parsers.SAXParser.parse(Unknown Source)
>         at java.beans.XMLDecoder.&lt;init&gt;(XMLDecoder.java:461)
>         at java.beans.XMLDecoder.&lt;init&gt;(XMLDecoder.java:428)
>         at
> org.apache.harmony.beans.tests.java.beans.PersistenceDelegateTest.test_writeObject_java_util_List
> (PersistenceDelegateTest.java:818)
>         at java.lang.reflect.VMReflection.invokeMethod(VMReflection.java)
>         at java.lang.reflect.Method.invoke(Method.java:317)
>         at junit.framework.TestCase.runTest(TestCase.java:154)
>         at junit.framework.TestCase.runBare(TestCase.java:127)
>         at junit.framework.TestResult$1.protect(TestResult.java:106)
>         at junit.framework.TestResult.runProtected(TestResult.java:124)
>         at junit.framework.TestResult.run(TestResult.java:109)
>         at junit.framework.TestCase.run(TestCase.java:118)
>         at junit.framework.TestSuite.runTest(TestSuite.java:208)
>         at junit.framework.TestSuite.run(TestSuite.java:203)
>         at
> org.apache.tools.ant.taskdefs.optional.junit.JUnitTestRunner.run(
> JUnitTestRunner.java:297)
>         at
> org.apache.tools.ant.taskdefs.optional.junit.JUnitTestRunner.launch(
> JUnitTestRunner.java:672)
>         at
> org.apache.tools.ant.taskdefs.optional.junit.JUnitTestRunner.main(
> JUnitTestRunner.java:546)
> Continue...
> org.xml.sax.SAXParseException: The version is required in the XML
> declaration.
>         at
> org.apache.xerces.util.ErrorHandlerWrapper.createSAXParseException(Unknown
> Source)
>         at org.apache.xerces.util.ErrorHandlerWrapper.fatalError(Unknown
> Source)
>         at org.apache.xerces.impl.XMLErrorReporter.reportError(Unknown
> Source)
>         at org.apache.xerces.impl.XMLErrorReporter.reportError(Unknown
> Source)
>         at org.apache.xerces.impl.XMLScanner.reportFatalError(Unknown
> Source)
>         at org.apache.xerces.impl.XMLScanner.scanXMLDeclOrTextDecl(Unknown
> Source)
>         at
> org.apache.xerces.impl.XMLDocumentFragmentScannerImpl.scanXMLDeclOrTextDecl
> (Unknown
> Source)
>         at
> org.apache.xerces.impl.XMLDocumentScannerImpl$XMLDeclDispatcher.dispatch
> (Unknown
> Source)
>         at
> org.apache.xerces.impl.XMLDocumentFragmentScannerImpl.scanDocument(Unknown
> Source)
>         at org.apache.xerces.parsers.XML11Configuration.parse(Unknown
> Source)
>         at org.apache.xerces.parsers.XML11Configuration.parse(Unknown
> Source)
>         at org.apache.xerces.parsers.XMLParser.parse(Unknown Source)
>         at org.apache.xerces.parsers.AbstractSAXParser.parse(Unknown
> Source)
>         at org.apache.xerces.jaxp.SAXParserImpl$JAXPSAXParser.parse(Unknown
> Source)
>         at org.apache.xerces.jaxp.SAXParserImpl.parse(Unknown Source)
>         at javax.xml.parsers.SAXParser.parse(Unknown Source)
>         at java.beans.XMLDecoder.&lt;init&gt;(XMLDecoder.java:461)
>         at java.beans.XMLDecoder.&lt;init&gt;(XMLDecoder.java:428)
>         at
> org.apache.harmony.beans.tests.java.beans.PersistenceDelegateTest.test_writeObject_java_util_AbstractList
> (PersistenceDelegateTest.java:859)
>         at java.lang.reflect.VMReflection.invokeMethod(VMReflection.java)
>         at java.lang.reflect.Method.invoke(Method.java:317)
>         at junit.framework.TestCase.runTest(TestCase.java:154)
>         at junit.framework.TestCase.runBare(TestCase.java:127)
>         at junit.framework.TestResult$1.protect(TestResult.java:106)
>         at junit.framework.TestResult.runProtected(TestResult.java:124)
>         at junit.framework.TestResult.run(TestResult.java:109)
>         at junit.framework.TestCase.run(TestCase.java:118)
>         at junit.framework.TestSuite.runTest(TestSuite.java:208)
>         at junit.framework.TestSuite.run(TestSuite.java:203)
>         at
> org.apache.tools.ant.taskdefs.optional.junit.JUnitTestRunner.run(
> JUnitTestRunner.java:297)
>         at
> org.apache.tools.ant.taskdefs.optional.junit.JUnitTestRunner.launch(
> JUnitTestRunner.java:672)
>         at
> org.apache.tools.ant.taskdefs.optional.junit.JUnitTestRunner.main(
> JUnitTestRunner.java:546)
> Continue...
> org.xml.sax.SAXParseException: The version is required in the XML
> declaration.
>         at org.apache.xerces.parsers.AbstractSAXParser.parse(Unknown
> Source)
>         at org.apache.xerces.jaxp.SAXParserImpl$JAXPSAXParser.parse(Unknown
> Source)
>         at org.apache.xerces.jaxp.SAXParserImpl.parse(Unknown Source)
>         at javax.xml.parsers.SAXParser.parse(Unknown Source)
>         at java.beans.XMLDecoder.&lt;init&gt;(XMLDecoder.java:461)
>         at java.beans.XMLDecoder.&lt;init&gt;(XMLDecoder.java:428)
>         at
> org.apache.harmony.beans.tests.java.beans.PersistenceDelegateTest.test_writeObject_java_util_AbstractList
> (PersistenceDelegateTest.java:859)
>         at java.lang.reflect.VMReflection.invokeMethod(VMReflection.java)
>         at java.lang.reflect.Method.invoke(Method.java:317)
>         at junit.framework.TestCase.runTest(TestCase.java:154)
>         at junit.framework.TestCase.runBare(TestCase.java:127)
>         at junit.framework.TestResult$1.protect(TestResult.java:106)
>         at junit.framework.TestResult.runProtected(TestResult.java:124)
>         at junit.framework.TestResult.run(TestResult.java:109)
>         at junit.framework.TestCase.run(TestCase.java:118)
>         at junit.framework.TestSuite.runTest(TestSuite.java:208)
>         at junit.framework.TestSuite.run(TestSuite.java:203)
>         at
> org.apache.tools.ant.taskdefs.optional.junit.JUnitTestRunner.run(
> JUnitTestRunner.java:297)
>         at
> org.apache.tools.ant.taskdefs.optional.junit.JUnitTestRunner.launch(
> JUnitTestRunner.java:672)
>         at
> org.apache.tools.ant.taskdefs.optional.junit.JUnitTestRunner.main(
> JUnitTestRunner.java:546)
> Continue...
> org.xml.sax.SAXParseException: The version is required in the XML
> declaration.
>         at
> org.apache.xerces.util.ErrorHandlerWrapper.createSAXParseException(Unknown
> Source)
>         at org.apache.xerces.util.ErrorHandlerWrapper.fatalError(Unknown
> Source)
>         at org.apache.xerces.impl.XMLErrorReporter.reportError(Unknown
> Source)
>         at org.apache.xerces.impl.XMLErrorReporter.reportError(Unknown
> Source)
>         at org.apache.xerces.impl.XMLScanner.reportFatalError(Unknown
> Source)
>         at org.apache.xerces.impl.XMLScanner.scanXMLDeclOrTextDecl(Unknown
> Source)
>         at
> org.apache.xerces.impl.XMLDocumentFragmentScannerImpl.scanXMLDeclOrTextDecl
> (Unknown
> Source)
>         at
> org.apache.xerces.impl.XMLDocumentScannerImpl$XMLDeclDispatcher.dispatch
> (Unknown
> Source)
>         at
> org.apache.xerces.impl.XMLDocumentFragmentScannerImpl.scanDocument(Unknown
> Source)
>         at org.apache.xerces.parsers.XML11Configuration.parse(Unknown
> Source)
>         at org.apache.xerces.parsers.XML11Configuration.parse(Unknown
> Source)
>         at org.apache.xerces.parsers.XMLParser.parse(Unknown Source)
>         at org.apache.xerces.parsers.AbstractSAXParser.parse(Unknown
> Source)
>         at org.apache.xerces.jaxp.SAXParserImpl$JAXPSAXParser.parse(Unknown
> Source)
>         at org.apache.xerces.jaxp.SAXParserImpl.parse(Unknown Source)
>         at javax.xml.parsers.SAXParser.parse(Unknown Source)
>         at java.beans.XMLDecoder.&lt;init&gt;(XMLDecoder.java:461)
>         at java.beans.XMLDecoder.&lt;init&gt;(XMLDecoder.java:428)
>         at
> org.apache.harmony.beans.tests.java.beans.PersistenceDelegateTest.test_writeObject_java_util_AbstractMap
> (PersistenceDelegateTest.java:878)
>         at java.lang.reflect.VMReflection.invokeMethod(VMReflection.java)
>         at java.lang.reflect.Method.invoke(Method.java:317)
>         at junit.framework.TestCase.runTest(TestCase.java:154)
>         at junit.framework.TestCase.runBare(TestCase.java:127)
>         at junit.framework.TestResult$1.protect(TestResult.java:106)
>         at junit.framework.TestResult.runProtected(TestResult.java:124)
>         at junit.framework.TestResult.run(TestResult.java:109)
>         at junit.framework.TestCase.run(TestCase.java:118)
>         at junit.framework.TestSuite.runTest(TestSuite.java:208)
>         at junit.framework.TestSuite.run(TestSuite.java:203)
>         at
> org.apache.tools.ant.taskdefs.optional.junit.JUnitTestRunner.run(
> JUnitTestRunner.java:297)
>         at
> org.apache.tools.ant.taskdefs.optional.junit.JUnitTestRunner.launch(
> JUnitTestRunner.java:672)
>         at
> org.apache.tools.ant.taskdefs.optional.junit.JUnitTestRunner.main(
> JUnitTestRunner.java:546)
> Continue...
> org.xml.sax.SAXParseException: The version is required in the XML
> declaration.
>         at org.apache.xerces.parsers.AbstractSAXParser.parse(Unknown
> Source)
>         at org.apache.xerces.jaxp.SAXParserImpl$JAXPSAXParser.parse(Unknown
> Source)
>         at org.apache.xerces.jaxp.SAXParserImpl.parse(Unknown Source)
>         at javax.xml.parsers.SAXParser.parse(Unknown Source)
>         at java.beans.XMLDecoder.&lt;init&gt;(XMLDecoder.java:461)
>         at java.beans.XMLDecoder.&lt;init&gt;(XMLDecoder.java:428)
>         at
> org.apache.harmony.beans.tests.java.beans.PersistenceDelegateTest.test_writeObject_java_util_AbstractMap
> (PersistenceDelegateTest.java:878)
>         at java.lang.reflect.VMReflection.invokeMethod(VMReflection.java)
>         at java.lang.reflect.Method.invoke(Method.java:317)
>         at junit.framework.TestCase.runTest(TestCase.java:154)
>         at junit.framework.TestCase.runBare(TestCase.java:127)
>         at junit.framework.TestResult$1.protect(TestResult.java:106)
>         at junit.framework.TestResult.runProtected(TestResult.java:124)
>         at junit.framework.TestResult.run(TestResult.java:109)
>         at junit.framework.TestCase.run(TestCase.java:118)
>         at junit.framework.TestSuite.runTest(TestSuite.java:208)
>         at junit.framework.TestSuite.run(TestSuite.java:203)
>         at
> org.apache.tools.ant.taskdefs.optional.junit.JUnitTestRunner.run(
> JUnitTestRunner.java:297)
>         at
> org.apache.tools.ant.taskdefs.optional.junit.JUnitTestRunner.launch(
> JUnitTestRunner.java:672)
>         at
> org.apache.tools.ant.taskdefs.optional.junit.JUnitTestRunner.main(
> JUnitTestRunner.java:546)
> Continue...
>



-- 
Spark Shen
China Software Development Lab, IBM

Mime
  • Unnamed multipart/alternative (inline, None, 0 bytes)
View raw message