harmony-dev mailing list archives

Site index · List index
Message view « Date » · « Thread »
Top « Date » · « Thread »
From "Nathan Beyer" <ndbe...@apache.org>
Subject Re: [build-test alert] BUILD FAILED Windows XP x86: classlib-test
Date Wed, 27 Jun 2007 00:09:45 GMT
Possibly. I had some additional failures in a build just prior to
that, but they may be fixed.

Test: testGetResourceClass:
org.apache.harmony.beans.tests.java.beans.beancontext.BeanContextSupportTestjava.lang.NullPointerException
       at java.beans.beancontext.BeanContextSupport.getResource(BeanContextSupport.java:702)
       at org.apache.harmony.beans.tests.java.beans.beancontext.BeanContextSupportTest.testGetResource(BeanContextSupportTest.java:1171)
       at java.lang.reflect.VMReflection.invokeMethod(VMReflection.java)
Test: testCreateSubmitComponentClass:
javax.swing.text.html.FormView_FormInputElementTestjunit.framework.AssertionFailedError:
Test interrupted due timeout
       at javax.swing.BasicSwingTestCase.runBare(BasicSwingTestCase.java:147)

On 6/26/07, Tim Ellison <t.p.ellison@gmail.com> wrote:
> Nathan,
>
> Do you just have this one test timing out?
>
> Regards,
> Tim
>
> nbeyer@kc.rr.com wrote:
> > BUILD FAILED:
> >       Ant Error Message:
> > C:\harmony\buildtest2\scripts\cc-exec-adaptor.xml:101: The following error occurred
while executing this line: C:\harmony\buildtest2\adaptors\classlib-test\adaptor.xml:78: There
were CLASSLIB Unit Test failures.
> >
> > Date of build:        06/26/2007 14:21:16
> > Time to build:        69 minutes 27 seconds
> > Last changed: 06/26/2007 13:50:28
> > Last log entry:       drlvm
> >
> > ***********************************************************
> > Errors/Warnings:      (7)
> >
> > [junit] Tests FAILED
> > BUILD FAILED
> > C:\harmony\buildtest2\build\checkouts\classlib\build.xml:169: The following error
occurred while executing this line:
> > C:\harmony\buildtest2\build\checkouts\classlib\make\build-test.xml:148: There were
test failures.
> > Total time: 63 minutes 57 seconds
> > The execution FAILED with the following exception:
> > The following error occurred while executing this line:
> > C:\harmony\buildtest2\adaptors\classlib-test\adaptor.xml:78: There were CLASSLIB
Unit Test failures.
> >
> > ***********************************************************
> > Unit Tests: (22928)
> >
> > failure: testCreateSubmitComponent javax.swing.text.html.FormView_FormInputElementTest
> > Unit Test Error Details:      (1)
> >
> > Test: testCreateSubmitComponentClass: javax.swing.text.html.FormView_FormInputElementTestjunit.framework.AssertionFailedError:
Test interrupted due timeout
> >       at javax.swing.BasicSwingTestCase.runBare(BasicSwingTestCase.java:147)
> >
> > ***********************************************************
> > Modifications since last successful build:    (1625)
>
>

Mime
View raw message