harmony-dev mailing list archives

Site index · List index
Message view « Date » · « Thread »
Top « Date » · « Thread »
From "Alexey Ivanov" <alxey.iva...@gmail.com>
Subject Re: [continuum] BUILD FAILURE: Classlib/linux.ia32 Build/Test
Date Wed, 20 Jun 2007 12:45:33 GMT
Mark,

There is JIRA issue regarding this failure:
https://issues.apache.org/jira/browse/HARMONY-4194.

I can reproduce it, however sometimes the test passes successfully.
My investigation show that the document has a different structure
rather than the expected one. It happens when icon is added into
document in setUp() method.

Regards,
Alexey.

2007/6/19, Mark Hindess <mark.hindess@googlemail.com>:
>
> I'm seeing:
>
>   javax.swing.text.html.MinimalHTMLWriterTest FAILED
>
> expected:<... </b> <span style="[color: #00ff00">~] more green text>
but was:
> <... </b> <span style="[] more green text>
>
> junit.framework.ComparisonFailure: expected:<... </b> <span style="[color:
#
> 00ff00">~] more green text> but was:<... </b> <span style="[] more
green text>
>
> at javax.swing.text.html.MinimalHTMLWriterTest.testWriteContent
> (MinimalHTMLWriterTest.java:220)
> at java.lang.reflect.AccessibleObject.invokeV(AccessibleObject.java:25)
> at javax.swing.BasicSwingTestCase.runBareSuper
> (BasicSwingTestCase.java:117) at javax.swing.SwingTestCase$1.run
> (SwingTestCase.java:45)
>
> This failure first appeared in build with r548556 (last passed in
> r548507).
>
> Regards,
>  Mark.
>
> On 19 June 2007 at 4:25, nomail@hursley.ibm.com wrote:
> > Online report : http://people.apache.org/~hindessm/continuum/classlib/linux.i
> > a32/2007/06/19/20070619-032502.failure.log.gz
> > Build statistics:
> >   State: Failed
> >   Previous State: Ok
> >   Started at: Tue, 19 Jun 2007 03:09:25 +0100
> >   Finished at: Tue, 19 Jun 2007 04:24:59 +0100
> >   Total time: 1h 15m 34s
> >   Build Trigger: Schedule
> >   Exit code: 1
> >   Building machine hostname: hy2
> >   Operating system : Linux(unknown)
> >   Java version : 1.5.0_06(Sun Microsystems Inc.)
> >
> > Changes
> >                             classlib/modules/jndi/META-INF/MANIFEST.MF
> >             classlib/modules/jndi/src/test/java/org/apache/harmony/jndi/tests
> > /javax/naming/ldap/RdnTest.java
> >             classlib/modules/jndi/src/main/java/javax/naming/ldap/Rdn.java
> >             classlib/modules/sql/src/test/java/org/apache/harmony/sql/tests/j
> > avax/sql/ConnectionEventTest.java
> >             classlib/modules/sql/src/test/java/org/apache/harmony/sql/tests/j
> > avax/sql/rowset/BaseRowSetTest.java
> >             classlib/modules/sql/src/main/java/javax/sql/ConnectionEvent.java
> >             classlib/modules/sql/src/main/java/javax/sql/rowset/spi/SyncFacto
> > ry.java
> >             classlib/modules/sql/src/main/java/javax/sql/rowset/spi/ProviderI
> > mpl.java
> >             classlib/modules/sql/src/main/java/javax/sql/rowset/BaseRowSet.ja
> > va
> >             classlib/modules/luni/.classpath
> >
> > ****************************************************************************
> > Output:
> > ****************************************************************************
> > Buildfile: build.xml
> >
> > svn-prop:
> >
> > build:
> >    [delete] Deleting directory /home/hybld/continuum-working-directory/6/clas
> > slib/deploy
> >      [echo] Classlib revision is 548556
> >      [echo] Post process: true
> >      [echo] JAPI: true
> >      [echo] Building with reference jdk/javac
> >      [exec] Buildfile: build.xml
> >
> >      [exec] -init-hdk-for-clean:
> >      [exec]     [mkdir] Created dir: /home/hybld/continuum-working-directory/
> > 6/classlib/deploy/build/ant
> >      [exec]      [copy] Copying 1 file to /home/hybld/continuum-working-direc
> > tory/6/classlib/deploy/build/ant
> >
> >      [exec] clean-java:
> >
> >      [exec] -modules-clean-bin:
> >
> >      [exec] clean:
> >      [exec]    [delete] Deleting 30 files from /home/hybld/continuum-working-
> > directory/6/classlib/build/classes
> >      [exec]    [delete] Deleting 12 files from /home/hybld/continuum-working-
> > directory/6/classlib/modules/accessibility/bin/test
> >
> >      [exec] clean:
> >      [exec]    [delete] Deleting 13 files from /home/hybld/continuum-working-
> > directory/6/classlib/build/classes
> >      [exec]    [delete] Deleting 5 files from /home/hybld/continuum-working-d
> > irectory/6/classlib/modules/annotation/bin/test
> >
> >      [exec] clean:
> >      [exec]    [delete] Deleting 35 files from /home/hybld/continuum-working-
> > directory/6/classlib/build/classes
> >      [exec]    [delete] Deleting 1 files from /home/hybld/continuum-working-d
> > irectory/6/classlib/modules/applet/bin/test
> >
> >      [exec] clean:
> >      [exec]    [delete] Deleting 42 files from /home/hybld/continuum-working-
> > directory/6/classlib/build/classes
> >      [exec]    [delete] Deleting 36 files from /home/hybld/continuum-working-
> > directory/6/classlib/modules/archive/bin/test
> >
> >      [exec] clean-native-includes:
> >      [exec]    [delete] /home/hybld/continuum-working-directory/6/classlib/de
> > ploy/include not found.
> >
> >      [exec] clean:
> >      [exec]    [delete] Deleting 112 files from /home/hybld/continuum-working
> > -directory/6/classlib/build/classes
> >      [exec]    [delete] Deleting 226 files from /home/hybld/continuum-working
> > -directory/6/classlib/modules/auth/bin/test
> >
> >      [exec] clean:
> >      [exec]    [delete] Deleting 922 files from /home/hybld/continuum-working
> > -directory/6/classlib/build/classes
> >      [exec]    [delete] Deleting 540 files from /home/hybld/continuum-working
> > -directory/6/classlib/modules/awt/bin/test
> >
> >      [exec] clean:
> >      [exec]    [delete] Deleting 107 files from /home/hybld/continuum-working
> > -directory/6/classlib/build/classes
> >      [exec]    [delete] Deleting 256 files from /home/hybld/continuum-working
> > -directory/6/classlib/modules/beans/bin/test
> >
> >      [exec] clean:
> >      [exec]    [delete] Deleting 125 files from /home/hybld/continuum-working
> > -directory/6/classlib/build/classes
> >      [exec]    [delete] /home/hybld/continuum-working-directory/6/classlib/mo
> > dules/concurrent/bin/test not found.
> >
> >      [exec] clean:
> >      [exec]    [delete] Deleting 48 files from /home/hybld/continuum-working-
> > directory/6/classlib/build/classes
> >      [exec]    [delete] Deleting 90 files from /home/hybld/continuum-working-
> > directory/6/classlib/modules/crypto/bin/test
> >
> >      [exec] clean:
> >      [exec]    [delete] Deleting 93 files from /home/hybld/continuum-working-
> > directory/6/classlib/build/classes
> >      [exec]    [delete] Deleting 3 files from /home/hybld/continuum-working-d
> > irectory/6/classlib/modules/imageio/bin/test
> >
> >      [exec] clean:
> >      [exec]    [delete] Deleting 9 files from /home/hybld/continuum-working-d
> > irectory/6/classlib/build/classes
> >      [exec]    [delete] Deleting 20 files from /home/hybld/continuum-working-
> > directory/6/classlib/modules/instrument/bin/test
> >
> >      [exec] clean:
> >      [exec]    [delete] Deleting 176 files from /home/hybld/continuum-working
> > -directory/6/classlib/build/classes
> >      [exec]    [delete] Deleting 198 files from /home/hybld/continuum-working
> > -directory/6/classlib/modules/jndi/bin/test
> >
> >      [exec] clean:
> >      [exec]    [delete] Deleting 43 files from /home/hybld/continuum-working-
> > directory/6/classlib/build/classes
> >      [exec]    [delete] Deleting 18 files from /home/hybld/continuum-working-
> > directory/6/classlib/modules/lang-management/bin/api
> >      [exec]    [delete] Deleting 16 files from /home/hybld/continuum-working-
> > directory/6/classlib/modules/lang-management/bin/impl
> >
> >      [exec] clean:
> >      [exec]    [delete] Deleting 34 files from /home/hybld/continuum-working-
> > directory/6/classlib/build/classes
> >      [exec]    [delete] Deleting 100 files from /home/hybld/continuum-working
> > -directory/6/classlib/modules/logging/bin/test
> >
> >      [exec] clean:
> >      [exec]    [delete] Deleting 971 files from /home/hybld/continuum-working
> > -directory/6/classlib/build/classes
> >      [exec]    [delete] Deleting 958 files from /home/hybld/continuum-working
> > -directory/6/classlib/modules/luni/bin/test
> >
> >      [exec] clean-native-includes:
> >      [exec]    [delete] /home/hybld/continuum-working-directory/6/classlib/de
> > ploy/include not found.
> >      [exec]    [delete] /home/hybld/continuum-working-directory/6/classlib/de
> > ploy/jdk/include not found.
> >
> >      [exec] clean:
> >      [exec]    [delete] Deleting 29 files from /home/hybld/continuum-working-
> > directory/6/classlib/build/classes
> >
> >      [exec] clean:
> >      [exec]    [delete] Deleting 14 files from /home/hybld/continuum-working-
> > directory/6/classlib/build/classes
> >      [exec]    [delete] Deleting 25 files from /home/hybld/continuum-working-
> > directory/6/classlib/modules/math/bin/test
> >
> >      [exec] clean:
> >      [exec]    [delete] Deleting 14 files from /home/hybld/continuum-working-
> > directory/6/classlib/build/classes
> >      [exec]    [delete] Deleting 1 files from /home/hybld/continuum-working-d
> > irectory/6/classlib/modules/misc/bin/test
> >
> >      [exec] clean:
> >      [exec]    [delete] Deleting 142 files from /home/hybld/continuum-working
> > -directory/6/classlib/build/classes
> >      [exec]    [delete] Deleted 5 directories from /home/hybld/continuum-work
> > ing-directory/6/classlib/build/classes
> >      [exec]    [delete] Deleting 157 files from /home/hybld/continuum-working
> > -directory/6/classlib/modules/nio/bin/test
> >      [exec]    [delete] Deleted 19 directories from /home/hybld/continuum-wor
> > king-directory/6/classlib/modules/nio/bin/test
> >
> >      [exec] clean:
> >      [exec]    [delete] Deleting 303 files from /home/hybld/continuum-working
> > -directory/6/classlib/build/classes
> >      [exec]    [delete] Deleting 79 files from /home/hybld/continuum-working-
> > directory/6/classlib/modules/nio_char/bin/test
> >
> >      [exec] clean:
> >      [exec]    [delete] Deleting 44 files from /home/hybld/continuum-working-
> > directory/6/classlib/build/classes
> >      [exec]    [delete] Deleting 19 files from /home/hybld/continuum-working-
> > directory/6/classlib/modules/pack200/bin/test
> >
> >      [exec] clean-native-includes:
> >      [exec]    [delete] /home/hybld/continuum-working-directory/6/classlib/de
> > ploy/include not found.
> >
> >      [exec] clean:
> >
> >      [exec] clean:
> >      [exec]    [delete] Deleting 32 files from /home/hybld/continuum-working-
> > directory/6/classlib/build/classes
> >      [exec]    [delete] Deleting 34 files from /home/hybld/continuum-working-
> > directory/6/classlib/modules/prefs/bin/test
> >
> >      [exec] clean:
> >      [exec]    [delete] Deleting 205 files from /home/hybld/continuum-working
> > -directory/6/classlib/build/classes
> >      [exec]    [delete] Deleting 60 files from /home/hybld/continuum-working-
> > directory/6/classlib/modules/print/bin/test
> >
> >      [exec] clean:
> >      [exec]    [delete] Deleting 177 files from /home/hybld/continuum-working
> > -directory/6/classlib/build/classes
> >      [exec]    [delete] Deleting 14 files from /home/hybld/continuum-working-
> > directory/6/classlib/modules/regex/bin/test
> >
> >      [exec] clean:
> >      [exec]    [delete] Deleting 230 files from /home/hybld/continuum-working
> > -directory/6/classlib/build/classes
> >      [exec]    [delete] Deleting 53 files from /home/hybld/continuum-working-
> > directory/6/classlib/modules/rmi/bin/test
> >
> >      [exec] clean:
> >      [exec]    [delete] Deleting 429 files from /home/hybld/continuum-working
> > -directory/6/classlib/build/classes
> >      [exec]    [delete] Deleting 622 files from /home/hybld/continuum-working
> > -directory/6/classlib/modules/security/bin/test
> >
> >      [exec] clean:
> >      [exec]    [delete] Deleting 2 files from /home/hybld/continuum-working-d
> > irectory/6/classlib/build/classes
> >
> >      [exec] clean:
> >      [exec]    [delete] Deleting 74 files from /home/hybld/continuum-working-
> > directory/6/classlib/build/classes
> >      [exec]    [delete] Deleting 54 files from /home/hybld/continuum-working-
> > directory/6/classlib/modules/sound/bin/test
> >
> >      [exec] clean:
> >      [exec]    [delete] Deleting 84 files from /home/hybld/continuum-working-
> > directory/6/classlib/build/classes
> >      [exec]    [delete] Deleting 76 files from /home/hybld/continuum-working-
> > directory/6/classlib/modules/sql/bin/test
> >
> >      [exec] clean:
> >      [exec]    [delete] Deleting 6 files from /home/hybld/continuum-working-d
> > irectory/6/classlib/build/classes
> >
> > ...
> >
> >      [exec]     [javac] ----------
> >      [exec]     [javac] 1. WARNING in /home/hybld/continuum-working-directory
> > /6/classlib/modules/annotation/src/test/java/org/apache/harmony/annotation/te
> > sts/java/lang/annotation/IncompleteAnnotationExceptionTest.java
> >      [exec]     [javac]  (at line 53)
> >      [exec]     [javac]       clazz, elementName);
> >      [exec]     [javac]       ^^^^^
> >      [exec]     [javac] Type safety: The expression of type Class needs unche
> > cked conversion to conform to Class<? extends Annotation>
> >      [exec]     [javac] ----------
> >      [exec]     [javac] 1 problem (1 warning)
> >
> >      [exec] prepare-exclude:
> >
> > ...
> >
> >      [exec]     [junit] org.apache.harmony.rmi.test.MyException: MyRemoteObje
> > ct.test_Exception
> >      [exec]     [junit] Done.
> >
> >      [exec]     [junit] Testing test_Error...
> >      [exec]     [junit] java.rmi.ServerError: Error occurred while remote met
> > hod invocation; nested exception is:
> >      [exec]     [junit]       java.lang.Error: MyRemoteObject.test_Error
> >      [exec]     [junit] Done.
> >
> >      [exec]     [junit] Testing test_RuntimeException...
> >      [exec]     [junit] java.lang.RuntimeException: MyRemoteObject.text_Runti
> > meException
> >      [exec]     [junit] Done.
> >
> > ...
> >
> >      [exec]     [junit] org.apache.harmony.rmi.test.MyException: MyRemoteObje
> > ct.test_Exception
> >      [exec]     [junit] Done.
> >
> >      [exec]     [junit] Testing test_Error...
> >      [exec]     [junit] java.rmi.ServerError: Error occurred while remote met
> > hod invocation; nested exception is:
> >      [exec]     [junit]       java.lang.Error: MyRemoteObject.test_Error
> >      [exec]     [junit] Done.
> >
> >      [exec]     [junit] Testing test_RuntimeException...
> >      [exec]     [junit] java.lang.RuntimeException: MyRemoteObject.text_Runti
> > meException
> >      [exec]     [junit] Done.
> >
> > ...
> >
> >      [exec]     [junit] Tests run: 1, Failures: 0, Errors: 0, Time elapsed: 0
> > .003 sec
> >      [exec]     [junit] Tests run: 35, Failures: 0, Errors: 0, Time elapsed:
> > 4.183 sec
> >      [exec]     [junit] Tests run: 5, Failures: 0, Errors: 0, Time elapsed: 0
> > .029 sec
> >      [exec]     [junit] Tests run: 22, Failures: 1, Errors: 0, Time elapsed:
> > 0.191 sec
> >      [exec]     [junit] TEST javax.swing.text.html.MinimalHTMLWriterTest FAIL
> > ED
> >      [exec]     [junit] Tests run: 8, Failures: 0, Errors: 0, Time elapsed: 0
> > .009 sec
> >      [exec]     [junit] Tests run: 16, Failures: 0, Errors: 0, Time elapsed:
> > 0.076 sec
> >      [exec]     [junit] Tests run: 10, Failures: 0, Errors: 0, Time elapsed:
> > 0.016 sec
> >      [exec]     [junit] Tests run: 3, Failures: 0, Errors: 0, Time elapsed: 0
> > .004 sec
> >      [exec]     [junit] Tests run: 5, Failures: 0, Errors: 0, Time elapsed: 0
> > .004 sec
> >
> > ...
> >
> >      [exec]     [junit] Tests run: 45, Failures: 0, Errors: 0, Time elapsed:
> > 0.007 sec
> >      [exec]     [junit] Tests run: 1, Failures: 0, Errors: 0, Time elapsed: 0
> > .003 sec
> >      [exec]     [junit] Tests run: 3, Failures: 0, Errors: 0, Time elapsed: 0
> > .005 sec
> >      [exec]     [junit] Tests run: 1, Failures: 0, Errors: 0, Time elapsed: 0
> > .005 sec
> >      [exec]     [junit] Tests FAILED
> >
> >      [exec] touch-failures-file:
> >
> >      [exec] touch-errors-file:
> >
> >
> > ...
> >
> >      [exec] gen-report:
> >
> >      [exec] check-test-result:
> >
> >      [exec] BUILD FAILED
> >      [exec] /home/hybld/continuum-working-directory/6/classlib/build.xml:169:
> >  The following error occurred while executing this line:
> >      [exec] /home/hybld/continuum-working-directory/6/classlib/make/build-tes
> > t.xml:148: There were test failures.
> >
> >      [exec] Total time: 56 minutes 53 seconds
> >      [exec] Result: 1
> >      [echo] Tests.failed is set to true
> >
> > japi:
> >
> >      [exec] Processing class java.lang,Object:+
> >      [exec] Processing package java.lang,:===================================
> > ==========================================+-+++++++++++-+++++++++++++-+++++++
> > ++++++++++-+++++-+++++++++++++++++++++++-++++--^+^+++++++++--++++++++++
> >
> > ...
> >
> >      [exec] Processing package java.lang.management,:========================
> > =====================================================++++-+++++++++++
> >      [exec] Processing package java.lang.ref,:===============================
> > ==============================================+++++
> >      [exec] Processing package java.lang.reflect,:===========================
> > ==================================================+++++++++++++++++++++
> >      [exec] Processing class ,java:
> >      [exec] Failed to Japize java: java.lang.RuntimeException: NoClassDefFoun
> > dError: java
> >      [exec] java.lang.RuntimeException: NoClassDefFoundError: java
> >      [exec]   at net.wuffies.japi.ClassFile.forName(ClassFile.java:163)
> >      [exec]   at net.wuffies.japi.Japize.getClassWrapper(Japize.java:1425)
> >      [exec]   at net.wuffies.japi.Japize.japizeClass(Japize.java:748)
> >      [exec]   at net.wuffies.japi.Japize.processClass(Japize.java:516)
> >
> > ...
> >
> >      [exec]   at net.wuffies.japi.Japize.doJapize(Japize.java:443)
> >      [exec]   at net.wuffies.japi.Japize.main(Japize.java:316)
> >
> >      [exec] Processing class ,javax:
> >      [exec] Failed to Japize javax: java.lang.RuntimeException: NoClassDefFou
> > ndError: javax
> >      [exec] java.lang.RuntimeException: NoClassDefFoundError: javax
> >      [exec]   at net.wuffies.japi.ClassFile.forName(ClassFile.java:163)
> >      [exec]   at net.wuffies.japi.Japize.getClassWrapper(Japize.java:1425)
> >      [exec]   at net.wuffies.japi.Japize.japizeClass(Japize.java:748)
> >      [exec]   at net.wuffies.japi.Japize.processClass(Japize.java:516)
> >
> > ...
> >
> >      [exec]   at net.wuffies.japi.Japize.doJapize(Japize.java:443)
> >      [exec]   at net.wuffies.japi.Japize.main(Japize.java:316)
> >
> >      [exec] Processing class ,org:
> >      [exec] Failed to Japize org: java.lang.RuntimeException: NoClassDefFound
> > Error: org
> >      [exec] java.lang.RuntimeException: NoClassDefFoundError: org
> >      [exec]   at net.wuffies.japi.ClassFile.forName(ClassFile.java:163)
> >      [exec]   at net.wuffies.japi.Japize.getClassWrapper(Japize.java:1425)
> >      [exec]   at net.wuffies.japi.Japize.japizeClass(Japize.java:748)
> >      [exec]   at net.wuffies.japi.Japize.processClass(Japize.java:516)
> >
> > ...
> >
> > update-index:
> >
> > test-result:
> >
> > BUILD FAILED
> > /home/hybld/continuum-working-directory/6/build.xml:205: There were test fail
> > ures.
> >
> > Total time: 75 minutes 33 seconds
> >
> > ****************************************************************************
> >
> > ...
> >
>
>
>

Mime
View raw message