harmony-dev mailing list archives

Site index · List index
Message view « Date » · « Thread »
Top « Date » · « Thread »
From "Vladimir Ivanov" <ivavladi...@gmail.com>
Subject [testing][build-test alert] BUILD FAILED Windows XP SP2 msvc debug: drlvm reg.test
Date Thu, 15 Feb 2007 07:52:56 GMT
This failure is happened due to issue 3177. It will nice if somebody
take care of it.

 thanks, Vladimir

-----Original Message-----
From: nomail@intel.com [mailto:nomail@intel.com]
Sent: Thursday, February 15, 2007 1:41 PM
To: alerts@harmony.apache.org
Subject: [build-test alert] BUILD FAILED Windows XP SP2 msvc debug:
drlvm reg.test

BUILD FAILED:
	Ant Error Message:
build timeout

Date of build:	02/15/2007 04:31:08
Time to build:	
Last changed:	02/15/2007 04:20:43
Last log entry:	drlvm

***********************************************************
Unit Tests: (17)


***********************************************************
Modifications since last successful build:	(1)

add cc-drlvm log20070215042043Lbuild.146 02/15/2007 04:20:43drlvm

Mime
View raw message