harmony-dev mailing list archives

Site index · List index
Message view « Date » · « Thread »
Top « Date » · « Thread »
From "Vladimir Ivanov" <ivavladi...@gmail.com>
Subject Re: [drlvm][testing] regression tests for DRLVM
Date Mon, 05 Feb 2007 07:31:50 GMT
For the SUSE 9 Linux x86_64 these tests also failed with message:
     [exec] run-test:
     [exec]     [junit] Running
org.apache.harmony.drlvm.tests.regression.h2335.SimplestLibraryPathTest
     [exec]     [junit] Tests run: 1, Failures: 0, Errors: 0, Time
elapsed: 0.225 sec
     [exec]     [junit] Running
org.apache.harmony.drlvm.tests.regression.h2808.finTest
     [exec]     [junit] vf_debug: verifying class
org/apache/harmony/drlvm/tests/regression/h2808/finTest1 (method
test()V) couldn't load class
"org/apache/harmony/drlvm/tests/regression/h2808/finTest2"
     [exec]     [junit] vf_debug: VerifyError:
org/apache/harmony/drlvm/tests/regression/h2808/finTest2
     [exec]     [junit] Tests run: 1, Failures: 0, Errors: 0, Time
elapsed: 0.232 sec

     [exec] run-test:
     [exec]      [echo] Running on JIT
     [exec]     [junit] Running
org.apache.harmony.drlvm.tests.regression.h2926.Test
     [exec]     [junit] java:
/export/cruise/trunk/cc/projects/drlvm/trunk/vm/vmcore/src/util/linux/signals_em64t.cpp:106:
void asm_jvmti_exception_catch_callback(): Assertion `0' failed.
     [exec]     [junit] Fatal error
     [exec]      [echo] Running on interpreter
     [exec]     [junit] Running
org.apache.harmony.drlvm.tests.regression.h2926.Test
     [exec]     [junit] Test
org.apache.harmony.drlvm.tests.regression.h2926.Test FAILED
     [exec]     [junit] Tests run: 1, Failures: 0, Errors: 0, Time
elapsed: 0.857 sec

Thanks, Vladimir

On 2/5/07, Vladimir Ivanov <ivavladimir@gmail.com> wrote:
> Hello everyone,
> today the run of DRLVM regression tests was added to the CC-cycle. It
> works OK on SUSE Linux ia32m but failed on Windows XP with message:
> run-test:
>    [junit] Running org.apache.harmony.drlvm.tests.regression.h3027.AgentLibTest
>    [junit] Failed to open agent library AgentLib.dll : The specified
> module could not be found.
>    [junit] Failed to open agent library AgentLib.dll
>    [junit] Failed to initialize JVMTI.
>    [junit] HMYEXEL062E Internal VM error: Failed to create Java VM
>    [junit] FAILED to invoke JVM.
>    [junit] Test
> org.apache.harmony.drlvm.tests.regression.h3027.AgentLibTest FAILED
>
> Note the build report "BUILD SUCCESSFUL" status in this case.
>
> Could anybody take care about this test?
>
>  thanks, Vladimir
>

Mime
View raw message