harmony-dev mailing list archives

Site index · List index
Message view « Date » · « Thread »
Top « Date » · « Thread »
From "Vladimir Ivanov" <ivavladi...@gmail.com>
Subject Re: [build-test alert] BUILD FAILED Windows XP SP2 msvc debug: classlib over drlvm
Date Tue, 09 Jan 2007 09:02:59 GMT
Actually, this message always goes in pair with message:

"Compiling AWT classes
Compiling AWT tests
Since fork is false, ignoring memoryMaximumSize setting
java.lang.RuntimeException: expected from EDT
at java.awt.EventDispatchThreadRTest$1.run(EventDispatchThreadRTest.java:29)
at java.awt.event.InvocationEvent.runAndNotify(InvocationEvent.java:98)
at java.awt.event.InvocationEvent.dispatch(InvocationEvent.java:78)
at java.awt.EventQueueCore.dispatchEventImpl(EventQueueCore.java:133)
at java.awt.EventQueue.dispatchEvent(EventQueue.java:144)
at java.awt.EventDispatchThread.runModalLoop(EventDispatchThread.java:74)
at java.awt.EventDispatchThread.run(EventDispatchThread.java:48)"



in the log (and always it fixed without any external helps).



I think it is a test problem.



Thanks, Vladimir


On 1/3/07, Naveen Neelakantam <neelakan@uiuc.edu> wrote:
>
> I'm seeing the same error on RHEL4, and I have no idea why this is
> happening.
>
> Naveen
>
> On Jan 3, 2007, at 10:26 AM, Tim Ellison wrote:
>
> > This looks like a configuration problem?
> >
> > Not sure how I managed to trigger it this time.
> >
> > Tim
> >
> > nomail@intel.com wrote:
> >> BUILD FAILED:
> >>      Ant Error Message:
> >> C:\cc.harmony\trunk\cc\projects\classlib\trunk\build.xml:167: The
> >> following error occurred while executing this line: C:\cc.harmony
> >> \trunk\cc\projects\classlib\trunk\make\build-test.xml:289: Could
> >> not create task or type of type: replaceregexp.  Ant could not
> >> find the task or a class this task relies upon.  This is common
> >> and has a number of causes; the usual  solutions are to read the
> >> manual pages then download and install needed JAR files, or fix
> >> the build file:   - You have misspelt 'replaceregexp'.    Fix:
> >> check your spelling.  - The task needs an external JAR file to
> >> execute      and this is not found at the right place in the
> >> classpath.    Fix: check the documentation for dependencies.
> >> Fix: declare the task.  - The task is an Ant optional task and the
> >> JAR file and/or libraries      implementing the functionality were
> >> not found at the time you      yourself built your installation of
> >> Ant from the Ant sources.    Fix: Look in the ANT_HOME/lib for the
> >> 'ant-' JAR corre
> > sp!
> >>  onding to the      task and make sure it contains more than
> >> merely a META-INF/MANIFEST.MF.      If all it contains is the
> >> manifest, then rebuild Ant with the needed      libraries present
> >> in C:\cc.harmony\trunk\cc/lib/optional/ , or alternatively,
> >> download a pre-built release version from apache.org  - The build
> >> file was written for a later version of Ant    Fix: upgrade to at
> >> least the latest release version of Ant  - The task is not an Ant
> >> core or optional task       and needs to be declared using
> >> <taskdef>.  - You are attempting to use a task defined using
> >> <presetdef> or <macrodef> but have spelt wrong or not     defined
> >> it at the point of use  Remember that for JAR files to be visible
> >> to Ant tasks implemented in ANT_HOME/lib, the files must be in the
> >> same directory or on the classpath  Please neither file bug
> >> reports on this problem, nor email the Ant mailing lists, until
> >> all of these causes have been explored, as this is not an Ant bug.
> >>
> >> Date of build:       01/03/2007 21:24:52
> >> Time to build:       36 minutes 27 seconds
> >> Last changed:        01/03/2007 21:15:00
> >> Last log entry:      drlvm
> >>
> >> ***********************************************************
> >> Errors/Warnings:(181)
> >>
> >>
> >> ***********************************************************
> >> Unit Tests: (16937)
> >>
> >> All Tests Passed
> >>
> >> ***********************************************************
> >> Modifications since last successful build:   (67)
> >>
> >> add cc-drlvm log20070103211500Lbuild.71 01/03/2007 21:15:00drlvm
> >> add cc-classlib log20070103200246Lbuild.50 01/03/2007
> >> 20:02:46classlib
> >> modified tellison  /harmony/enhanced/classlib/trunk/modules/jndi/
> >> src/main/java/javax/naming/spi/DirectoryManager.java 01/03/2007
> >> 19:42:37 Apply patch HARMONY-547 ([classlib][jndi] dead code in
> >> javax.naming.spi.DirectoryManager)
> >> modified tellison  /harmony/enhanced/classlib/trunk/modules/math/
> >> src/main/java/java/math/Logical.java 01/03/2007 19:36:37 Apply
> >> patch HARMONY-2864 ([Classlib][math] Wrong words in math module)
> >> modified tellison  /harmony/enhanced/classlib/trunk/modules/math/
> >> src/main/java/java/math/Primality.java 01/03/2007 19:36:37 Apply
> >> patch HARMONY-2864 ([Classlib][math] Wrong words in math module)
> > ...
>
>

Mime
  • Unnamed multipart/alternative (inline, None, 0 bytes)
View raw message