harmony-dev mailing list archives

Site index · List index
Message view « Date » · « Thread »
Top « Date » · « Thread »
From "Stepan Mishura" <stepan.mish...@gmail.com>
Subject Re: [continuum] BUILD SUCCESSFUL: Classlib/linux.ia32 Build/Test
Date Tue, 16 Jan 2007 11:20:11 GMT
On 1/16/07, Geir Magnusson Jr. wrote:
>
> Can we please get rid of "harmony-dev@incubator" from our mail
> clients?   I know they are forwarded, but I've taken that address out
> of my server side folder rules to look for people still sending
> there....


Ops, sorry, I forgot to remove it from "quick contacts" list ... going to
remove it now.

-Stepan.

geir
>
> On Jan 16, 2007, at 6:03 AM, Stepan Mishura wrote:
>
> > The build and tests passed under CruiseControl but according to the
> > log
> > below there is compile error in AWT tests. I've checked classlib
> > build and
> > it failed on compiling AWT tests.
> >
> > What's wrong with CruiseControl?
> >
> > Thanks,
> > Stepan.
> >
> >> -----Original Message-----
> >
> >> From: nomail@hursley.ibm.com [mailto:nomail@hursley.ibm.com]
> >
> >> Sent: Tuesday, January 16, 2007 4:28 PM
> >
> >> To: alerts@harmony.apache.org
> >
> >> Subject: [continuum] BUILD SUCCESSFUL: Classlib/linux.ia32 Build/Test
> >
> >>
> >
> >> Online report :
> >
> >> http://people.apache.org/~hindessm/continuum/classlib/
> >> linux.ia32/2007/01/16
> >
> >> /20070116-102800.successful.log.gz
> >
> >> Build statistics:
> >
> >>  State: Ok
> >
> >>  Previous State: Failed
> >
> >>  Started at: Tue, 16 Jan 2007 10:08:42 +0000
> >
> >>  Finished at: Tue, 16 Jan 2007 10:27:58 +0000
> >
> >>  Total time: 19m 15s
> >
> >>  Build Trigger: Schedule
> >
> >>  Exit code: 0
> >
> >>  Building machine hostname: hy2
> >
> >>  Operating system : Linux(unknown)
> >
> >>  Java version : 1.5.0_06(Sun Microsystems Inc.)
> >
> >>
> >
> >> Changes
> >
> >>
> >
> >> classlib/modules/swing/src/test/api/java/common/javax/swing/plaf/
> >> basic/Basi
> >
> >> cOptionPaneUITest.java
> >
> >>
> >
> >> classlib/modules/swing/src/main/java/common/javax/swing/plaf/basic/
> >> BasicOpt
> >
> >> ionPaneUI.java
> >
> >>
> >
> >> classlib/modules/awt/src/test/api/java/common/java/awt/print/
> >> BookTest.java
> >
> >>
> >
> >> classlib/modules/security/src/main/java/common/org/apache/harmony/
> >> security/
> >
> >> provider/crypto/CryptoProvider.java
> >
> >>
> >
> >> classlib/modules/security/src/main/java/common/org/apache/harmony/
> >> security/
> >
> >> provider/cert/DRLCertFactory.java
> >
> >>
> >
> >> *********************************************************************
> >> ******
> >
> >> *
> >
> >> Output:
> >
> >> *********************************************************************
> >> ******
> >
> >> *
> >
> >> Buildfile: build.xml
> >
> >>
> >
> >> svn-prop:
> >
> >>
> >
> >> build:
> >
> >>   [delete] Deleting directory /home/hybld/continuum-working-
> >
> >> directory/6/classlib/deploy
> >
> >>     [echo] Classlib revision is 4320
> >
> >>     [echo] Post process: true
> >
> >>     [echo] JAPI: true
> >
> >>     [echo] Building with reference jdk/javac
> >
> >>     [exec] Buildfile: build.xml
> >
> >>
> >
> >>     [exec] -init-hdk-for-clean:
> >
> >>     [exec]     [mkdir] Created dir: /home/hybld/continuum-working-
> >
> >> directory/6/classlib/deploy/build/ant
> >
> >>     [exec]      [copy] Copying 1 file to /home/hybld/continuum-
> >> working-
> >
> >> directory/6/classlib/deploy/build/ant
> >
> >>
> >
> >>     [exec] clean-java:
> >
> >>
> >
> >>     [exec] -modules-clean-bin:
> >
> >>
> >
> >>     [exec] clean:
> >
> >>     [exec]    [delete] Deleting 30 files from /home/hybld/continuum-
> >
> >> working-directory/6/classlib/build/classes
> >
> >>     [exec]    [delete] Deleting 12 files from /home/hybld/continuum-
> >
> >> working-directory/6/classlib/modules/accessibility/bin/test
> >
> >>
> >
> >>     [exec] clean:
> >
> >>     [exec]    [delete] Deleting 13 files from /home/hybld/continuum-
> >
> >> working-directory/6/classlib/build/classes
> >
> >>     [exec]    [delete] Deleting 1 files from /home/hybld/continuum-
> >
> >> working-directory/6/classlib/modules/annotation/bin/test
> >
> >>
> >
> >>     [exec] clean:
> >
> >>     [exec]    [delete] Deleting 35 files from /home/hybld/continuum-
> >
> >> working-directory/6/classlib/build/classes
> >
> >>     [exec]    [delete] Deleting 1 files from /home/hybld/continuum-
> >
> >> working-directory/6/classlib/modules/applet/bin/test
> >
> >>
> >
> >>     [exec] clean:
> >
> >>     [exec]    [delete] Deleting 41 files from /home/hybld/continuum-
> >
> >> working-directory/6/classlib/build/classes
> >
> >>     [exec]    [delete] Deleting 34 files from /home/hybld/continuum-
> >
> >> working-directory/6/classlib/modules/archive/bin/test
> >
> >>
> >
> >>     [exec] clean-native-includes:
> >
> >>     [exec]    [delete] /home/hybld/continuum-working-
> >
> >> directory/6/classlib/deploy/include not found.
> >
> >>
> >
> >>     [exec] clean:
> >
> >>     [exec]    [delete] Deleting 113 files from /home/hybld/continuum-
> >
> >> working-directory/6/classlib/build/classes
> >
> >>     [exec]    [delete] Deleting 226 files from /home/hybld/continuum-
> >
> >> working-directory/6/classlib/modules/auth/bin/test
> >
> >>
> >
> >>     [exec] clean:
> >
> >>     [exec]    [delete] Deleting 901 files from /home/hybld/continuum-
> >
> >> working-directory/6/classlib/build/classes
> >
> >>     [exec]    [delete] Deleting 607 files from /home/hybld/continuum-
> >
> >> working-directory/6/classlib/modules/awt/bin/test
> >
> >>
> >
> >>     [exec] clean:
> >
> >>     [exec]    [delete] Deleting 107 files from /home/hybld/continuum-
> >
> >> working-directory/6/classlib/build/classes
> >
> >>     [exec]    [delete] Deleting 238 files from /home/hybld/continuum-
> >
> >> working-directory/6/classlib/modules/beans/bin/test
> >
> >>
> >
> >>     [exec] clean:
> >
> >>     [exec]    [delete] Deleting 125 files from /home/hybld/continuum-
> >
> >> working-directory/6/classlib/build/classes
> >
> >>     [exec]    [delete] /home/hybld/continuum-working-
> >
> >> directory/6/classlib/modules/concurrent/bin/test not found.
> >
> >>
> >
> >>     [exec] clean:
> >
> >>     [exec]    [delete] Deleting 48 files from /home/hybld/continuum-
> >
> >> working-directory/6/classlib/build/classes
> >
> >>     [exec]    [delete] Deleting 90 files from /home/hybld/continuum-
> >
> >> working-directory/6/classlib/modules/crypto/bin/test
> >
> >>
> >
> >>     [exec] clean:
> >
> >>     [exec]    [delete] Deleting 87 files from /home/hybld/continuum-
> >
> >> working-directory/6/classlib/build/classes
> >
> >>
> >
> >>     [exec] clean:
> >
> >>     [exec]    [delete] Deleting 9 files from /home/hybld/continuum-
> >
> >> working-directory/6/classlib/build/classes
> >
> >>     [exec]    [delete] Deleting 20 files from /home/hybld/continuum-
> >
> >> working-directory/6/classlib/modules/instrument/bin/test
> >
> >>
> >
> >>     [exec] clean:
> >
> >>     [exec]    [delete] Deleting 154 files from /home/hybld/continuum-
> >
> >> working-directory/6/classlib/build/classes
> >
> >>     [exec]    [delete] Deleting 163 files from /home/hybld/continuum-
> >
> >> working-directory/6/classlib/modules/jndi/bin/test
> >
> >>
> >
> >>     [exec] clean:
> >
> >>     [exec]    [delete] Deleting 43 files from /home/hybld/continuum-
> >
> >> working-directory/6/classlib/build/classes
> >
> >>     [exec]    [delete] /home/hybld/continuum-working-
> >
> >> directory/6/classlib/modules/lang-management/${hy.lang-
> >> management.bin.test}
> >
> >> not found.
> >
> >>
> >
> >>     [exec] clean:
> >
> >>     [exec]    [delete] Deleting 34 files from /home/hybld/continuum-
> >
> >> working-directory/6/classlib/build/classes
> >
> >>     [exec]    [delete] Deleting 99 files from /home/hybld/continuum-
> >
> >> working-directory/6/classlib/modules/logging/bin/test
> >
> >>
> >
> >>     [exec] clean:
> >
> >>     [exec]    [delete] Deleting 963 files from /home/hybld/continuum-
> >
> >> working-directory/6/classlib/build/classes
> >
> >>     [exec]    [delete] Deleting 903 files from /home/hybld/continuum-
> >
> >> working-directory/6/classlib/modules/luni/bin/test
> >
> >>
> >
> >>     [exec] clean-native-includes:
> >
> >>     [exec]    [delete] /home/hybld/continuum-working-
> >
> >> directory/6/classlib/deploy/include not found.
> >
> >>     [exec]    [delete] /home/hybld/continuum-working-
> >
> >> directory/6/classlib/deploy/jdk/include not found.
> >
> >>
> >
> >>     [exec] clean:
> >
> >>     [exec]    [delete] Deleting 29 files from /home/hybld/continuum-
> >
> >> working-directory/6/classlib/build/classes
> >
> >>
> >
> >>     [exec] clean:
> >
> >>     [exec]    [delete] Deleting 14 files from /home/hybld/continuum-
> >
> >> working-directory/6/classlib/build/classes
> >
> >>     [exec]    [delete] Deleting 25 files from /home/hybld/continuum-
> >
> >> working-directory/6/classlib/modules/math/bin/test
> >
> >>
> >
> >>     [exec] clean:
> >
> >>     [exec]    [delete] Deleting 14 files from /home/hybld/continuum-
> >
> >> working-directory/6/classlib/build/classes
> >
> >>     [exec]    [delete] Deleting 1 files from /home/hybld/continuum-
> >
> >> working-directory/6/classlib/modules/misc/bin/test
> >
> >>
> >
> >>     [exec] clean:
> >
> >>     [exec]    [delete] Deleting 146 files from /home/hybld/continuum-
> >
> >> working-directory/6/classlib/build/classes
> >
> >>     [exec]    [delete] Deleted 5 directories from /home/hybld/
> >> continuum-
> >
> >> working-directory/6/classlib/build/classes
> >
> >>     [exec]    [delete] Deleting 156 files from /home/hybld/continuum-
> >
> >> working-directory/6/classlib/modules/nio/bin/test
> >
> >>     [exec]    [delete] Deleted 19 directories from /home/hybld/
> >> continuum-
> >
> >> working-directory/6/classlib/modules/nio/bin/test
> >
> >>
> >
> >>     [exec] clean:
> >
> >>     [exec]    [delete] Deleting 20 files from /home/hybld/continuum-
> >
> >> working-directory/6/classlib/build/classes
> >
> >>     [exec]    [delete] Deleting 77 files from /home/hybld/continuum-
> >
> >> working-directory/6/classlib/modules/nio_char/bin/test
> >
> >>
> >
> >>     [exec] clean:
> >
> >>     [exec]    [delete] Deleting 37 files from /home/hybld/continuum-
> >
> >> working-directory/6/classlib/build/classes
> >
> >>     [exec]    [delete] Deleting 14 files from /home/hybld/continuum-
> >
> >> working-directory/6/classlib/modules/pack200/bin/test
> >
> >>
> >
> >>     [exec] clean:
> >
> >>
> >
> >>     [exec] clean-native-includes:
> >
> >>     [exec]    [delete] /home/hybld/continuum-working-
> >
> >> directory/6/classlib/deploy/include not found.
> >
> >>
> >
> >>     [exec] clean:
> >
> >>     [exec]    [delete] Deleting 32 files from /home/hybld/continuum-
> >
> >> working-directory/6/classlib/build/classes
> >
> >>     [exec]    [delete] Deleting 34 files from /home/hybld/continuum-
> >
> >> working-directory/6/classlib/modules/prefs/bin/test
> >
> >>
> >
> >>     [exec] clean:
> >
> >>     [exec]    [delete] Deleting 205 files from /home/hybld/continuum-
> >
> >> working-directory/6/classlib/build/classes
> >
> >>     [exec]    [delete] Deleting 60 files from /home/hybld/continuum-
> >
> >> working-directory/6/classlib/modules/print/bin/test
> >
> >>
> >
> >>     [exec] clean:
> >
> >>     [exec]    [delete] Deleting 177 files from /home/hybld/continuum-
> >
> >> working-directory/6/classlib/build/classes
> >
> >>     [exec]    [delete] Deleting 13 files from /home/hybld/continuum-
> >
> >> working-directory/6/classlib/modules/regex/bin/test
> >
> >>
> >
> >>     [exec] clean:
> >
> >>     [exec]    [delete] Deleting 230 files from /home/hybld/continuum-
> >
> >> working-directory/6/classlib/build/classes
> >
> >>     [exec]    [delete] Deleting 53 files from /home/hybld/continuum-
> >
> >> working-directory/6/classlib/modules/rmi/bin/test
> >
> >>
> >
> >>     [exec] clean:
> >
> >>     [exec]    [delete] Deleting 428 files from /home/hybld/continuum-
> >
> >> working-directory/6/classlib/build/classes
> >
> >>     [exec]    [delete] Deleting 616 files from /home/hybld/continuum-
> >
> >> working-directory/6/classlib/modules/security/bin/test
> >
> >>
> >
> >>     [exec] clean:
> >
> >>     [exec]    [delete] Deleting 2 files from /home/hybld/continuum-
> >
> >> working-directory/6/classlib/build/classes
> >
> >>
> >
> >>     [exec] clean:
> >
> >>     [exec]    [delete] Deleting 72 files from /home/hybld/continuum-
> >
> >> working-directory/6/classlib/build/classes
> >
> >>     [exec]    [delete] Deleting 53 files from /home/hybld/continuum-
> >
> >> working-directory/6/classlib/modules/sound/bin/test
> >
> >>
> >
> >>     [exec] clean:
> >
> >>     [exec]    [delete] Deleting 74 files from /home/hybld/continuum-
> >
> >> working-directory/6/classlib/build/classes
> >
> >>     [exec]    [delete] Deleting 54 files from /home/hybld/continuum-
> >
> >> working-directory/6/classlib/modules/sql/bin/test
> >
> >>
> >
> >>     [exec] clean:
> >
> >>     [exec]    [delete] Deleting 5 files from /home/hybld/continuum-
> >
> >> working-directory/6/classlib/build/classes
> >
> >>
> >
> >>     [exec] clean:
> >
> >>     [exec]    [delete] Deleting 1591 files from /home/hybld/
> >> continuum-
> >
> >> working-directory/6/classlib/build/classes
> >
> >>     [exec]    [delete] Deleting 1537 files from /home/hybld/
> >> continuum-
> >
> >> working-directory/6/classlib/modules/swing/bin/test
> >
> >>
> >
> >>     [exec] clean:
> >
> >>     [exec]    [delete] Deleting 40 files from /home/hybld/continuum-
> >
> >> working-directory/6/classlib/build/classes
> >
> >>     [exec]    [delete] Deleting 32 files from /home/hybld/continuum-
> >
> >> working-directory/6/classlib/modules/text/bin/test
> >
> >>
> >
> >>     [exec] clean:
> >
> >>
> >
> >> ...
> >
> >>
> >
> >>     [exec]      [echo] Compiling AWT tests
> >
> >>     [exec]     [javac] Compiling 195 source files to
> >
> >> /home/hybld/continuum-working-directory/6/classlib/modules/awt/bin/
> >> test
> >
> >>     [exec]     [javac] Since fork is false, ignoring
> >> memoryMaximumSize
> >
> >> setting
> >
> >>     [exec]     [javac] ----------
> >
> >>     [exec]     [javac] 1. ERROR in /home/hybld/continuum-working-
> >
> >> directory/6/classlib/modules/awt/src/test/api/java/common/java/awt/
> >> print/Bo
> >
> >> okTest.java
> >
> >>     [exec]     [javac]  (at line 18)
> >
> >>     [exec]     [javac]      package java.awt.print;
> >
> >>
> >
> >>     [exec]     [javac] import java.awt.Graphics;
> >
> >>
> >
> >>
> >
> >> ...
> >
> >>
> >
> >>     [exec]     [javac]         };
> >
> >>
> >
> >>     [exec]     [javac]         try {
> >
> >>     [exec]     [javac]             d.setPage(1, p, pf);
> >
> >>     [exec]     [javac]             fail("IndexOutOfBoundsException
> >> was not
> >
> >> thrown"); //$NON-NLS-1$
> >
> >>     [exec]     [javac]         } catch (IndexOutOfBoundsException
> >> ex) {
> >
> >>     [exec]     [javac]             // expected
> >
> >>     [exec]     [javac]         }
> >
> >>
> >
> >>     [exec]     [javac]         try {
> >
> >>
> >
> >> ...
> >
> >>
> >
> >>     [exec]     [javac]             d.setPage(1, null, pf);
> >
> >>     [exec]     [javac]             fail("NullPointerException was not
> >
> >> thrown"); //$NON-NLS-1$
> >
> >>     [exec]     [javac]         } catch (NullPointerException ex) {
> >
> >>     [exec]     [javac]             // expected
> >
> >>     [exec]     [javac]         }
> >
> >>
> >
> >>     [exec]     [javac]         try {
> >
> >>
> >
> >> ...
> >
> >>
> >
> >>     [exec]     [javac]             d.setPage(1, p, null);
> >
> >>     [exec]     [javac]             fail("NullPointerException was not
> >
> >> thrown"); //$NON-NLS-1$
> >
> >>     [exec]     [javac]         } catch (NullPointerException ex) {
> >
> >>     [exec]     [javac]             // expected
> >
> >>     [exec]     [javac]         }
> >
> >>     [exec]     [javac]     }
> >
> >>     [exec]     [javac] }
> >
> >>
> >
> >> ...
> >
> >>
> >
> >>     [exec]     [javac]
> >
> >>
> >> ^^^^^^^^^^^^^^^^^^^^^^^^^^^^^^^^^^^^^^^^^^^^^^^^^^^^^^^^^^^^^^^^^^^^^
> >
> >> ^^^^^^^^^^^^^^^^^^^^^^^^^^^^^^^^^^^^^^^^^^^^^^^^^^^^^^^^^^^^^^^^^^^^^
> >> ^^^^^^
> >
> >> ^^^^^^^^^^^^^^^^^^^^^^^^^^^^^^^^^^^^^^^^^^^^^^^^^^^^^^^^^^^^^^^^^^^^^
> >> ^^^^^^
> >
> >> ^^^^^^^^^^^^^^^^^^^^^^^^^^^^^^^^^^^^^^^^^^^^^^^^^^^^^^^^^^^^^^^^^^^^^
> >> ^^^^^^
> >
> >> ^^^^^^^^^^^^^^^^^^^^^^^^^^^^^^^^^^^^^^^^^^^^^^^^^^^^^^^^^^^^^^^^^^^^^
> >> ^^^^^^
> >
> >> ^^^^^^^^^^^^^^^^^^^^^^^^^^^^^^^^^^^^^^^^^^^^^^^^^^^^^^^^^^^^^^^^^^^^^
> >> ^^^^^^
> >
> >> ^^^^^^^^^^^^^^^^^^^^^^^^^^^^^^^^^^^^^^^^^^^^^^^^^^^^^^^^^^^^^^^^^^^^^
> >> ^^^^^^
> >
> >> ^^^^^^^^^^^^^^^^^^^^^^^^^^^^^^^^^^^^^^^^^^^^^^^^^^^^^^^^^^^^^^^^^^^^^
> >> ^^^^^^
> >
> >> ^^^^^^^^^^^^^^^^^^^^^^^^^^^^^^^^^^^^^^^^^^^^^^^^^^^^^^^^^^^^^^^^^^^^^
> >> ^^^^^^
> >
> >> ^^^^^^^^^^^^^^^^^^^^^^^^^^^^^^^^^^^^^^^^^^^^^^^^^^^^^^^^^^^^^^^^^^^^^
> >> ^^^^^^
> >
> >> ^^^^^^^^^^^^^^^^^^^^^^^^^^^^^^^^^^^^^^^^^^^^^^^^^^^^^^^^^^^^^^^^^^^^^
> >> ^^^^^^
> >
> >> ^^^^^^^^^^^^^^^^^^^^^^^^^^^^^^^^^^^^^^^^^^^^^^^^^^^^^^^^^^^^^^^^^^^^^
> >> ^^^^^^
> >
> >> ^^^^^^^^^^^^^^^^^^^^^^^^^^^^^^^^^^^^^^^^^^^^^^^^^^^^^^^^^^^^^^^^^^^^^
> >> ^^
> >
> >>
> >
> >> ^^^^^^^^^^^^^^^^^^^^^^^^^^^^^^^^^^^^^^^^^^^^^^^^^^^^^^^^^^^^^^^^^^^^^
> >> ^^^^^^
> >
> >> ^^^^^^^^^^^^^^^^^^^^^^^^^^^^^^^^^^^^^^^^^^^^^^^^^^^^^^^^^^^^^^^^^^^^^
> >> ^^^^^^
> >
> >> ^^^^^^^^^^^^^^^^^^^^^^^^^^^^^^^^^^^^^^^^^^^^^^^^^^^^^^^^^^^^^^^^^^^^^
> >> ^^^^^^
> >
> >> ^^^^^^^^^^^^^^^^^^^^^^^^^^^^^^^^^^^^^^^^^^^^^^^^^^^^^^^^^^^^^^^^^^^^^
> >> ^^^^^^
> >
> >> ^^^^^^^^^^^^^^^^^^^^^^^^^^^^^^^^^^^^^^^^^^^^^^^^^^^^^
> >
> >>     [exec]     [javac] Syntax error on token(s), misplaced
> >> construct(s)
> >
> >>     [exec]     [javac] ----------
> >
> >>     [exec]     [javac] 2. ERROR in /home/hybld/continuum-working-
> >
> >> directory/6/classlib/modules/awt/src/test/api/java/common/java/awt/
> >> print/Bo
> >
> >> okTest.java
> >
> >>     [exec]     [javac]  (at line 89)
> >
> >>     [exec]     [javac]      public class BookTest extends TestCase {
> >
> >>     [exec]     [javac]                   ^^^^^^^^
> >
> >>     [exec]     [javac] The type BookTest is already defined
> >
> >>     [exec]     [javac] ----------
> >
> >>     [exec]     [javac] 2 problems (2 errors)
> >
> >>
> >
> >>     [exec] BUILD FAILED
> >
> >>     [exec] /home/hybld/continuum-working-
> >
> >> directory/6/classlib/build.xml:167: The following error occurred
> >> while
> >
> >> executing this line:
> >
> >>     [exec] /home/hybld/continuum-working-directory/6/classlib/make/
> >> build-
> >
> >> test.xml:52: The following error occurred while executing this line:
> >
> >>     [exec] /home/hybld/continuum-working-
> >
> >> directory/6/classlib/make/properties.xml:316: The following error
> >> occurred
> >
> >> while executing this line:
> >
> >>     [exec] /home/hybld/continuum-working-
> >
> >> directory/6/classlib/modules/awt/build.xml:247: Compile failed;
> >> see the
> >
> >> compiler error output for details.
> >
> >>
> >
> >>     [exec] Total time: 1 minute 52 seconds
> >
> >>     [exec] Result: 1
> >
> >>     [echo] Tests.failed is set to true
> >
> >>
> >
> >> japi:
> >
> >>
> >
> >>     [exec] Processing class java.lang,Object:+
> >
> >>     [exec] Processing package
> >
> >> java.lang,:==========================================================
> >> ======
> >
> >> ============+-++++++++++++++++++++++++-
> >
> >> +++++++++++++++++++++++++++++++++++++++++++++++++--^+^+++++++++--++
> >> ++++++++
> >
> >>
> >
> >> ...
> >
> >>
> >
> >>     [exec] Processing package
> >
> >> java.lang.management,:===============================================
> >> ======
> >
> >> =======================++++-+++++++++++
> >
> >>     [exec] Processing package
> >
> >> java.lang.ref,:======================================================
> >> ======
> >
> >> ================+++++
> >
> >>     [exec] Processing package
> >
> >> java.lang.reflect,:==================================================
> >> ======
> >
> >> ====================+++++++++++++++++++++
> >
> >>     [exec] Processing class ,java:
> >
> >>     [exec] Failed to Japize java: java.lang.RuntimeException:
> >
> >> NoClassDefFoundError: java
> >
> >>     [exec] java.lang.RuntimeException: NoClassDefFoundError: java
> >
> >>     [exec]      at net.wuffies.japi.ClassFile.forName
> >> (ClassFile.java:163)
> >
> >>     [exec]      at
> >
> >> net.wuffies.japi.Japize.getClassWrapper(Japize.java:1425)
> >
> >>     [exec]      at net.wuffies.japi.Japize.japizeClass(Japize.java:
> >> 748)
> >
> >>     [exec]      at net.wuffies.japi.Japize.processClass
> >> (Japize.java:516)
> >
> >>
> >
> >> ...
> >
> >>
> >
> >>     [exec]      at net.wuffies.japi.Japize.doJapize(Japize.java:443)
> >
> >>     [exec]      at net.wuffies.japi.Japize.main(Japize.java:316)
> >
> >>
> >
> >>     [exec] Processing class ,javax:
> >
> >>     [exec] Failed to Japize javax: java.lang.RuntimeException:
> >
> >> NoClassDefFoundError: javax
> >
> >>     [exec] java.lang.RuntimeException: NoClassDefFoundError: javax
> >
> >>     [exec]      at net.wuffies.japi.ClassFile.forName
> >> (ClassFile.java:163)
> >
> >>     [exec]      at
> >
> >> net.wuffies.japi.Japize.getClassWrapper(Japize.java:1425)
> >
> >>     [exec]      at net.wuffies.japi.Japize.japizeClass(Japize.java:
> >> 748)
> >
> >>     [exec]      at net.wuffies.japi.Japize.processClass
> >> (Japize.java:516)
> >
> >>
> >
> >> ...
> >
> >>
> >
> >>     [exec]      at net.wuffies.japi.Japize.doJapize(Japize.java:443)
> >
> >>     [exec]      at net.wuffies.japi.Japize.main(Japize.java:316)
> >
> >>
> >
> >>     [exec] Processing class ,org:
> >
> >>     [exec] Failed to Japize org: java.lang.RuntimeException:
> >
> >> NoClassDefFoundError: org
> >
> >>     [exec] java.lang.RuntimeException: NoClassDefFoundError: org
> >
> >>     [exec]      at net.wuffies.japi.ClassFile.forName
> >> (ClassFile.java:163)
> >
> >>     [exec]      at
> >
> >> net.wuffies.japi.Japize.getClassWrapper(Japize.java:1425)
> >
> >>     [exec]      at net.wuffies.japi.Japize.japizeClass(Japize.java:
> >> 748)
> >
> >>     [exec]      at net.wuffies.japi.Japize.processClass
> >> (Japize.java:516)
> >
> >>
>
>


-- 
Stepan Mishura
Intel Enterprise Solutions Software Division

Mime
  • Unnamed multipart/alternative (inline, None, 0 bytes)
View raw message